id,beer_name,style_id,varia,image,ibu,abv,ebc,score,zoet,mout,alcohol,fruitig,bitter,hoppig,zuur
1,Duvel,5,,duvel,32,8.5,6,3.9,0.5,1,3,2,2.5,3,0.5
2,Stella Artois,0,,stella,21,5.2,6,2.7,0.5,1,2,1.5,2,0.5,0.5
3,Cornet,5,,,20,8.5,8,3.4,2,1,5,3,3,3,0.5
4,Grimbergen,3,Abdijbier,grimbergen-blond,18,6.7,12,3.2,1.5,1,2.5,2,1.5,1.5,1.5
5,Jupiler,0,,,18,5.2,6,2.6,1,1.5,2,1.5,2,1,0.5
6,Rochefort 8,7,Trappist,rochefort-8,8,9.2,45,4.1,1.5,3,4.5,2.5,3,3,0
7,Leffe Blond,3,Abdijbier,leffe-blond,12,6.6,14,3.5,2.5,2,2,1.5,1.5,1,0.5
8,Chimay Bleue,7,Trappist,chimay-bleue,14,9.0,60,4.1,1.5,3,5,2.5,3,2,0
9,Cristal Alken,0,,,23,4.8,5,2.6,1.5,1,2,1.5,2,1,0.5
10,Maes,0,,,22,5.2,7,2.3,1.5,1.5,2.5,2,2,1,0.5
11,Hoegaarden,1,,hoegaarden,5,4.9,6,3.6,1.5,1,2.5,3,1.5,2,0.5
12,Saison Dupont,2,,,31,6.5,9,3.9,1,1,3.5,3,4,2.5,0.5
13,Affligem Blond,3,Abdijbier,,14,6.8,11,3.4,2,1,4,5,2,1,3
14,Keizer Karel Ommegang,3,,,20,8.0,6,3.2,1.5,1,3.5,2.5,2.5,2.5,1
15,La Chouffe,3,,chouffe-blond,13,8.0,13,3.9,2,0.5,3,2.5,2,2,0.5
16,Duvel Tripel Hop,4,,,28,9.5,6,3.6,1,1,5,3,4.5,3.5,1
17,Hopus,4,,,20,8.3,8,3.4,1,2,4.5,2.5,4,3,0
18,Vedett IPA,4,,,25,6.0,14,3.4,1,2,3.5,2,4,4,1
19,Delirium Tremens,5,,,20,9.0,9,3.8,1.5,1,3,2.5,2,1.5,0.5
20,Omer,5,,,27,8.0,8,3.5,1,1,3.5,2.5,3,2.5,0.5
21,Westmalle Tripel,5,Trappist,,39,9.5,10,4,0.5,1,4,3,3.5,2,0.5
22,Leffe Bruin,6,Abdijbier,leffe-bruin,23,6.5,59,3.6,1.5,2.5,3.5,0.5,2,2,0.5
23,Pauwel Kwak,6,,,8,8.4,33,3.7,3,3,3.5,2.5,2,1,0.5
24,Gulden Draak,7,,,15,10.5,55,3.9,1.5,4,6,3.5,3.5,2,0
25,Westvleteren 12,7,Trappist,,29,10.2,61,4.4,2.5,3,6,3.5,3,2,0.5
26,Oude Geuze Boon,10,,,3,7.0,12,3.6,0.5,1,3,2,2.5,2,4
27,Kasteel Rouge,9,,kasteel-rouge,4,8.0,43,3.6,4.5,1,3,4.5,1,0,2
28,Jupiler 0.0,8,,,20,0,7,1.9,2,1,0,2.5,2,2,1
29,Tripel Karmeliet,5,,tripel-karmeliet,9,8.4,8,4.1,1.5,0,3.5,2,2,1.5,0.5