aiodns==2.0.0 \
    --hash=sha256:815fdef4607474295d68da46978a54481dd1e7be153c7d60f9e72773cd38d77d \
    --hash=sha256:aaa5ac584f40fe778013df0aa6544bf157799bd3f608364b451840ed2c8688de \
    # via -r production.in
aiohttp==3.6.2 \
    --hash=sha256:1e984191d1ec186881ffaed4581092ba04f7c61582a177b187d3a2f07ed9719e \
    --hash=sha256:259ab809ff0727d0e834ac5e8a283dc5e3e0ecc30c4d80b3cd17a4139ce1f326 \
    --hash=sha256:2f4d1a4fdce595c947162333353d4a44952a724fba9ca3205a3df99a33d1307a \
    --hash=sha256:32e5f3b7e511aa850829fbe5aa32eb455e5534eaa4b1ce93231d00e2f76e5654 \
    --hash=sha256:344c780466b73095a72c616fac5ea9c4665add7fc129f285fbdbca3cccf4612a \
    --hash=sha256:460bd4237d2dbecc3b5ed57e122992f60188afe46e7319116da5eb8a9dfedba4 \
    --hash=sha256:4c6efd824d44ae697814a2a85604d8e992b875462c6655da161ff18fd4f29f17 \
    --hash=sha256:50aaad128e6ac62e7bf7bd1f0c0a24bc968a0c0590a726d5a955af193544bcec \
    --hash=sha256:6206a135d072f88da3e71cc501c59d5abffa9d0bb43269a6dcd28d66bfafdbdd \
    --hash=sha256:65f31b622af739a802ca6fd1a3076fd0ae523f8485c52924a89561ba10c49b48 \
    --hash=sha256:ae55bac364c405caa23a4f2d6cfecc6a0daada500274ffca4a9230e7129eac59 \
    --hash=sha256:b778ce0c909a2653741cb4b1ac7015b5c130ab9c897611df43ae6a58523cb965 \
    # via -r production.in
async-timeout==3.0.1 \
    --hash=sha256:0c3c816a028d47f659d6ff5c745cb2acf1f966da1fe5c19c77a70282b25f4c5f \
    --hash=sha256:4291ca197d287d274d0b6cb5d6f8f8f82d434ed288f962539ff18cc9012f9ea3 \
    # via aiohttp
attrs==19.3.0 \
    --hash=sha256:08a96c641c3a74e44eb59afb61a24f2cb9f4d7188748e76ba4bb5edfa3cb7d1c \
    --hash=sha256:f7b7ce16570fe9965acd6d30101a28f62fb4a7f9e926b3bbc9b61f8b04247e72 \
    # via aiohttp
cchardet==2.1.6 \
    --hash=sha256:0f6e4e464e332da776b9c1a34e4e83b6301d38c2724efc93848c46ade66d02bb \
    --hash=sha256:217a7008bd399bdb61f6a0a2570acc5c3a9f96140e0a0d089b9e748c4d4e4c4e \
    --hash=sha256:27b0f23088873d1dd36d2c8a2e45c9167e312e1aac7e4baeb47f7428a2669638 \
    --hash=sha256:2a958fb093f69ee5f16be7a1aee5122e07aff4350fa4dc9b953b87c34468e605 \
    --hash=sha256:2aa1b008965c703ad6597361b0f6d427c8971fe94a2c99ec3724c228ae50d6a6 \
    --hash=sha256:2c05b66b12f9ab0493c5ffb666036fd8c9004a9cc9d5a9264dc24738b50ab8c3 \
    --hash=sha256:4096759825a130cb27a58ddf6d58e10abdd0127d29fbf53fde26df7ad879737b \
    --hash=sha256:40c199f9c0569ac479fae7c4e12d2e16fc1e8237836b928474fdd228b8d11477 \
    --hash=sha256:4486f6e5bdf06f0081d13832f2a061d9e90597eb02093fda9d37e3985e3b2ef2 \
    --hash=sha256:54d2653520237ebbd2928f2c0f2eb7c616ee2b5194d73d945060cd54a7846b64 \
    --hash=sha256:5e38cfad9d3ca0f571c4352e9ca0f5ab718508f492a37d3236ae70810140e250 \
    --hash=sha256:68409e00d75ff13dd7a192ec49559f5527ee8959a51a9f4dd7b168df972b4d44 \
    --hash=sha256:79b0e113144c2ef0050bc9fe647c7657c5298f3012ecd8937d930b24ddd61404 \
    --hash=sha256:7a2d98df461d3f36b403fdd8d7890c823ed05bd98eb074412ed56fbfedb94751 \
    --hash=sha256:7bba1cbb4358dc9a2d2da00f4b38b159a5483d2f3b1d698a7c2cae518f955170 \
    --hash=sha256:84d2ce838cf3c2fe7f0517941702d42f7e598e5173632ec47a113cd521669b98 \
    --hash=sha256:8b1d02c99f6444c63336a76638741eaf4ac4005b454e3b8252a40074bf0d84a1 \
    --hash=sha256:8f7ade2578b2326a0a554c03f60c8d079331220179a592e83e143c9556b7f5b2 \
    --hash=sha256:953fe382304b19f5aa8fc2da4b092a3bb58a477d33af4def4b81abdce4c9288c \
    --hash=sha256:acc96b4a8f756af289fa90ffa67ddef57401d99131e51e71872e3609483941ce \
    --hash=sha256:af284494ea6c40f9613b4d939abe585eb9290cb92037eab66122c93190fcb338 \
    --hash=sha256:b76afb2059ad69eab576949980a17413c1e9e5a5624abf9e43542d8853f146b3 \
    --hash=sha256:ccb9f6f06265382028468b47e726f2d42539256fb498d1b0e473c39037b42b8a \
    --hash=sha256:cf134e1cfb0c53f08abb1ab9158a7e7f859c3ddb451d5fe535a2cc5f2958a688 \
    --hash=sha256:dff9480d9b6260f59ad10e1cec5be13905be5da88a4a2bd5a5bd4d49c49c4a05 \
    --hash=sha256:e27771798c8ad50df1375e762d59369354af94eb8ac21eca5bfd1eeef589f545 \
    --hash=sha256:f245f045054e8d6dab2a0e366d3c74f3a47fb7dec2595ae2035b234b1a829c7a \
    --hash=sha256:f5c94994d876d8709847c3a92643309d716f43716580a2e5831262366a9ee8b6 \
    --hash=sha256:fd16f57ce42a72397cd9fe38977fc809eb02172731cb354572f28a6d8e4cf322 \
    # via -r production.in
cffi==1.14.0 \
    --hash=sha256:001bf3242a1bb04d985d63e138230802c6c8d4db3668fb545fb5005ddf5bb5ff \
    --hash=sha256:00789914be39dffba161cfc5be31b55775de5ba2235fe49aa28c148236c4e06b \
    --hash=sha256:028a579fc9aed3af38f4892bdcc7390508adabc30c6af4a6e4f611b0c680e6ac \
    --hash=sha256:14491a910663bf9f13ddf2bc8f60562d6bc5315c1f09c704937ef17293fb85b0 \
    --hash=sha256:1cae98a7054b5c9391eb3249b86e0e99ab1e02bb0cc0575da191aedadbdf4384 \
    --hash=sha256:2089ed025da3919d2e75a4d963d008330c96751127dd6f73c8dc0c65041b4c26 \
    --hash=sha256:2d384f4a127a15ba701207f7639d94106693b6cd64173d6c8988e2c25f3ac2b6 \
    --hash=sha256:337d448e5a725bba2d8293c48d9353fc68d0e9e4088d62a9571def317797522b \
    --hash=sha256:399aed636c7d3749bbed55bc907c3288cb43c65c4389964ad5ff849b6370603e \
    --hash=sha256:3b911c2dbd4f423b4c4fcca138cadde747abdb20d196c4a48708b8a2d32b16dd \
    --hash=sha256:3d311bcc4a41408cf5854f06ef2c5cab88f9fded37a3b95936c9879c1640d4c2 \
    --hash=sha256:62ae9af2d069ea2698bf536dcfe1e4eed9090211dbaafeeedf5cb6c41b352f66 \
    --hash=sha256:66e41db66b47d0d8672d8ed2708ba91b2f2524ece3dee48b5dfb36be8c2f21dc \
    --hash=sha256:675686925a9fb403edba0114db74e741d8181683dcf216be697d208857e04ca8 \
    --hash=sha256:7e63cbcf2429a8dbfe48dcc2322d5f2220b77b2e17b7ba023d6166d84655da55 \
    --hash=sha256:8a6c688fefb4e1cd56feb6c511984a6c4f7ec7d2a1ff31a10254f3c817054ae4 \
    --hash=sha256:8c0ffc886aea5df6a1762d0019e9cb05f825d0eec1f520c51be9d198701daee5 \
    --hash=sha256:95cd16d3dee553f882540c1ffe331d085c9e629499ceadfbda4d4fde635f4b7d \
    --hash=sha256:99f748a7e71ff382613b4e1acc0ac83bf7ad167fb3802e35e90d9763daba4d78 \
    --hash=sha256:b8c78301cefcf5fd914aad35d3c04c2b21ce8629b5e4f4e45ae6812e461910fa \
    --hash=sha256:c420917b188a5582a56d8b93bdd8e0f6eca08c84ff623a4c16e809152cd35793 \
    --hash=sha256:c43866529f2f06fe0edc6246eb4faa34f03fe88b64a0a9a942561c8e22f4b71f \
    --hash=sha256:cab50b8c2250b46fe738c77dbd25ce017d5e6fb35d3407606e7a4180656a5a6a \
    --hash=sha256:cef128cb4d5e0b3493f058f10ce32365972c554572ff821e175dbc6f8ff6924f \
    --hash=sha256:cf16e3cf6c0a5fdd9bc10c21687e19d29ad1fe863372b5543deaec1039581a30 \
    --hash=sha256:e56c744aa6ff427a607763346e4170629caf7e48ead6921745986db3692f987f \
    --hash=sha256:e577934fc5f8779c554639376beeaa5657d54349096ef24abe8c74c5d9c117c3 \
    --hash=sha256:f2b0fa0c01d8a0c7483afd9f31d7ecf2d71760ca24499c8697aeb5ca37dc090c \
    # via pycares
chardet==3.0.4 \
    --hash=sha256:84ab92ed1c4d4f16916e05906b6b75a6c0fb5db821cc65e70cbd64a3e2a5eaae \
    --hash=sha256:fc323ffcaeaed0e0a02bf4d117757b98aed530d9ed4531e3e15460124c106691 \
    # via aiohttp
click==7.1.1 \
    --hash=sha256:8a18b4ea89d8820c5d0c7da8a64b2c324b4dabb695804dbfea19b9be9d88c0cc \
    --hash=sha256:e345d143d80bf5ee7534056164e5e112ea5e22716bbb1ce727941f4c8b471b9a \
    # via -r production.in
commonmark==0.9.1 \
    --hash=sha256:452f9dc859be7f06631ddcb328b6919c67984aca654e5fefb3914d54691aed60 \
    --hash=sha256:da2f38c92590f83de410ba1a3cbceafbc74fee9def35f9251ba9a971d6d66fd9 \
    # via -r production.in
gitdb==4.0.4 \
    --hash=sha256:6f0ecd46f99bb4874e5678d628c3a198e2b4ef38daea2756a2bfd8df7dd5c1a5 \
    --hash=sha256:ba1132c0912e8c917aa8aa990bee26315064c7b7f171ceaaac0afeb1dc656c6a \
    # via gitpython
gitpython==3.1.1 \
    --hash=sha256:6d4f10e2aaad1864bb0f17ec06a2c2831534140e5883c350d58b4e85189dab74 \
    --hash=sha256:71b8dad7409efbdae4930f2b0b646aaeccce292484ffa0bc74f1195582578b3d \
    # via -r production.in
idna==2.9 \
    --hash=sha256:7588d1c14ae4c77d74036e8c22ff447b26d0fde8f007354fd48a7814db15b7cb \
    --hash=sha256:a068a21ceac8a4d63dbfd964670474107f541babbd2250d61922f029858365fa \
    # via yarl
multidict==4.7.5 \
    --hash=sha256:317f96bc0950d249e96d8d29ab556d01dd38888fbe68324f46fd834b430169f1 \
    --hash=sha256:42f56542166040b4474c0c608ed051732033cd821126493cf25b6c276df7dd35 \
    --hash=sha256:4b7df040fb5fe826d689204f9b544af469593fb3ff3a069a6ad3409f742f5928 \
    --hash=sha256:544fae9261232a97102e27a926019100a9db75bec7b37feedd74b3aa82f29969 \
    --hash=sha256:620b37c3fea181dab09267cd5a84b0f23fa043beb8bc50d8474dd9694de1fa6e \
    --hash=sha256:6e6fef114741c4d7ca46da8449038ec8b1e880bbe68674c01ceeb1ac8a648e78 \
    --hash=sha256:7774e9f6c9af3f12f296131453f7b81dabb7ebdb948483362f5afcaac8a826f1 \
    --hash=sha256:85cb26c38c96f76b7ff38b86c9d560dea10cf3459bb5f4caf72fc1bb932c7136 \
    --hash=sha256:a326f4240123a2ac66bb163eeba99578e9d63a8654a59f4688a79198f9aa10f8 \
    --hash=sha256:ae402f43604e3b2bc41e8ea8b8526c7fa7139ed76b0d64fc48e28125925275b2 \
    --hash=sha256:aee283c49601fa4c13adc64c09c978838a7e812f85377ae130a24d7198c0331e \
    --hash=sha256:b51249fdd2923739cd3efc95a3d6c363b67bbf779208e9f37fd5e68540d1a4d4 \
    --hash=sha256:bb519becc46275c594410c6c28a8a0adc66fe24fef154a9addea54c1adb006f5 \
    --hash=sha256:c2c37185fb0af79d5c117b8d2764f4321eeb12ba8c141a95d0aa8c2c1d0a11dd \
    --hash=sha256:dc561313279f9d05a3d0ffa89cd15ae477528ea37aa9795c4654588a3287a9ab \
    --hash=sha256:e439c9a10a95cb32abd708bb8be83b2134fa93790a4fb0535ca36db3dda94d20 \
    --hash=sha256:fc3b4adc2ee8474cb3cd2a155305d5f8eda0a9c91320f83e55748e1fcb68f8e3 \
    # via aiohttp, yarl
pendulum==2.1.0 \
    --hash=sha256:093cab342e10516660e64b935a6da1a043e0286de36cc229fb48471415981ffe \
    --hash=sha256:0cbbd4f30c69a283690d9ed8e58e44a990e067e59ee05b5ef55d022b38659aeb \
    --hash=sha256:2788945a0111d5325fd27ae3e3b18b741e440d20bdb7d4ea22fce7c9a4fbbf40 \
    --hash=sha256:4420e058110740a8193fb0709350dfc6ac790a99c345fc4e92e24df0f834ddcb \
    --hash=sha256:575934b65b298eeb99c5a5b1673c945fc5c99e2b56caff772a91bc4b1eba7b82 \
    --hash=sha256:6cf0f876cd088ee1578266f4231121376747aa90c3ed3b8e212a8344a9920061 \
    --hash=sha256:70007aebc4494163f8705909a1996ce21ab853801b57fba4c2dd53c3df5c38f0 \
    --hash=sha256:701127e1f0ff7c253cc0c07f29becc5f9210547914e0bbe59ffd9fa064d7c3c8 \
    --hash=sha256:75a62e3f98499283fafe8ef4b44f81052e84825b00a0b64609dd8a06985382b9 \
    --hash=sha256:816e01dcb0ba4ffcf2ceaafe4d644174fea680361e909f6f8ba0a4fdb2ccae24 \
    --hash=sha256:9eda38ff65b1f297d860d3f562480e048673fb4b81fdd5c8c55decb519b97ed2 \
    --hash=sha256:a79a72a7fd1092a7c69ddd8580a0be5365ded40c9f9c865623c7665742e3b888 \
    --hash=sha256:aa13ddea12fd871d3191f633f08090b91ea2e80fb0ed50a7a149add7f680b12d \
    --hash=sha256:aa560bd39d94f3889646422f1e65b8dfd025bf6288d43e5c2e31d4f972aaf2e4 \
    --hash=sha256:ac3c6a992beeb4c9bd90c317a1bb2a6cba159b49a49b6dd3c86b5bacb86f3d50 \
    --hash=sha256:d42d1e870541eeaf3fe0500aac0c76a85bd4bd53ebed74f9a7daf8f01ac77374 \
    --hash=sha256:eb7e349bb2d1b2b418d094e2179d6768561e8242fd8cb640b5aaba735f3e91d1 \
    --hash=sha256:edd00e6b43698762e10bfda508cc9c06bad88c0703a9b37e412aec1189e06e23 \
    --hash=sha256:ff7f3420de0c0cf21c1fc813d581fcfa4a1fb6d87f09485880b3e1204eb9cdd7 \
    # via -r production.in
pycares==3.1.1 \
    --hash=sha256:050f00b39ed77ea8a4e555f09417d4b1a6b5baa24bb9531a3e15d003d2319b3f \
    --hash=sha256:0a24d2e580a8eb567140d7b69f12cb7de90c836bd7b6488ec69394d308605ac3 \
    --hash=sha256:0c5bd1f6f885a219d5e972788d6eef7b8043b55c3375a845e5399638436e0bba \
    --hash=sha256:11c628402cc8fc8ef461076d4e47f88afc1f8609989ebbff0dbffcd54c97239f \
    --hash=sha256:18dfd4fd300f570d6c4536c1d987b7b7673b2a9d14346592c5d6ed716df0d104 \
    --hash=sha256:1917b82494907a4a342db420bc4dd5bac355a5fa3984c35ba9bf51422b020b48 \
    --hash=sha256:1b90fa00a89564df059fb18e796458864cc4e00cb55e364dbf921997266b7c55 \
    --hash=sha256:1d8d177c40567de78108a7835170f570ab04f09084bfd32df9919c0eaec47aa1 \
    --hash=sha256:236286f81664658b32c141c8e79d20afc3d54f6e2e49dfc8b702026be7265855 \
    --hash=sha256:2e4f74677542737fb5af4ea9a2e415ec5ab31aa67e7b8c3c969fdb15c069f679 \
    --hash=sha256:48a7750f04e69e1f304f4332b755728067e7c4b1abe2760bba1cacd9ff7a847a \
    --hash=sha256:7d86e62b700b21401ffe7fd1bbfe91e08489416fecae99c6570ab023c6896022 \
    --hash=sha256:7e2d7effd08d2e5a3cb95d98a7286ebab71ab2fbce84fa93cc2dd56caf7240dd \
    --hash=sha256:81edb016d9e43dde7473bc3999c29cdfee3a6b67308fed1ea21049f458e83ae0 \
    --hash=sha256:96c90e11b4a4c7c0b8ff5aaaae969c5035493136586043ff301979aae0623941 \
    --hash=sha256:9a0a1845f8cb2e62332bca0aaa9ad5494603ac43fb60d510a61d5b5b170d7216 \
    --hash=sha256:a05bbfdfd41f8410a905a818f329afe7510cbd9ee65c60f8860a72b6c64ce5dc \
    --hash=sha256:a5089fd660f0b0d228b14cdaa110d0d311edfa5a63f800618dbf1321dcaef66b \
    --hash=sha256:c457a709e6f2befea7e2996c991eda6d79705dd075f6521593ba6ebc1485b811 \
    --hash=sha256:c5cb72644b04e5e5abfb1e10a0e7eb75da6684ea0e60871652f348e412cf3b11 \
    --hash=sha256:cce46dd4717debfd2aab79d6d7f0cbdf6b1e982dc4d9bebad81658d59ede07c2 \
    --hash=sha256:cfdd1f90bcf373b00f4b2c55ea47868616fe2f779f792fc913fa82a3d64ffe43 \
    --hash=sha256:d88a279cbc5af613f73e86e19b3f63850f7a2e2736e249c51995dedcc830b1bb \
    --hash=sha256:eba9a9227438da5e78fc8eee32f32eb35d9a50cf0a0bd937eb6275c7cc3015fe \
    --hash=sha256:eee7b6a5f5b5af050cb7d66ab28179287b416f06d15a8974ac831437fec51336 \
    --hash=sha256:f41ac1c858687e53242828c9f59c2e7b0b95dbcd5bdd09c7e5d3c48b0f89a25a \
    --hash=sha256:f8deaefefc3a589058df1b177275f79233e8b0eeee6734cf4336d80164ecd022 \
    --hash=sha256:fa78e919f3bd7d6d075db262aa41079b4c02da315c6043c6f43881e2ebcdd623 \
    --hash=sha256:fadb97d2e02dabdc15a0091591a972a938850d79ddde23d385d813c1731983f0 \
    # via aiodns
pycparser==2.20 \
    --hash=sha256:2d475327684562c3a96cc71adf7dc8c4f0565175cf86b6d7a404ff4c771f15f0 \
    --hash=sha256:7582ad22678f0fcd81102833f60ef8d0e57288b6b5fb00323d101be910e35705 \
    # via cffi
pydantic==1.5.1 \
    --hash=sha256:0a1cdf24e567d42dc762d3fed399bd211a13db2e8462af9dfa93b34c41648efb \
    --hash=sha256:2007eb062ed0e57875ce8ead12760a6e44bf5836e6a1a7ea81d71eeecf3ede0f \
    --hash=sha256:20a15a303ce1e4d831b4e79c17a4a29cb6740b12524f5bba3ea363bff65732bc \
    --hash=sha256:2a6904e9f18dea58f76f16b95cba6a2f20b72d787abd84ecd67ebc526e61dce6 \
    --hash=sha256:3714a4056f5bdbecf3a41e0706ec9b228c9513eee2ad884dc2c568c4dfa540e9 \
    --hash=sha256:473101121b1bd454c8effc9fe66d54812fdc128184d9015c5aaa0d4e58a6d338 \
    --hash=sha256:68dece67bff2b3a5cc188258e46b49f676a722304f1c6148ae08e9291e284d98 \
    --hash=sha256:70f27d2f0268f490fe3de0a9b6fca7b7492b8fd6623f9fecd25b221ebee385e3 \
    --hash=sha256:8433dbb87246c0f562af75d00fa80155b74e4f6924b0db6a2078a3cd2f11c6c4 \
    --hash=sha256:8be325fc9da897029ee48d1b5e40df817d97fe969f3ac3fd2434ba7e198c55d5 \
    --hash=sha256:93b9f265329d9827f39f0fca68f5d72cc8321881cdc519a1304fa73b9f8a75bd \
    --hash=sha256:9be755919258d5d168aeffbe913ed6e8bd562e018df7724b68cabdee3371e331 \
    --hash=sha256:ab863853cb502480b118187d670f753be65ec144e1654924bec33d63bc8b3ce2 \
    --hash=sha256:b96ce81c4b5ca62ab81181212edfd057beaa41411cd9700fbcb48a6ba6564b4e \
    --hash=sha256:da8099fca5ee339d5572cfa8af12cf0856ae993406f0b1eb9bb38c8a660e7416 \
    --hash=sha256:e2c753d355126ddd1eefeb167fa61c7037ecd30b98e7ebecdc0d1da463b4ea09 \
    --hash=sha256:f0018613c7a0d19df3240c2a913849786f21b6539b9f23d85ce4067489dfacfa \
    # via -r production.in
python-dateutil==2.8.1 \
    --hash=sha256:73ebfe9dbf22e832286dafa60473e4cd239f8592f699aa5adaf10050e6e1823c \
    --hash=sha256:75bb3f31ea686f1197762692a9ee6a7550b59fc6ca3a1f4b5d7e32fb98e2da2a \
    # via pendulum
pytzdata==2019.3 \
    --hash=sha256:84c52b9a47d097fcd483f047a544979de6c3a86e94c845e3569e9f8acd0fa071 \
    --hash=sha256:fac06f7cdfa903188dc4848c655e4adaee67ee0f2fe08e7daf815cf2a761ee5e \
    # via pendulum
ruamel.yaml.clib==0.2.0 \
    --hash=sha256:1e77424825caba5553bbade750cec2277ef130647d685c2b38f68bc03453bac6 \
    --hash=sha256:392b7c371312abf27fb549ec2d5e0092f7ef6e6c9f767bfb13e83cb903aca0fd \
    --hash=sha256:4d55386129291b96483edcb93b381470f7cd69f97585829b048a3d758d31210a \
    --hash=sha256:550168c02d8de52ee58c3d8a8193d5a8a9491a5e7b2462d27ac5bf63717574c9 \
    --hash=sha256:57933a6986a3036257ad7bf283529e7c19c2810ff24c86f4a0cfeb49d2099919 \
    --hash=sha256:615b0396a7fad02d1f9a0dcf9f01202bf9caefee6265198f252c865f4227fcc6 \
    --hash=sha256:77556a7aa190be9a2bd83b7ee075d3df5f3c5016d395613671487e79b082d784 \
    --hash=sha256:7aee724e1ff424757b5bd8f6c5bbdb033a570b2b4683b17ace4dbe61a99a657b \
    --hash=sha256:8073c8b92b06b572e4057b583c3d01674ceaf32167801fe545a087d7a1e8bf52 \
    --hash=sha256:9c6d040d0396c28d3eaaa6cb20152cb3b2f15adf35a0304f4f40a3cf9f1d2448 \
    --hash=sha256:a0ff786d2a7dbe55f9544b3f6ebbcc495d7e730df92a08434604f6f470b899c5 \
    --hash=sha256:b1b7fcee6aedcdc7e62c3a73f238b3d080c7ba6650cd808bce8d7761ec484070 \
    --hash=sha256:b66832ea8077d9b3f6e311c4a53d06273db5dc2db6e8a908550f3c14d67e718c \
    --hash=sha256:be018933c2f4ee7de55e7bd7d0d801b3dfb09d21dad0cce8a97995fd3e44be30 \
    --hash=sha256:d0d3ac228c9bbab08134b4004d748cf9f8743504875b3603b3afbb97e3472947 \
    --hash=sha256:d10e9dd744cf85c219bf747c75194b624cc7a94f0c80ead624b06bfa9f61d3bc \
    --hash=sha256:ea4362548ee0cbc266949d8a441238d9ad3600ca9910c3fe4e82ee3a50706973 \
    --hash=sha256:ed5b3698a2bb241b7f5cbbe277eaa7fe48b07a58784fba4f75224fd066d253ad \
    --hash=sha256:f9dcc1ae73f36e8059589b601e8e4776b9976effd76c21ad6a855a74318efd6e \
    # via ruamel.yaml
ruamel.yaml==0.16.10 \
    --hash=sha256:0962fd7999e064c4865f96fb1e23079075f4a2a14849bcdc5cdba53a24f9759b \
    --hash=sha256:099c644a778bf72ffa00524f78dd0b6476bca94a1da344130f4bf3381ce5b954 \
    # via -r production.in
six==1.14.0 \
    --hash=sha256:236bdbdce46e6e6a3d61a337c0f8b763ca1e8717c03b369e87a7ec7ce1319c0a \
    --hash=sha256:8f3cd2e254d8f793e7f3d6d9df77b92252b52637291d0f0da013c76ea2724b6c \
    # via python-dateutil
smmap==3.0.2 \
    --hash=sha256:52ea78b3e708d2c2b0cfe93b6fc3fbeec53db913345c26be6ed84c11ed8bebc1 \
    --hash=sha256:b46d3fc69ba5f367df96d91f8271e8ad667a198d5a28e215a6c3d9acd133a911 \
    # via gitdb
ujson==2.0.3 \
    --hash=sha256:0c23f21e8d2b60efab57bc6ce9d1fb7c4e96f4bfefbf5a6043a3f3309e2a738a \
    --hash=sha256:2ab88e330405315512afe9276f29a60e9b3439187b273665630a57ed7fe1d936 \
    --hash=sha256:3d1f4705a4ec1e48ff383a4d92299d8ec25e9a8158bcea619912440948117634 \
    --hash=sha256:6217c63a36e9b26e9271e686d212397ce7fb04c07d85509dd4e2ed73493320f8 \
    --hash=sha256:7ae13733d9467d16ccac2f38212cdee841b49ae927085c533425be9076b0bc9d \
    --hash=sha256:bd2deffc983827510e5145fb66e4cc0f577480c62fe0b4882139f8f7d27ae9a3 \
    --hash=sha256:c8369ef49169804944e920c427e350182e33756422b69989c55608fc28bebf98 \
    # via -r production.in
yarl==1.4.2 \
    --hash=sha256:0c2ab325d33f1b824734b3ef51d4d54a54e0e7a23d13b86974507602334c2cce \
    --hash=sha256:0ca2f395591bbd85ddd50a82eb1fde9c1066fafe888c5c7cc1d810cf03fd3cc6 \
    --hash=sha256:2098a4b4b9d75ee352807a95cdf5f10180db903bc5b7270715c6bbe2551f64ce \
    --hash=sha256:25e66e5e2007c7a39541ca13b559cd8ebc2ad8fe00ea94a2aad28a9b1e44e5ae \
    --hash=sha256:26d7c90cb04dee1665282a5d1a998defc1a9e012fdca0f33396f81508f49696d \
    --hash=sha256:308b98b0c8cd1dfef1a0311dc5e38ae8f9b58349226aa0533f15a16717ad702f \
    --hash=sha256:3ce3d4f7c6b69c4e4f0704b32eca8123b9c58ae91af740481aa57d7857b5e41b \
    --hash=sha256:58cd9c469eced558cd81aa3f484b2924e8897049e06889e8ff2510435b7ef74b \
    --hash=sha256:5b10eb0e7f044cf0b035112446b26a3a2946bca9d7d7edb5e54a2ad2f6652abb \
    --hash=sha256:6faa19d3824c21bcbfdfce5171e193c8b4ddafdf0ac3f129ccf0cdfcb083e462 \
    --hash=sha256:944494be42fa630134bf907714d40207e646fd5a94423c90d5b514f7b0713fea \
    --hash=sha256:a161de7e50224e8e3de6e184707476b5a989037dcb24292b391a3d66ff158e70 \
    --hash=sha256:a4844ebb2be14768f7994f2017f70aca39d658a96c786211be5ddbe1c68794c1 \
    --hash=sha256:c2b509ac3d4b988ae8769901c66345425e361d518aecbe4acbfc2567e416626a \
    --hash=sha256:c9959d49a77b0e07559e579f38b2f3711c2b8716b8410b320bf9713013215a1b \
    --hash=sha256:d8cdee92bc930d8b09d8bd2043cedd544d9c8bd7436a77678dd602467a993080 \
    --hash=sha256:e15199cdb423316e15f108f51249e44eb156ae5dba232cb73be555324a1d49c2 \
    # via -r production.in, aiohttp
