^C:\USERS\MARKO\SOURCE\REPOS\PKP_PLUGIN\PKP_PLUGIN\TEHNICNIDOLGPACKAGE.VSCT
C:\USERS\MARKO\SOURCE\REPOS\PKP_PLUGIN\PKP_PLUGIN\TEHNICNIDOLGPACKAGE.VSCT
C:\USERS\MARKO\SOURCE\REPOS\PKP_PLUGIN\PACKAGES\MICROSOFT.VSSDK.BUILDTOOLS.15.8.3253\TOOLS\VSSDK\INC\VSSHLIDS.H
C:\USERS\MARKO\SOURCE\REPOS\PKP_PLUGIN\PKP_PLUGIN\RESOURCES\TEHNICNIDOLG.PNG
C:\USERS\MARKO\SOURCE\REPOS\PKP_PLUGIN\PACKAGES\MICROSOFT.VSSDK.BUILDTOOLS.15.8.3253\TOOLS\VSSDK\INC\STDIDCMD.H
