%YAML 1.1
%TAG !u! tag:unity3d.com,2011:
--- !u!1045 &1
EditorBuildSettings:
  m_ObjectHideFlags: 0
  serializedVersion: 2
  m_Scenes:
  - enabled: 1
    path: Assets/Scenes/Menu.unity
    guid: 40138082b4db93f429c8de2ab02f5627
  - enabled: 1
    path: Assets/Scenes/Game.unity
    guid: 99c9720ab356a0642a771bea13969a05
  - enabled: 1
    path: Assets/Scenes/Credits.unity
    guid: 5a7b4fc5da58d7848bde83bd3e296b04
  m_configObjects: {}
