%YAML 1.1
%TAG !u! tag:unity3d.com,2011:
--- !u!114 &11400000
MonoBehaviour:
  m_ObjectHideFlags: 0
  m_CorrespondingSourceObject: {fileID: 0}
  m_PrefabInstance: {fileID: 0}
  m_PrefabAsset: {fileID: 0}
  m_GameObject: {fileID: 0}
  m_Enabled: 1
  m_EditorHideFlags: 0
  m_Script: {fileID: 11500000, guid: 5fae4f8c1656c824fba5ad4415cefb73, type: 3}
  m_Name: Book1
  m_EditorClassIdentifier: 
  shelfTitle: 'Shelf 1 Picto / Sentence '
  lessonsName: Nouns & Verbs
  nounChoices:
  - pig
  - dog
  - cat
  verbChoices:
  - jumps
  - rolls
  - pass
  adjectChoices: []
  adverbChoices: []
  prepositionChoices: []
  answers:
  - dog
  - jumps
  imageArt: {fileID: 21300000, guid: e0f7128966fc27245ab082113e0c1b38, type: 3}
  isCompleted: 0
  starCount: 0
  sentencePrefab: {fileID: 2796944245413112831, guid: dbf7e1ab3845b914e834f40f602a3293, type: 3}
  correctSentencePrefab: {fileID: 0}
