%YAML 1.1
%TAG !u! tag:unity3d.com,2011:
--- !u!1 &6823844511975944251
GameObject:
  m_ObjectHideFlags: 0
  m_CorrespondingSourceObject: {fileID: 0}
  m_PrefabInstance: {fileID: 0}
  m_PrefabAsset: {fileID: 0}
  serializedVersion: 6
  m_Component:
  - component: {fileID: 6823844511975944253}
  - component: {fileID: 6823844511975944252}
  m_Layer: 0
  m_Name: Story3
  m_TagString: Untagged
  m_Icon: {fileID: 0}
  m_NavMeshLayer: 0
  m_StaticEditorFlags: 0
  m_IsActive: 1
--- !u!4 &6823844511975944253
Transform:
  m_ObjectHideFlags: 0
  m_CorrespondingSourceObject: {fileID: 0}
  m_PrefabInstance: {fileID: 0}
  m_PrefabAsset: {fileID: 0}
  m_GameObject: {fileID: 6823844511975944251}
  m_LocalRotation: {x: 0, y: 0, z: 0, w: 1}
  m_LocalPosition: {x: 1229.8734, y: 1812.9, z: -11.887733}
  m_LocalScale: {x: 1, y: 1, z: 1}
  m_ConstrainProportionsScale: 0
  m_Children: []
  m_Father: {fileID: 0}
  m_RootOrder: 0
  m_LocalEulerAnglesHint: {x: 0, y: 0, z: 0}
--- !u!114 &6823844511975944252
MonoBehaviour:
  m_ObjectHideFlags: 0
  m_CorrespondingSourceObject: {fileID: 0}
  m_PrefabInstance: {fileID: 0}
  m_PrefabAsset: {fileID: 0}
  m_GameObject: {fileID: 6823844511975944251}
  m_Enabled: 1
  m_EditorHideFlags: 0
  m_Script: {fileID: 11500000, guid: 857a5a7b195ba5742bbc80ccee9ffd52, type: 3}
  m_Name: 
  m_EditorClassIdentifier: 
  dialogues:
    storyName: 
    sentences: []
  textAsset: {fileID: 4900000, guid: e949614a3357bd34893ad343853b6b69, type: 3}
  visualPictures:
  - sequencePhoto: {fileID: 21300000, guid: 4cfab8bbd1498294a9a956b4380baeb4, type: 3}
    sequenceNumber: 0
  - sequencePhoto: {fileID: 21300000, guid: 99ad83d689f6c524986c286e56c63ca7, type: 3}
    sequenceNumber: 1
  - sequencePhoto: {fileID: 21300000, guid: 348e3abe42f244c4e964dad533dd11c8, type: 3}
    sequenceNumber: 1
  - sequencePhoto: {fileID: 21300000, guid: 86eecd91bb94ba6468caa1f6eeb03507, type: 3}
    sequenceNumber: 1
  - sequencePhoto: {fileID: 21300000, guid: c36d9e4ceee30d94f9fbce92be05b25d, type: 3}
    sequenceNumber: 1
  - sequencePhoto: {fileID: 21300000, guid: 9d0e8b16a3a677940b1cac9d312787f2, type: 3}
    sequenceNumber: 1
  - sequencePhoto: {fileID: 21300000, guid: 3da507177e716d94d9c92203f9709ff8, type: 3}
    sequenceNumber: 1
  - sequencePhoto: {fileID: 21300000, guid: 4b0a99f0199ee64499fda9edcf854655, type: 3}
    sequenceNumber: 1
  - sequencePhoto: {fileID: 21300000, guid: cd3118fc5e6af6b4ca972d93e9a7550e, type: 3}
    sequenceNumber: 1
  - sequencePhoto: {fileID: 21300000, guid: 6c7dc1bf85bfadc4482fd8f1f5ed113d, type: 3}
    sequenceNumber: 1
  - sequencePhoto: {fileID: 21300000, guid: 0ba10ed0c65be7d4eb24313074fc30c7, type: 3}
    sequenceNumber: 1
  - sequencePhoto: {fileID: 21300000, guid: 134e5bb77cfaa2745afe39bb01776bba, type: 3}
    sequenceNumber: 1
  - sequencePhoto: {fileID: 21300000, guid: 8b4752adf40ed7f4cbfed2e01d36ee87, type: 3}
    sequenceNumber: 1
  - sequencePhoto: {fileID: 21300000, guid: ee8151e9c2512fa47a6bb51722d5d846, type: 3}
    sequenceNumber: 1
  - sequencePhoto: {fileID: 21300000, guid: ec2fe2c22e8737b4abdb5261bf444a48, type: 3}
    sequenceNumber: 0
  - sequencePhoto: {fileID: 21300000, guid: 3ac3ca7b5389c814880daa60acbbbc50, type: 3}
    sequenceNumber: 1
