%YAML 1.1
%TAG !u! tag:unity3d.com,2011:
--- !u!1 &7209237249762562658
GameObject:
  m_ObjectHideFlags: 0
  m_CorrespondingSourceObject: {fileID: 0}
  m_PrefabInstance: {fileID: 0}
  m_PrefabAsset: {fileID: 0}
  serializedVersion: 6
  m_Component:
  - component: {fileID: 7209237249762562660}
  - component: {fileID: 7209237249762562661}
  m_Layer: 0
  m_Name: Story2
  m_TagString: Untagged
  m_Icon: {fileID: 0}
  m_NavMeshLayer: 0
  m_StaticEditorFlags: 0
  m_IsActive: 1
--- !u!4 &7209237249762562660
Transform:
  m_ObjectHideFlags: 0
  m_CorrespondingSourceObject: {fileID: 0}
  m_PrefabInstance: {fileID: 0}
  m_PrefabAsset: {fileID: 0}
  m_GameObject: {fileID: 7209237249762562658}
  m_LocalRotation: {x: 0, y: 0, z: 0, w: 1}
  m_LocalPosition: {x: 1229.8734, y: 1812.9, z: -11.887733}
  m_LocalScale: {x: 1, y: 1, z: 1}
  m_ConstrainProportionsScale: 0
  m_Children: []
  m_Father: {fileID: 0}
  m_RootOrder: 0
  m_LocalEulerAnglesHint: {x: 0, y: 0, z: 0}
--- !u!114 &7209237249762562661
MonoBehaviour:
  m_ObjectHideFlags: 0
  m_CorrespondingSourceObject: {fileID: 0}
  m_PrefabInstance: {fileID: 0}
  m_PrefabAsset: {fileID: 0}
  m_GameObject: {fileID: 7209237249762562658}
  m_Enabled: 1
  m_EditorHideFlags: 0
  m_Script: {fileID: 11500000, guid: 857a5a7b195ba5742bbc80ccee9ffd52, type: 3}
  m_Name: 
  m_EditorClassIdentifier: 
  dialogues:
    storyName: 
    sentences: []
  textAsset: {fileID: 4900000, guid: a5b26ca9befa95b4ab707470ed581e99, type: 3}
  visualPictures:
  - sequencePhoto: {fileID: 21300000, guid: 8c998fc92e5daff4588d620ac1f6657c, type: 3}
    sequenceNumber: 0
  - sequencePhoto: {fileID: 21300000, guid: d06268424b92e334b9bf9d8690588c62, type: 3}
    sequenceNumber: 0
  - sequencePhoto: {fileID: 21300000, guid: 11863ad932971204b8ef9e1347fa6466, type: 3}
    sequenceNumber: 0
  - sequencePhoto: {fileID: 21300000, guid: d5db1633fb14019499d0c0b1b2b1edd7, type: 3}
    sequenceNumber: 0
  - sequencePhoto: {fileID: 21300000, guid: 60cd51602fb1a7c42b9111df4c0c55da, type: 3}
    sequenceNumber: 1
  - sequencePhoto: {fileID: 21300000, guid: 45a22586599f08441a6d67a23da58ec3, type: 3}
    sequenceNumber: 0
  - sequencePhoto: {fileID: 21300000, guid: 8164e8979601bc84ebac1b2f98a16c3e, type: 3}
    sequenceNumber: 0
  - sequencePhoto: {fileID: 21300000, guid: 513a12e61dc8ec34ebe4936a80803e4e, type: 3}
    sequenceNumber: 1
  - sequencePhoto: {fileID: 21300000, guid: 1545d50e2b9c4494e89d3da0c2ea995b, type: 3}
    sequenceNumber: 0
  - sequencePhoto: {fileID: 21300000, guid: c402ad2d9187c214aab93b1890c86834, type: 3}
    sequenceNumber: 1
  - sequencePhoto: {fileID: 21300000, guid: 2047bc3c1cf950c4298c83730ef71afc, type: 3}
    sequenceNumber: 0
  - sequencePhoto: {fileID: 21300000, guid: d638ff2d9d2db1d4a85c658b0547b848, type: 3}
    sequenceNumber: 0
  - sequencePhoto: {fileID: 21300000, guid: fd686d50a967ce64f955f0bc8d1f0c10, type: 3}
    sequenceNumber: 1
