%YAML 1.1
%TAG !u! tag:unity3d.com,2011:
--- !u!114 &11400000
MonoBehaviour:
  m_ObjectHideFlags: 0
  m_CorrespondingSourceObject: {fileID: 0}
  m_PrefabInstance: {fileID: 0}
  m_PrefabAsset: {fileID: 0}
  m_GameObject: {fileID: 0}
  m_Enabled: 1
  m_EditorHideFlags: 0
  m_Script: {fileID: 11500000, guid: 5917324c6d0d4184dae557e8bc781102, type: 3}
  m_Name: Book4
  m_EditorClassIdentifier: 
  bookNumber: 4
  difficulty: Hard
  shelfTitle: Shelf 2 Spelling
  answers:
  - greatest
  - Pharaoh
  - New
  - Empire
  - Egyptian
  - history
  audioFiles: []
  Shelf2QuestionsPrefab: {fileID: 5866543595075019174, guid: 8c27a587bd2fe05439538ce4f6f55fb6, type: 3}
  isComplete: 0
  bookImage: {fileID: 21300000, guid: 11e0040854c552d449882872ec34fddb, type: 3}
