********** Question 1 **********

Checking method findSingle on array [6,6,18,18,-4,-4,12,9,9]

Result is: 12

********** Question 2 **********

Checking method waterVolume on array [2,1,1,4,1,1,2,3]

Result is: 7

