<?xml version="1.0" encoding="UTF-8" standalone="no"?>
<svg xmlns:rdf="http://www.w3.org/1999/02/22-rdf-syntax-ns#" xmlns="http://www.w3.org/2000/svg" version="1.1" xmlns:cc="http://creativecommons.org/ns#" xmlns:xlink="http://www.w3.org/1999/xlink" viewBox="0 0 16 16" xmlns:dc="http://purl.org/dc/elements/1.1/">
<metadata>
<rdf:RDF>
<cc:Work rdf:about="">
<dc:format>image/svg+xml</dc:format>
<dc:type rdf:resource="http://purl.org/dc/dcmitype/StillImage"/>
</cc:Work>
</rdf:RDF>
</metadata>
<defs>
<linearGradient id="a" y2="186.7495" gradientUnits="userSpaceOnUse" x2="-34.24569" y1="183.3679" x1="-42.13395">
<stop stop-color="#5a5a5a" offset="0"/>
<stop offset="1"/>
</linearGradient>
<linearGradient id="b" y2="190.2341" gradientUnits="userSpaceOnUse" x2="-41.62015" y1="183.1965" x1="-38.78242">
<stop stop-color="#fff" offset="0"/>
<stop stop-color="#98b6d3" offset="1"/>
</linearGradient>
</defs>
<g transform="translate(45,-175)">
<rect style="color:#000000" height="16" width="16" y="175" x="-45" fill="none"/>
<path stroke-linejoin="round" style="color:#000000" d="m-37.5 175.5v15h-6l6-15z" fill-rule="evenodd" stroke="#000" stroke-linecap="round" stroke-miterlimit="0" stroke-width="1.0000002"/>
<path stroke-linejoin="round" style="color:#000000" d="m-29.5 188.5h-15v-6l15 6z" fill-rule="evenodd" stroke="url(#a)" stroke-linecap="round" stroke-miterlimit="0" fill="url(#b)"/>
<path d="m199 207v1h3l1.0312 1v3.0312h-2l2.5 3 2.5-3h-2v-3.0312l-2.0312-2h-3z" fill-rule="evenodd" transform="translate(-235.0423,-30.03905)"/>
</g>
</svg>
