<?xml version="1.0" encoding="UTF-8" standalone="no"?>
<svg xmlns:rdf="http://www.w3.org/1999/02/22-rdf-syntax-ns#" xmlns="http://www.w3.org/2000/svg" version="1.0" xmlns:cc="http://creativecommons.org/ns#" xmlns:xlink="http://www.w3.org/1999/xlink" viewBox="0 0 96 96" xmlns:dc="http://purl.org/dc/elements/1.1/">
<defs>
<linearGradient id="a" y2="914.67297" gradientUnits="userSpaceOnUse" y1="909.65936" x2="1179.2837" x1="1180.5682">
<stop stop-color="#3465a4" offset="0"/>
<stop stop-color="#729fcf" offset=".86907172"/>
</linearGradient>
</defs>
<metadata>
<rdf:RDF>
<cc:Work rdf:about="">
<dc:format>image/svg+xml</dc:format>
<dc:type rdf:resource="http://purl.org/dc/dcmitype/StillImage"/>
<dc:title>feMorphology Filter Primitive Example</dc:title>
<dc:date>2007-07-03</dc:date>
<dc:creator>
<cc:Agent>
<dc:title>Felipe Corrêa da Silva Sanches</dc:title>
</cc:Agent>
</dc:creator>
<dc:rights>
<cc:Agent>
<dc:title>Felipe Corrêa da Silva Sanches</dc:title>
</cc:Agent>
</dc:rights>
<dc:publisher>
<cc:Agent>
<dc:title>Felipe Corrêa da Silva Sanches</dc:title>
</cc:Agent>
</dc:publisher>
<dc:identifier/>
<dc:source/>
<dc:relation/>
<dc:language/>
<dc:subject>
<rdf:Bag>
<rdf:li>feMorphology Example</rdf:li>
</rdf:Bag>
</dc:subject>
<dc:coverage/>
<dc:description>this is an image originally intended to be used in Inkscape</dc:description>
<dc:contributor>
<cc:Agent>
<dc:title/>
</cc:Agent>
</dc:contributor>
<cc:license rdf:resource="http://creativecommons.org/licenses/by-sa/3.0/"/>
</cc:Work>
<cc:License rdf:about="http://creativecommons.org/licenses/by-sa/3.0/">
<cc:permits rdf:resource="http://creativecommons.org/ns#Reproduction"/>
<cc:permits rdf:resource="http://creativecommons.org/ns#Distribution"/>
<cc:requires rdf:resource="http://creativecommons.org/ns#Notice"/>
<cc:requires rdf:resource="http://creativecommons.org/ns#Attribution"/>
<cc:permits rdf:resource="http://creativecommons.org/ns#DerivativeWorks"/>
<cc:requires rdf:resource="http://creativecommons.org/ns#ShareAlike"/>
</cc:License>
</rdf:RDF>
</metadata>
<g transform="translate(-155.36416,-264.88732)">
<rect opacity=".43324938" stroke-linejoin="round" stroke-dasharray="2.90045164, 5.80090327" fill-rule="evenodd" height="85.645119" width="85.424026" stroke="#000" stroke-linecap="round" y="270.00949" x="160.78661" stroke-width="2.9004517" fill="#ff1"/>
<g transform="matrix(2.0980395,0,0,2.0980395,-2327.2244,-1605.9813)">
<rect opacity=".24267782" fill-opacity="0" height="24" width="23.999989" y="896" x="1200"/>
<path d="m1209.602 913.7266l12.5331-5.70441c0.6919-0.31489 0.4374-3.31056-1.087-6.20439-1.5244-2.89385-3.7443-4.59544-4.4361-4.28055l-12.5332 5.70438" stroke="#204a87" stroke-width=".99999988" fill="#729fcf"/>
<path d="m1210.512 912.2405l10.7003-4.93386c0.6888-0.31606 0.2661-2.40395-1.2516-5.30857-1.5177-2.90466-2.8234-3.63042-3.5121-3.31436l-10.5466 4.81929" stroke-opacity=".50196078" stroke="#fff" fill="none"/>
<path fill-opacity=".45263157" fill="#fff" d="m1205.6217 903.09453c1.5468 1.14905 2.8846 3.26079 2.8846 3.26079 8.7468-1.64385 6.0769-5.67022 13.0596-1.78114-1.0282-3.08066-3.1005-6.29666-5.0289-6.46499l-10.9153 4.98534z"/>
<path d="m1211.9375 903.68752c-1.9375-6.49233-6.9375-6.49233-5.0177-2.20559" stroke="#2e3436" stroke-width="3" fill="none"/>
<path stroke-linejoin="round" d="m14.1875 14.875a1.3125 1.3125 0 0 1 -1.3125 1.3125 1.3125 1.3125 0 0 1 -1.3125 -1.3125 1.3125 1.3125 0 0 1 1.3125 -1.3125 1.3125 1.3125 0 0 1 1.3125 1.3125z" transform="matrix(1.5238095,0,0,1.5238095,1192.881,882.83333)" stroke="#2e3436" stroke-width=".65625" fill="#d3d7cf"/>
<path d="m1212.4375 905.4375c-1.4375-8.4375-7.4375-8.21653-5.5177-4.06609" stroke="#d3d7cf" stroke-width=".99999994" fill="none"/>
<path d="m1181.6196 912.95593a2.3422911 5.038136 0 0 1 -2.3422911 5.038136 2.3422911 5.038136 0 0 1 -2.3422911 -5.038136 2.3422911 5.038136 0 0 1 2.3422911 -5.038136 2.3422911 5.038136 0 0 1 2.3422911 5.038136z" transform="matrix(.7582508 -.3582535 .5932037 1.0454619 -228.78018 376.45604)" stroke="#204a87" stroke-width=".99739033" fill="url(#a)"/>
<path d="m1207.3552 914.42745c-4.6649 0.13871-5.8592 1.06954-5.87 2.01101-0.0118 1.03528 1.6166 2.08356 6.5038 2.10535 17.9954 0.08023 17.3244-3.941 2.4065-4.01199-0.2649-0.59702-0.6607-1.53182-1.3678-4.23893-1.0277-0.29289-0.9694 2.79421-1.6725 4.13456z" stroke="#c4a000" stroke-width="1.000001" fill="#fce94f"/>
<path d="m1208.7812 911.8125c-0.0101 0.04177-0.0214 0.05046-0.0312 0.09375-0.196 0.86586-0.3213 1.99811-0.7812 2.875-0.1187 0.22028-0.3439 0.3625-0.5938 0.375-2.2873 0.06802-3.7076 0.32106-4.4375 0.625-0.3649 0.15197-0.5389 0.33413-0.625 0.4375s-0.0927 0.12987-0.0937 0.21875c-0.0009 0.07048-0.0002 0.14718 0.125 0.28125 0.1251 0.13407 0.3738 0.29974 0.8124 0.46875 0.8773 0.33802 2.4504 0.61433 4.8438 0.625 4.4723 0.01994 7.7664-0.2072 9.9375-0.5625 1.0855-0.17765 1.9108-0.39436 2.4063-0.59375 0.1548-0.06231 0.2223-0.10378 0.3124-0.15625-0.0208-0.01223-0.007-0.01857-0.0312-0.03125-0.3452-0.1812-1.0043-0.37794-1.9062-0.5625-1.804-0.36913-4.6151-0.63865-8.3126-0.65625-0.2867-0.00113-0.5449-0.17332-0.6562-0.4375-0.1861-0.41931-0.5891-1.75941-0.9688-3z" stroke="#fff" stroke-width=".5" fill="#fce94f"/>
</g>
</g>
</svg>
