<?xml version="1.0" encoding="UTF-8" standalone="no"?>
<svg xmlns:rdf="http://www.w3.org/1999/02/22-rdf-syntax-ns#" xmlns="http://www.w3.org/2000/svg" version="1.0" xmlns:cc="http://creativecommons.org/ns#" xmlns:xlink="http://www.w3.org/1999/xlink" viewBox="0 0 96 96" xmlns:dc="http://purl.org/dc/elements/1.1/">
<defs>
<mask id="a" maskUnits="userSpaceOnUse">
<rect fill-rule="evenodd" height="101.09464" width="100.53606" y="-2.7778296" x="-.79143554" fill="#fff"/>
</mask>
</defs>
<metadata>
<rdf:RDF>
<cc:Work rdf:about="">
<dc:format>image/svg+xml</dc:format>
<dc:type rdf:resource="http://purl.org/dc/dcmitype/StillImage"/>
<cc:license rdf:resource="http://creativecommons.org/licenses/by-sa/3.0/"/>
<dc:title>feImage filter primitive example</dc:title>
<dc:date>18 Jan 2008</dc:date>
<dc:creator>
<cc:Agent>
<dc:title>Felipe Corrêa da Silva Sanches</dc:title>
</cc:Agent>
</dc:creator>
<dc:rights>
<cc:Agent>
<dc:title>Felipe Corrêa da Silva Sanches</dc:title>
</cc:Agent>
</dc:rights>
<dc:subject>
<rdf:Bag>
<rdf:li>Image filter primitive example</rdf:li>
</rdf:Bag>
</dc:subject>
<dc:description>this is an image originally intended to be used in Inkscape</dc:description>
<dc:publisher>
<cc:Agent>
<dc:title>Felipe Corrêa da Silva Sanches</dc:title>
</cc:Agent>
</dc:publisher>
<dc:identifier/>
<dc:source>http://www.flickr.com/photos/dariosanches</dc:source>
<dc:relation/>
<dc:language/>
<dc:coverage/>
<dc:contributor>
<cc:Agent>
<dc:title>This file is derived from ticotico.jpg which is:
(C) 2007 Dario Sanches under the CC by-sa license</dc:title>
</cc:Agent>
</dc:contributor>
</cc:Work>
<cc:License rdf:about="http://creativecommons.org/licenses/by-sa/3.0/">
<cc:permits rdf:resource="http://creativecommons.org/ns#Reproduction"/>
<cc:permits rdf:resource="http://creativecommons.org/ns#Distribution"/>
<cc:requires rdf:resource="http://creativecommons.org/ns#Notice"/>
<cc:requires rdf:resource="http://creativecommons.org/ns#Attribution"/>
<cc:permits rdf:resource="http://creativecommons.org/ns#DerivativeWorks"/>
<cc:requires rdf:resource="http://creativecommons.org/ns#ShareAlike"/>
</cc:License>
</rdf:RDF>
</metadata>
<g>
<image xlink:href="/media/sicher/maren/www/Inkscape/Manual/all_icons/./ticotico.jpg" mask="url(#a)" transform="matrix(.8782911 0 0 .8782911 4.6793008 6.2342096)" height="124.7063" filter="url(#filter2688)" width="168.06779" y="-3.336705" x="-45.587234"/>
</g>
</svg>
