<?xml version="1.0" encoding="UTF-8" standalone="no"?>
<svg xmlns:rdf="http://www.w3.org/1999/02/22-rdf-syntax-ns#" xmlns="http://www.w3.org/2000/svg" version="1.1" xmlns:cc="http://creativecommons.org/ns#" xmlns:xlink="http://www.w3.org/1999/xlink" viewBox="0 0 16 16" xmlns:dc="http://purl.org/dc/elements/1.1/">
<metadata>
<rdf:RDF>
<cc:Work rdf:about="">
<dc:format>image/svg+xml</dc:format>
<dc:type rdf:resource="http://purl.org/dc/dcmitype/StillImage"/>
</cc:Work>
</rdf:RDF>
</metadata>
<defs>
<linearGradient id="a">
<stop stop-color="#fff" offset="0"/>
<stop stop-color="#98b6d3" offset="1"/>
</linearGradient>
<linearGradient id="c" y2="206.9966" xlink:href="#a" gradientUnits="userSpaceOnUse" x2="101.1929" y1="215.4819" x1="108.3513"/>
<linearGradient id="d" y2="210.5" gradientUnits="userSpaceOnUse" x2="111.6865" y1="210.5" x1="99.31348">
<stop stop-color="#5a5a5a" offset="0"/>
<stop offset="1"/>
</linearGradient>
<linearGradient id="b" y2="212.9901" xlink:href="#a" gradientUnits="userSpaceOnUse" x2="108.8156" y1="205.192" x1="101.7507"/>
</defs>
<g transform="translate(-55,-277)">
<g stroke-linejoin="round" stroke-linecap="round" stroke-miterlimit="0" transform="matrix(1.112088 0 0 1.110911 -340.6366 -.279561)">
<circle style="color:#000000" stroke-width="1.3730356" transform="matrix(.727881 0 0 .728748 287.069 104.2892)" stroke="url(#d)" cy="210.5" cx="105.5" r="5.5" fill="none"/>
<circle style="color:#000000" stroke-width="1.8262242" fill-rule="evenodd" transform="matrix(.547085 0 0 .548073 306.1137 142.2991)" stroke="url(#b)" cy="210.5" cx="105.5" r="5.5" fill="url(#c)"/>
</g>
<path d="m59.5 281.5h1" stroke="#c00" stroke-linecap="square" stroke-width="1px" fill="none"/>
<path d="m59.5 283.5v1" stroke="#c00" stroke-linecap="square" stroke-width="1px" fill="none"/>
<path d="m55.5 236.5h1" transform="translate(7 45)" stroke="#c00" stroke-linecap="square" stroke-width="1px" fill="none"/>
<path d="m55.5 236.5h1" transform="translate(10 45)" stroke="#c00" stroke-linecap="square" stroke-width="1px" fill="none"/>
<path d="m55.5 238.5v1" transform="translate(4 48)" stroke="#c00" stroke-linecap="square" stroke-width="1px" fill="none"/>
<path d="m55.5 238.5v1" transform="translate(4 51)" stroke="#c00" stroke-linecap="square" stroke-width="1px" fill="none"/>
<path d="m55.5 236.5h1" transform="translate(6 54)" stroke="#c00" stroke-linecap="square" stroke-width="1px" fill="none"/>
<path d="m55.5 236.5h1" transform="translate(9 54)" stroke="#c00" stroke-linecap="square" stroke-width="1px" fill="none"/>
<path d="m55.5 236.5h1" transform="translate(12 54)" stroke="#c00" stroke-linecap="square" stroke-width="1px" fill="none"/>
<path d="m55.5 238.5v1" transform="translate(13 43)" stroke="#c00" stroke-linecap="square" stroke-width="1px" fill="none"/>
<path d="m55.5 238.5v1" transform="translate(13 46)" stroke="#c00" stroke-linecap="square" stroke-width="1px" fill="none"/>
<path d="m55.5 238.5v1" transform="translate(13 49)" stroke="#c00" stroke-linecap="square" stroke-width="1px" fill="none"/>
<path d="m55.5 277.5h1" stroke="#000" stroke-linecap="square" stroke-width="1px" fill="none"/>
<path d="m55.5 185.5h1" transform="translate(3 92)" stroke="#000" stroke-linecap="square" stroke-width="1px" fill="none"/>
<path d="m55.5 185.5h1" transform="translate(6 92)" stroke="#000" stroke-linecap="square" stroke-width="1px" fill="none"/>
<path d="m55.5 185.5h1" transform="translate(9 92)" stroke="#000" stroke-linecap="square" stroke-width="1px" fill="none"/>
<path d="m55.5 185.5h1" transform="translate(12 92)" stroke="#000" stroke-linecap="square" stroke-width="1px" fill="none"/>
<path d="m55.5 185.5h1" transform="translate(2 107)" stroke="#000" stroke-linecap="square" stroke-width="1px" fill="none"/>
<path d="m55.5 185.5h1" transform="translate(5 107)" stroke="#000" stroke-linecap="square" stroke-width="1px" fill="none"/>
<path d="m55.5 185.5h1" transform="translate(8 107)" stroke="#000" stroke-linecap="square" stroke-width="1px" fill="none"/>
<path d="m55.5 185.5h1" transform="translate(11 107)" stroke="#000" stroke-linecap="square" stroke-width="1px" fill="none"/>
<path d="m55.5 185.5h1" transform="translate(14 107)" stroke="#000" stroke-linecap="square" stroke-width="1px" fill="none"/>
<path d="m55.5 279.5v1" stroke="#000" stroke-linecap="square" stroke-width="1px" fill="none"/>
<path d="m55.5 187.5v1" transform="translate(0 95)" stroke="#000" stroke-linecap="square" stroke-width="1px" fill="none"/>
<path d="m55.5 187.5v1" transform="translate(0 98)" stroke="#000" stroke-linecap="square" stroke-width="1px" fill="none"/>
<path d="m55.5 187.5v1" transform="translate(0 101)" stroke="#000" stroke-linecap="square" stroke-width="1px" fill="none"/>
<path d="m55.5 187.5v1" transform="translate(0 104)" stroke="#000" stroke-linecap="square" stroke-width="1px" fill="none"/>
<path d="m55.5 187.5v1" transform="translate(15 102)" stroke="#000" stroke-linecap="square" stroke-width="1px" fill="none"/>
<path d="m55.5 187.5v1" transform="translate(15 99)" stroke="#000" stroke-linecap="square" stroke-width="1px" fill="none"/>
<path d="m55.5 187.5v1" transform="translate(15 96)" stroke="#000" stroke-linecap="square" stroke-width="1px" fill="none"/>
<path d="m55.5 187.5v1" transform="translate(15 93)" stroke="#000" stroke-linecap="square" stroke-width="1px" fill="none"/>
<path d="m55.5 187.5v1" transform="translate(15 90)" stroke="#000" stroke-linecap="square" stroke-width="1px" fill="none"/>
</g>
</svg>
