<?xml version="1.0" encoding="UTF-8" standalone="no"?>
<svg xmlns:rdf="http://www.w3.org/1999/02/22-rdf-syntax-ns#" xmlns="http://www.w3.org/2000/svg" version="1.1" xmlns:cc="http://creativecommons.org/ns#" viewBox="0 0 16 16" xmlns:dc="http://purl.org/dc/elements/1.1/">
<metadata>
<rdf:RDF>
<cc:Work rdf:about="">
<dc:format>image/svg+xml</dc:format>
<dc:type rdf:resource="http://purl.org/dc/dcmitype/StillImage"/>
</cc:Work>
</rdf:RDF>
</metadata>
<g stroke-linecap="round" stroke="blue" fill="none">
<path d="m1.5 0.5v15"/>
<path d="m5.5 0.5v15"/>
<path d="m9.5 0.5v15"/>
<path d="m13.5 0.5v15"/>
<path d="m0.5 2.5h15"/>
<path d="m0.5 6.5h15"/>
<path d="m0.5 10.5h15"/>
<path d="m0.5 14.5h15"/>
</g>
</svg>
