<?xml version="1.0" encoding="UTF-8" standalone="no"?>
<svg xmlns:rdf="http://www.w3.org/1999/02/22-rdf-syntax-ns#" xmlns="http://www.w3.org/2000/svg" version="1.0" xmlns:cc="http://creativecommons.org/ns#" xmlns:xlink="http://www.w3.org/1999/xlink" viewBox="0 0 96 96" xmlns:dc="http://purl.org/dc/elements/1.1/">
<defs>
<filter id="b">
<feMorphology operator="dilate" radius="3.0888030888030888"/>
</filter>
</defs>
<metadata>
<rdf:RDF>
<cc:Work rdf:about="">
<dc:format>image/svg+xml</dc:format>
<dc:type rdf:resource="http://purl.org/dc/dcmitype/StillImage"/>
<dc:title>feMorphology Filter Primitive Example</dc:title>
<dc:date>2007-07-03</dc:date>
<dc:creator>
<cc:Agent>
<dc:title>Felipe Corrêa da Silva Sanches</dc:title>
</cc:Agent>
</dc:creator>
<dc:rights>
<cc:Agent>
<dc:title>Felipe Corrêa da Silva Sanches</dc:title>
</cc:Agent>
</dc:rights>
<dc:publisher>
<cc:Agent>
<dc:title>Felipe Corrêa da Silva Sanches</dc:title>
</cc:Agent>
</dc:publisher>
<dc:identifier>c</dc:identifier>
<dc:source/>
<dc:relation/>
<dc:language/>
<dc:subject>
<rdf:Bag>
<rdf:li>feMorphology Example</rdf:li>
</rdf:Bag>
</dc:subject>
<dc:coverage/>
<dc:description>this is an image originally intended to be used in Inkscape</dc:description>
<dc:contributor>
<cc:Agent>
<dc:title/>
</cc:Agent>
</dc:contributor>
<cc:license rdf:resource="http://creativecommons.org/licenses/by-sa/3.0/"/>
</cc:Work>
<cc:License rdf:about="http://creativecommons.org/licenses/by-sa/3.0/">
<cc:permits rdf:resource="http://creativecommons.org/ns#Reproduction"/>
<cc:permits rdf:resource="http://creativecommons.org/ns#Distribution"/>
<cc:requires rdf:resource="http://creativecommons.org/ns#Notice"/>
<cc:requires rdf:resource="http://creativecommons.org/ns#Attribution"/>
<cc:permits rdf:resource="http://creativecommons.org/ns#DerivativeWorks"/>
<cc:requires rdf:resource="http://creativecommons.org/ns#ShareAlike"/>
</cc:License>
</rdf:RDF>
</metadata>
<g transform="translate(-155.36416,-264.88732)">
<g id="a" transform="matrix(.9521111 -.143244 .143244 .9521111 -32.233426 70.803148)">
<path stroke-linejoin="round" d="m42.666668 40.946236a17.204302 17.204302 0 0 1 -17.204302 17.204301 17.204302 17.204302 0 0 1 -17.204302 -17.204301 17.204302 17.204302 0 0 1 17.204302 -17.204302 17.204302 17.204302 0 0 1 17.204302 17.204302z" transform="translate(159.66949,266.98056)" stroke="#00f" stroke-linecap="round" stroke-width="5.2269907" fill="none"/>
<path stroke-linejoin="round" d="m40.258064 21.161291a12.215054 12.215054 0 0 1 -12.215053 12.215054 12.215054 12.215054 0 0 1 -12.215054 -12.215054 12.215054 12.215054 0 0 1 12.215054 -12.215053 12.215054 12.215054 0 0 1 12.215053 12.215053z" transform="translate(160.51114,267.80861)" stroke="#f00" stroke-linecap="round" stroke-width="4.1815925" fill="none"/>
<path stroke-linejoin="round" d="m29.935483 20.989246a13.419354 13.419354 0 0 1 -13.419354 13.419355 13.419354 13.419354 0 0 1 -13.419355 -13.419355 13.419354 13.419354 0 0 1 13.419355 -13.419354 13.419354 13.419354 0 0 1 13.419354 13.419354z" transform="translate(156.85329,262.69283)" stroke="#0f0" stroke-linecap="round" stroke-width="3.1361945" fill="none"/>
</g>
<use xlink:href="#a" transform="translate(36.743942,-30.88376)" height="96" filter="url(#b)" width="96" y="0" x="0"/>
</g>
</svg>
