RIC,Name,Price Close,Currency,Base Currency,Company Market Cap,Weight
EUR=,Euro,1.1832,USD,EUR,NULL,0
CAD=,Canadian Dollar,1.2507,CAD,USD,NULL,0
GBP=,British Pound,1.3928,USD,GBP,NULL,0
JPY=,Japanese Yen,109.74,JPY,USD,NULL,0
AAPL.O,Apple Inc,147.06,USD,#N/A,"$2,430,926,211,960.00",0.272578117
MSFT.O,Microsoft Corp,289.52,USD,#N/A,"$2,175,711,314,120.96",0.243961043
AMZN.O,Amazon.com Inc,3375.99,USD,#N/A,"$1,709,738,131,114.80",0.191711784
JPM,JPMorgan Chase & Co,153.15,USD,#N/A,"$457,635,992,618.25",0.051314415
RDSa.L,Royal Dutch Shell PLC,1482.2,GBp,#N/A,"$160,521,914,839.02",0.017999214
HSBA.L,HSBC Holdings PLC,402.9,GBp,#N/A,"$114,623,126,721.79",0.012852614
BATS.L,British American Tobacco PLC,2656.5,GBp,#N/A,"$84,638,811,750.60",0.009490493
AZN.L,AstraZeneca PLC,8342,GBp,#N/A,"$179,987,305,821.30",0.020181855
RY.TO,Royal Bank of Canada,127.92,CAD,#N/A,"$145,757,040,531.35",0.016343639
CNR.TO,Canadian National Railway Co,135.8,CAD,#N/A,"$76,869,770,567.20",0.008619356
SU.TO,Suncor Energy Inc,24.47,CAD,#N/A,"$29,044,388,950.29",0.003256728
ENB.TO,Enbridge Inc,49.34,CAD,#N/A,"$79,915,856,177.58",0.008960911
CNQ.TO,Canadian Natural Resources Ltd,40.72,CAD,#N/A,"$38,575,647,749.26",0.004325461
9983.T,Fast Retailing Co Ltd,73130,JPY,#N/A,"$70,870,425,167.85",0.007946653
7751.T,Canon Inc,2625,JPY,#N/A,"$31,849,163,089.23",0.003571225
9022.T,Central Japan Railway Co,15540,JPY,#N/A,"$29,096,045,197.74",0.00326252
6902.T,Denso Corp,7683,JPY,#N/A,"$55,961,754,584.42",0.006274954
6367.T,Daikin Industries Ltd,25170,JPY,#N/A,"$66,480,834,590.58",0.007454451
LVMH.PA,LVMH Moet Hennessy Louis Vuitton SE,697.4,EUR,#N/A,"$416,613,726,514.71",0.046714616
TTEF.PA,TotalEnergies SE,37.675,EUR,#N/A,"$117,732,617,279.22",0.013201279
SAPG.DE,SAP SE,125.78,EUR,#N/A,"$182,876,220,250.86",0.020505787
OREP.PA,L'Oreal SA,398.25,EUR,#N/A,"$262,847,237,873.25",0.029472884
