"name_spelling","team_id"
"a&m-corpus chris","1394"
"abilene chr","1101"
"abilene christian","1101"
"abilene-christian","1101"
"air force","1102"
"air-force","1102"
"akron","1103"
"alabama","1104"
"alabama a&m","1105"
"alabama st","1106"
"alabama st.","1106"
"alabama state","1106"
"alabama-am","1105"
"alabama-birmingham","1412"
"alabama-state","1106"
"albany","1107"
"albany (ny)","1107"
"albany ny","1107"
"albany-ny","1107"
"alcorn","1108"
"alcorn st","1108"
"alcorn st.","1108"
"alcorn state","1108"
"alcorn-state","1108"
"alliant international","1109"
"alliant intl","1109"
"american","1110"
"american univ","1110"
"american-university","1110"
"appalachian st","1111"
"appalachian st.","1111"
"appalachian state","1111"
"appalachian-state","1111"
"arizona","1112"
"arizona st","1113"
"arizona st.","1113"
"arizona state","1113"
"arizona-state","1113"
"ark little rock","1114"
"ark pine bluff","1115"
"ark.-pine bluff","1115"
"arkansas","1116"
"arkansas st","1117"
"arkansas st.","1117"
"arkansas state","1117"
"arkansas-little rock","1114"
"arkansas-little-rock","1114"
"arkansas-pine bluff","1115"
"arkansas-pine-bluff","1115"
"arkansas-state","1117"
"armstrong","1118"
"armstrong st","1118"
"army","1119"
"auburn","1120"
"augusta","1121"
"augusta state","1121"
"austin peay","1122"
"austin-peay","1122"
"bakersfield","1167"
"ball st","1123"
"ball st.","1123"
"ball state","1123"
"ball-state","1123"
"baylor","1124"
"belmont","1125"
"bethune-cookman","1126"
"binghamton","1127"
"birmingham so","1128"
"birmingham-southern","1128"
"boise st","1129"
"boise st.","1129"
"boise state","1129"
"boise-state","1129"
"boston","1131"
"boston college","1130"
"boston u.","1131"
"boston univ","1131"
"boston university","1131"
"boston-college","1130"
"boston-university","1131"
"bowling green","1132"
"bowling green state","1132"
"bowling-green","1132"
"bradley","1133"
"brigham young","1140"
"brigham-young","1140"
"brooklyn","1134"
"brown","1135"
"bryant","1136"
"bucknell","1137"
"buffalo","1138"
"butler","1139"
"byu","1140"
"c michigan","1141"
"cal poly","1142"
"cal poly slo","1142"
"cal riverside","1415"
"cal st. fullerton","1168"
"cal st. northridge","1169"
"cal state fullerton","1168"
"cal state northridge","1169"
"cal-poly","1142"
"cal-state-bakersfield","1167"
"cal-state-fullerton","1168"
"cal-state-northridge","1169"
"california","1143"
"california-davis","1413"
"california-irvine","1414"
"california-riverside","1415"
"california-santa barbara","1364"
"california-santa-barbara","1364"
"campbell","1144"
"canisius","1145"
"cent arkansas","1146"
"centenary","1147"
"centenary (la)","1147"
"central ark.","1146"
"central arkansas","1146"
"central conn","1148"
"central conn. st.","1148"
"central connecticut state","1148"
"central florida","1416"
"central florida(ucf)","1416"
"central mich.","1141"
"central michigan","1141"
"central-arkansas","1146"
"central-connecticut-state","1148"
"central-florida","1416"
"central-michigan","1141"
"charleston","1158"
"charleston so","1149"
"charleston so.","1149"
"charleston southern","1149"
"charleston-southern","1149"
"charlotte","1150"
"chattanooga","1151"
"chicago st","1152"
"chicago st.","1152"
"chicago state","1152"
"chicago-state","1152"
"cincinnati","1153"
"citadel","1154"
"clemson","1155"
"cleveland st","1156"
"cleveland st.","1156"
"cleveland state","1156"
"cleveland-state","1156"
"coastal car","1157"
"coastal caro.","1157"
"coastal carolina","1157"
"coastal-carolina","1157"
"col charleston","1158"
"col. of charleston","1158"
"colgate","1159"
"college of charlesto","1158"
"college of charleston","1158"
"college-of-charleston","1158"
"colorado","1160"
"colorado st","1161"
"colorado st.","1161"
"colorado state","1161"
"colorado-state","1161"
"columbia","1162"
"connecticut","1163"
"coppin st","1164"
"coppin st.","1164"
"coppin state","1164"
"coppin-state","1164"
"cornell","1165"
"creighton","1166"
"cs bakersfield","1167"
"cs fullerton","1168"
"cs northridge","1169"
"cs sacramento","1170"
"dartmouth","1171"
"davidson","1172"
"dayton","1173"
"delaware","1174"
"delaware st","1175"
"delaware st.","1175"
"delaware state","1175"
"delaware-state","1175"
"denver","1176"
"depaul","1177"
"detroit","1178"
"detroit mercy","1178"
"drake","1179"
"drexel","1180"
"duke","1181"
"duquesne","1182"
"e illinois","1183"
"e kentucky","1184"
"e michigan","1185"
"e washington","1186"
"east carolina","1187"
"east tenn. st.","1190"
"east tennessee st.","1190"
"east tennessee state","1190"
"east-carolina","1187"
"east-tennessee-state","1190"
"eastern ill.","1183"
"eastern illinois","1183"
"eastern kentucky","1184"
"eastern ky.","1184"
"eastern mich.","1185"
"eastern michigan","1185"
"eastern wash.","1186"
"eastern washington","1186"
"eastern-illinois","1183"
"eastern-kentucky","1184"
"eastern-michigan","1185"
"eastern-washington","1186"
"edwardsville","1188"
"elon","1189"
"estern carolina","1441"
"etsu","1190"
"evansville","1191"
"f dickinson","1192"
"fairfield","1193"
"fairleigh dickinson","1192"
"fairleigh-dickinson","1192"
"fgcu","1195"
"fiu","1198"
"fl atlantic","1194"
"fl gulf coast","1195"
"fla. atlantic","1194"
"florida","1196"
"florida a&m","1197"
"florida atlantic","1194"
"florida gulf coast","1195"
"florida internationa","1198"
"florida international","1198"
"florida intl","1198"
"florida st","1199"
"florida st.","1199"
"florida state","1199"
"florida-am","1197"
"florida-atlantic","1194"
"florida-gulf-coast","1195"
"florida-international","1198"
"florida-state","1199"
"fordham","1200"
"fort wayne(ipfw)","1236"
"fresno st","1201"
"fresno st.","1201"
"fresno state","1201"
"fresno-state","1201"
"furman","1202"
"g washington","1203"
"ga southern","1204"
"ga. southern","1204"
"gardner webb","1205"
"gardner-webb","1205"
"george mason","1206"
"george washington","1203"
"george-mason","1206"
"george-washington","1203"
"georgetown","1207"
"georgia","1208"
"georgia southern","1204"
"georgia st","1209"
"georgia st.","1209"
"georgia state","1209"
"georgia tech","1210"
"georgia-southern","1204"
"georgia-state","1209"
"georgia-tech","1210"
"gonzaga","1211"
"grambling","1212"
"grambling st.","1212"
"grambling-state","1212"
"grand canyon","1213"
"grand-canyon","1213"
"green bay","1453"
"hampton","1214"
"hardin-simmons","1215"
"hartford","1216"
"harvard","1217"
"hawaii","1218"
"high point","1219"
"high-point","1219"
"hofstra","1220"
"holy cross","1221"
"holy-cross","1221"
"houston","1222"
"houston bap","1223"
"houston baptist","1223"
"houston-baptist","1223"
"howard","1224"
"idaho","1225"
"idaho st","1226"
"idaho st.","1226"
"idaho state","1226"
"idaho-state","1226"
"il chicago","1227"
"ill.-chicago","1227"
"illinois","1228"
"illinois st","1229"
"illinois st.","1229"
"illinois state","1229"
"illinois-chicago","1227"
"illinois-state","1229"
"incarnate word","1230"
"incarnate-word","1230"
"indiana","1231"
"indiana st","1232"
"indiana st.","1232"
"indiana state","1232"
"indiana-state","1232"
"iona","1233"
"iowa","1234"
"iowa st","1235"
"iowa st.","1235"
"iowa state","1235"
"iowa-state","1235"
"ipfw","1236"
"iupu-fort wayne","1236"
"iupu-fort-wayne","1236"
"iupui","1237"
"jackson st","1238"
"jackson st.","1238"
"jackson state","1238"
"jackson-state","1238"
"jacksonville","1239"
"jacksonville st","1240"
"jacksonville st.","1240"
"jacksonville state","1240"
"jacksonville-state","1240"
"james madison","1241"
"james-madison","1241"
"kansas","1242"
"kansas st","1243"
"kansas st.","1243"
"kansas state","1243"
"kansas-state","1243"
"kennesaw","1244"
"kennesaw st.","1244"
"kennesaw-state","1244"
"kent","1245"
"kent st.","1245"
"kent state","1245"
"kent-state","1245"
"kentucky","1246"
"la salle","1247"
"la-salle","1247"
"la.-lafayette","1418"
"la.-monroe","1419"
"lafayette","1248"
"lamar","1249"
"lehigh","1250"
"liberty","1251"
"lipscomb","1252"
"liu brooklyn","1254"
"long beach st","1253"
"long beach st.","1253"
"long beach state","1253"
"long island","1254"
"long island university","1254"
"long-beach-state","1253"
"long-island","1254"
"longwood","1255"
"louisiana state","1261"
"louisiana tech","1256"
"louisiana-lafayette","1418"
"louisiana-monroe","1419"
"louisiana-tech","1256"
"louisville","1257"
"loy marymount","1258"
"loyola (il)","1260"
"loyola (md)","1259"
"loyola chicago","1260"
"loyola maryland","1259"
"loyola marymount","1258"
"loyola md","1259"
"loyola-chicago","1260"
"loyola-il","1260"
"loyola-maryland","1259"
"loyola-marymount","1258"
"loyola-md","1259"
"lsu","1261"
"ma lowell","1262"
"maine","1263"
"manhattan","1264"
"marist","1265"
"marquette","1266"
"marshall","1267"
"maryland","1268"
"maryland-baltimore county","1420"
"maryland-baltimore-county","1420"
"maryland-eastern shore","1271"
"maryland-eastern-shore","1271"
"massachusetts","1269"
"mcneese st","1270"
"mcneese st.","1270"
"mcneese state","1270"
"mcneese-state","1270"
"md e shore","1271"
"md. eastern shore","1271"
"memphis","1272"
"mercer","1273"
"miami (fl)","1274"
"miami (oh)","1275"
"miami fl","1274"
"miami oh","1275"
"miami-fl","1274"
"miami-florida","1274"
"miami-oh","1275"
"miami-ohio","1275"
"michigan","1276"
"michigan st","1277"
"michigan st.","1277"
"michigan state","1277"
"michigan-state","1277"
"middle tenn st","1292"
"middle tenn st.","1292"
"middle tenn.","1292"
"middle tennessee","1292"
"middle-tennessee-state","1292"
"milwaukee","1454"
"minnesota","1278"
"miss valley st.","1290"
"mississippi","1279"
"mississippi st","1280"
"mississippi st.","1280"
"mississippi state","1280"
"mississippi val.","1290"
"mississippi valley state","1290"
"mississippi-state","1280"
"mississippi-valley-state","1290"
"missouri","1281"
"missouri kc","1282"
"missouri st","1283"
"missouri st.","1283"
"missouri state","1283"
"missouri-kansas city","1282"
"missouri-kansas-city","1282"
"missouri-state","1283"
"mo kansas city","1282"
"monmouth","1284"
"monmouth nj","1284"
"montana","1285"
"montana st","1286"
"montana st.","1286"
"montana state","1286"
"montana-state","1286"
"morehead st","1287"
"morehead st.","1287"
"morehead state","1287"
"morehead-state","1287"
"morgan st","1288"
"morgan st.","1288"
"morgan state","1288"
"morgan-state","1288"
"morris brown","1289"
"morris-brown","1289"
"mount st. mary's","1291"
"mount-st-marys","1291"
"ms valley st","1290"
"mt st mary's","1291"
"mt. st. mary`s","1291"
"mtsu","1292"
"murray st","1293"
"murray st.","1293"
"murray state","1293"
"murray-state","1293"
"mvsu(miss. valley st","1290"
"n colorado","1294"
"n dakota st","1295"
"n illinois","1296"
"n kentucky","1297"
"n. carolina a&t","1299"
"n.c. a&t","1299"
"n.c. central","1300"
"navy","1298"
"nc a&t","1299"
"nc asheville","1421"
"nc central","1300"
"nc charlotte","1150"
"nc greensboro","1422"
"nc state","1301"
"nc wilmington","1423"
"ne illinois","1302"
"ne omaha","1303"
"nebraska","1304"
"nebraska-omaha","1303"
"nevada","1305"
"nevada-las vegas","1424"
"new hampshire","1306"
"new mexico","1307"
"new mexico st","1308"
"new mexico st.","1308"
"new mexico state","1308"
"new orleans","1309"
"new-hampshire","1306"
"new-jersey-tech","1312"
"new-mexico","1307"
"new-mexico-state","1308"
"new-orleans","1309"
"niagara","1310"
"nicholls st","1311"
"nicholls st.","1311"
"nicholls state","1311"
"nicholls-state","1311"
"njit","1312"
"norfolk st","1313"
"norfolk st.","1313"
"norfolk state","1313"
"norfolk-state","1313"
"north carolina","1314"
"north carolina a&t","1299"
"north carolina st.","1301"
"north carolina state","1301"
"north carolina-asheville","1421"
"north carolina-greensboro","1422"
"north carolina-wilmington","1423"
"north dakota","1315"
"north dakota st.","1295"
"north florida","1316"
"north texas","1317"
"north-carolina","1314"
"north-carolina-asheville","1421"
"north-carolina-at","1299"
"north-carolina-central","1300"
"north-carolina-charlotte","1150"
"north-carolina-greensboro","1422"
"north-carolina-state","1301"
"north-carolina-wilmington","1423"
"north-dakota","1315"
"north-dakota-state","1295"
"north-florida","1316"
"north-texas","1317"
"northeastern","1318"
"northeastern illinois","1302"
"northern ariz.","1319"
"northern arizona","1319"
"northern colo.","1294"
"northern colorado","1294"
"northern ill.","1296"
"northern illinois","1296"
"northern iowa","1320"
"northern kentucky","1297"
"northern ky.","1297"
"northern-arizona","1319"
"northern-colorado","1294"
"northern-illinois","1296"
"northern-iowa","1320"
"northern-kentucky","1297"
"northwestern","1321"
"northwestern la","1322"
"northwestern st.","1322"
"northwestern state","1322"
"northwestern-state","1322"
"notre dame","1323"
"notre-dame","1323"
"oakland","1324"
"ohio","1325"
"ohio st","1326"
"ohio st.","1326"
"ohio state","1326"
"ohio-state","1326"
"okla city","1327"
"oklahoma","1328"
"oklahoma city","1327"
"oklahoma st","1329"
"oklahoma st.","1329"
"oklahoma state","1329"
"oklahoma-state","1329"
"old dominion","1330"
"old-dominion","1330"
"ole miss","1279"
"omaha","1303"
"oral roberts","1331"
"oral-roberts","1331"
"oregon","1332"
"oregon st","1333"
"oregon st.","1333"
"oregon state","1333"
"oregon-state","1333"
"pacific","1334"
"penn","1335"
"penn st","1336"
"penn st.","1336"
"penn state","1336"
"penn-state","1336"
"pennsylvania","1335"
"pepperdine","1337"
"pittsburgh","1338"
"portland","1339"
"portland st","1340"
"portland st.","1340"
"portland state","1340"
"portland-state","1340"
"prairie view","1341"
"prairie-view-am","1341"
"presbyterian","1342"
"princeton","1343"
"providence","1344"
"purdue","1345"
"quinnipiac","1346"
"radford","1347"
"rhode island","1348"
"rhode-island","1348"
"rice","1349"
"richmond","1350"
"rider","1351"
"robert morris","1352"
"robert-morris","1352"
"rutgers","1353"
"s carolina st","1354"
"s dakota st","1355"
"s illinois","1356"
"sacramento st.","1170"
"sacramento state","1170"
"sacramento-state","1170"
"sacred heart","1357"
"sacred-heart","1357"
"saint francis (pa)","1384"
"saint joseph's","1386"
"saint joseph`s","1386"
"saint louis","1387"
"saint mary's (ca)","1388"
"saint peter's","1389"
"saint peter`s","1389"
"saint-louis","1387"
"saint-marys","1388"
"sam houston st","1358"
"sam houston st.","1358"
"sam houston state","1358"
"sam-houston-state","1358"
"samford","1359"
"san diego","1360"
"san diego st","1361"
"san diego st.","1361"
"san diego state","1361"
"san francisco","1362"
"san jose st","1363"
"san jose st.","1363"
"san jose state","1363"
"san-diego","1360"
"san-diego-state","1361"
"san-francisco","1362"
"san-jose-state","1363"
"santa barbara","1364"
"santa clara","1365"
"santa-clara","1365"
"savannah st","1366"
"savannah st.","1366"
"savannah state","1366"
"savannah-state","1366"
"sc upstate","1367"
"se louisiana","1368"
"se missouri st","1369"
"se missouri st.","1369"
"se missouri st.(se","1369"
"seattle","1370"
"seton hall","1371"
"seton-hall","1371"
"sf austin","1372"
"siena","1373"
"siu edwardsville","1188"
"siu-edwardsville","1188"
"smu","1374"
"south ala.","1375"
"south alabama","1375"
"south carolina","1376"
"south carolina st.","1354"
"south carolina state","1354"
"south carolina upstat","1367"
"south dakota","1377"
"south dakota st.","1355"
"south fla.","1378"
"south florida","1378"
"south-alabama","1375"
"south-carolina","1376"
"south-carolina-state","1354"
"south-dakota","1377"
"south-dakota-state","1355"
"south-florida","1378"
"southeast missouri state","1369"
"southeast mo. st.","1369"
"southeast-missouri-state","1369"
"southeastern la.","1368"
"southeastern louisiana","1368"
"southeastern-louisiana","1368"
"southern","1380"
"southern california","1425"
"southern ill.","1356"
"southern illinois","1356"
"southern methodist","1374"
"southern miss","1379"
"southern miss.","1379"
"southern mississippi","1379"
"southern u.","1380"
"southern univ","1380"
"southern utah","1381"
"southern-california","1425"
"southern-illinois","1356"
"southern-methodist","1374"
"southern-miss","1379"
"southern-university","1380"
"southern-utah","1381"
"st bonaventure","1382"
"st francis ny","1383"
"st francis pa","1384"
"st john's","1385"
"st joseph's pa","1386"
"st louis","1387"
"st mary's ca","1388"
"st peter's","1389"
"st-bonaventure","1382"
"st-francis-ny","1383"
"st-francis-pa","1384"
"st-johns","1385"
"st-josephs-pa","1386"
"st-peters","1389"
"st. bonaventure","1382"
"st. francis (ny)","1383"
"st. francis (pa)","1384"
"st. francis brooklyn","1383"
"st. francis-ny","1383"
"st. john's","1385"
"st. john's (ny)","1385"
"st. john`s (ny)","1385"
"st. joseph's pa","1386"
"st. mary's","1388"
"st. mary`s (ca)","1388"
"st. peter's","1389"
"stanford","1390"
"stephen f. austin","1372"
"stephen-f-austin","1372"
"stetson","1391"
"stony brook","1392"
"stony-brook","1392"
"sw missouri st.","1283"
"syracuse","1393"
"tam c. christi","1394"
"tcu","1395"
"temple","1396"
"tennessee","1397"
"tennessee st","1398"
"tennessee st.","1398"
"tennessee state","1398"
"tennessee tech","1399"
"tennessee-martin","1404"
"tennessee-state","1398"
"tennessee-tech","1399"
"tex.-pan american","1410"
"texas","1400"
"texas a&m","1401"
"texas a&m corpus","1394"
"texas a&m-corpus christi","1394"
"texas arlington","1426"
"texas christian","1395"
"texas san antonio","1427"
"texas southern","1411"
"texas st","1402"
"texas st.","1402"
"texas state","1402"
"texas tech","1403"
"texas-am","1401"
"texas-am-corpus-christi","1394"
"texas-arlington","1426"
"texas-christian","1395"
"texas-el paso","1431"
"texas-el-paso","1431"
"texas-pan american","1410"
"texas-pan-american","1410"
"texas-san antonio","1427"
"texas-san antonio(ut","1427"
"texas-san-antonio","1427"
"texas-southern","1411"
"texas-state","1402"
"texas-tech","1403"
"tn martin","1404"
"toledo","1405"
"towson","1406"
"troy","1407"
"troy st.","1407"
"tulane","1408"
"tulsa","1409"
"tx pan american","1410"
"tx southern","1411"
"uab","1412"
"ualr","1114"
"uc davis","1413"
"uc irvine","1414"
"uc riverside","1415"
"uc santa barbara","1364"
"ucf","1416"
"ucla","1417"
"uconn","1163"
"ull","1418"
"ulm","1419"
"umass lowell","1262"
"umass-lowell","1262"
"umbc","1420"
"umes","1271"
"umkc","1282"
"unc asheville","1421"
"unc greensboro","1422"
"unc wilmington","1423"
"uni","1320"
"unlv","1424"
"usc","1425"
"usc upstate","1367"
"usc-upstate","1367"
"ut arlington","1426"
"ut martin","1404"
"ut san antonio","1427"
"utah","1428"
"utah st","1429"
"utah st.","1429"
"utah state","1429"
"utah valley","1430"
"utah valley st.","1430"
"utah-state","1429"
"utah-valley-state","1430"
"utep","1431"
"utica","1432"
"utsa","1427"
"va commonwealth","1433"
"valparaiso","1434"
"vanderbilt","1435"
"vcu","1433"
"vcu(va. commonwealth","1433"
"vermont","1436"
"villanova","1437"
"virginia","1438"
"virginia commonwealth","1433"
"virginia military institute","1440"
"virginia tech","1439"
"virginia-commonwealth","1433"
"virginia-military-institute","1440"
"virginia-tech","1439"
"vmi","1440"
"w carolina","1441"
"w illinois","1442"
"w kentucky","1443"
"w michigan","1444"
"w salem st","1445"
"w texas a&m","1446"
"wagner","1447"
"wake forest","1448"
"wake-forest","1448"
"washington","1449"
"washington st","1450"
"washington st.","1450"
"washington state","1450"
"washington-state","1450"
"weber st","1451"
"weber st.","1451"
"weber state","1451"
"weber-state","1451"
"west texas a&m","1446"
"west virginia","1452"
"west-virginia","1452"
"western caro.","1441"
"western carolina","1441"
"western ill.","1442"
"western illinois","1442"
"western kentucky","1443"
"western ky.","1443"
"western mich.","1444"
"western michigan","1444"
"western-carolina","1441"
"western-illinois","1442"
"western-kentucky","1443"
"western-michigan","1444"
"wi green bay","1453"
"wi milwaukee","1454"
"wichita st","1455"
"wichita st.","1455"
"wichita state","1455"
"wichita-state","1455"
"william & mary","1456"
"william-mary","1456"
"winston salem","1445"
"winston-salem","1445"
"winston-salem-state","1445"
"winthrop","1457"
"wisconsin","1458"
"wisconsin-green bay","1453"
"wisconsin-green-bay","1453"
"wisconsin-milwaukee","1454"
"wofford","1459"
"wright st","1460"
"wright st.","1460"
"wright state","1460"
"wright-state","1460"
"wyoming","1461"
"xavier","1462"
"yale","1463"
"youngstown st","1464"
"youngstown st.","1464"
"youngstown state","1464"
"youngstown-state","1464"
"st mary's (ca)","1388"
"southern un","1380"
"ms valley state","1290"
"st francis (ny)","1383"
"st francis (pa)","1384"
"mt st. mary's","1291"
"st joseph's","1386"
"s carolina state","1354"
"se missouri state","1369"
"st john's (ny)","1385"
"loyola-c","1260"
"tam c","1394"
