{
    "status": "success",
    "code": 200,
    "data": {
        "stories": [
            {
                "id": 1,
                "title": "Ersteinzahlung Sport",
                "image": "https://dwmu1hf7ovvid.cloudfront.net/site/upload/stories/jpg_mini/mini_3.jpg",
                "slides": [
                    {
                        "tag": "Promo",
                        "type": "Sport",
                        "title": "Ersteinzahlung Sport",
                        "text": "Risikolose Wetten auf Dutzende Sportarten mit unserem 100 % Freiwetten-Bonus.",
                        "image": "https://dwmu1hf7ovvid.cloudfront.net/site/upload/stories/jpg_story_comp/Story_3.jpg",
                        "action": "Mehr erfahren",
                        "action_url": "https://svkzjv.com/promotions/first-deposit-sport?webView=true"
                    }
                ]
            },
            {
                "id": 2,
                "title": "Samstags-Reload",
                "image": "https://dwmu1hf7ovvid.cloudfront.net/site/upload/stories/jpg_mini/mini_5.jpg",
                "slides": [
                    {
                        "tag": "Promo",
                        "type": "Sport",
                        "title": "Samstags-Reload",
                        "text": "Genießen Sie jeden Samstag einen wöchentlichen Sportbonus.",
                        "image": "https://dwmu1hf7ovvid.cloudfront.net/site/upload/stories/jpg_story_comp/Story_5.jpg",
                        "action": "Mehr erfahren",
                        "action_url": "https://svkzjv.com/promotions/saturday-reload?webView=true"
                    }
                ]
            },
            {
                "id": 3,
                "title": "Sport-VIP-Programm",
                "image": "https://dwmu1hf7ovvid.cloudfront.net/site/upload/stories/jpg_mini/mini_6.jpg",
                "slides": [
                    {
                        "tag": "Promo",
                        "type": "Sport",
                        "title": "Sport-VIP-Programm",
                        "text": "Nehmen Sie an unserem Sport-VIP-Programm für exklusive Wettangebote auf beliebte Veranstaltungen teil.",
                        "image": "https://dwmu1hf7ovvid.cloudfront.net/site/upload/stories/jpg_story_comp/Story_6.jpg",
                        "action": "Mehr erfahren",
                        "action_url": "https://svkzjv.com/sport-vip-programs?webView=true"
                    }
                ]
            }
        ]
    }
}
