{
    "status": "success",
    "code": 200,
    "data": {
        "stories": [
            {
                "id": 1,
                "title": "Premier dépôt pour les sports",
                "image": "https://dwmu1hf7ovvid.cloudfront.net/site/upload/stories/jpg_mini/mini_3.jpg",
                "slides": [
                    {
                        "tag": "Promo",
                        "type": "Sport",
                        "title": "Premier dépôt pour les sports",
                        "text": "Essayez de parier sans risque sur des dizaines de disciplines sportives grâce à notre bonus de pari gratuit de 100%.",
                        "image": "https://dwmu1hf7ovvid.cloudfront.net/site/upload/stories/jpg_story_comp/Story_3.jpg",
                        "action": "Plus d'infos",
                        "action_url": "https://svkzjv.com/promotions/first-deposit-sport?webView=true"
                    }
                ]
            },
            {
                "id": 2,
                "title": "Rechargement du Samedi",
                "image": "https://dwmu1hf7ovvid.cloudfront.net/site/upload/stories/jpg_mini/mini_5.jpg",
                "slides": [
                    {
                        "tag": "Promo",
                        "type": "Sport",
                        "title": "Rechargement du Samedi",
                        "text": "Bénéficiez d'un bonus de sport hebdomadaire tous les samedis.",
                        "image": "https://dwmu1hf7ovvid.cloudfront.net/site/upload/stories/jpg_story_comp/Story_5.jpg",
                        "action": "Plus d'infos",
                        "action_url": "https://svkzjv.com/promotions/saturday-reload?webView=true"
                    }
                ]
            },
            {
                "id": 3,
                "title": "Programme Sport VIP",
                "image": "https://dwmu1hf7ovvid.cloudfront.net/site/upload/stories/jpg_mini/mini_6.jpg",
                "slides": [
                    {
                        "tag": "Promo",
                        "type": "Sport",
                        "title": "Programme Sport VIP",
                        "text": "Rejoignez notre programme Sports VIP pour bénéficier d'offres de paris exclusives sur les événements les plus attendus.",
                        "image": "https://dwmu1hf7ovvid.cloudfront.net/site/upload/stories/jpg_story_comp/Story_6.jpg",
                        "action": "Plus d'infos",
                        "action_url": "https://svkzjv.com/sport-vip-programs?webView=true"
                    }
                ]
            }
        ]
    }
}
