
CONTROL FLOW GRAPH SSA

void main()
main: scope:[main]  from __start
  *main::SCREEN = main::state
  to:main::@return
main::@return: scope:[main]  from main
  return 
  to:@return

void __start()
__start: scope:[__start]  from
  call main
  to:__start::@1
__start::@1: scope:[__start]  from __start
  to:__start::@return
__start::@return: scope:[__start]  from __start::@1
  return 
  to:@return

SYMBOL TABLE SSA
__constant char BROKEN = 4*4+2+1
__constant char State::BROKEN = 4*4+2+1
__constant char State::OFF = 0
__constant char State::ON = 4*4+2
void __start()
void main()
__constant char * const main::SCREEN = (char *)$400
__constant char main::state = BROKEN

Adding number conversion cast (unumber) 4*4+2 in 
Successful SSA optimization PassNAddNumberTypeConversions
Simplifying constant pointer cast (char *) 1024
Successful SSA optimization PassNCastSimplification
Removing unused procedure __start
Removing unused procedure block __start
Removing unused procedure block __start::@1
Removing unused procedure block __start::@return
Successful SSA optimization PassNEliminateEmptyStart
Constant inlined main::state = BROKEN
Successful SSA optimization Pass2ConstantInlining
Finalized unsigned number type (char) 4
Finalized unsigned number type (char) 4
Finalized unsigned number type (char) 2
Successful SSA optimization PassNFinalizeNumberTypeConversions
Simplifying constant integer cast 4*4+2
Successful SSA optimization PassNCastSimplification
CALL GRAPH

Created 0 initial phi equivalence classes
Coalesced down to 0 phi equivalence classes

FINAL CONTROL FLOW GRAPH

void main()
main: scope:[main]  from
  [0] *main::SCREEN = BROKEN
  to:main::@return
main::@return: scope:[main]  from main
  [1] return 
  to:@return


VARIABLE REGISTER WEIGHTS
void main()

Initial phi equivalence classes
Complete equivalence classes
REGISTER UPLIFT POTENTIAL REGISTERS
Statement [0] *main::SCREEN = BROKEN [ ] (  [ ] { }  ) always clobbers reg byte a 

REGISTER UPLIFT SCOPES
Uplift Scope [State] 
Uplift Scope [main] 
Uplift Scope [] 

Uplifting [State] best 15 combination 
Uplifting [main] best 15 combination 
Uplifting [] best 15 combination 

ASSEMBLER BEFORE OPTIMIZATION
  // File Comments
// Test of simple enum - value with complex calculation
  // Upstart
  // Commodore 64 PRG executable file
.file [name="enum-3.prg", type="prg", segments="Program"]
.segmentdef Program [segments="Basic, Code, Data"]
.segmentdef Basic [start=$0801]
.segmentdef Code [start=$80d]
.segmentdef Data [startAfter="Code"]
.segment Basic
:BasicUpstart(main)
  // Global Constants & labels
  .const BROKEN = 4*4+2+1
.segment Code
  // main
main: {
    .label SCREEN = $400
    // [0] *main::SCREEN = BROKEN -- _deref_pbuc1=vbuc2 
    lda #BROKEN
    sta SCREEN
    jmp __breturn
    // main::@return
  __breturn:
    // [1] return 
    rts
}
  // File Data

ASSEMBLER OPTIMIZATIONS
Removing instruction jmp __breturn
Succesful ASM optimization Pass5NextJumpElimination
Removing instruction __breturn:
Succesful ASM optimization Pass5UnusedLabelElimination

FINAL SYMBOL TABLE
__constant char BROKEN = 4*4+2+1
__constant char State::BROKEN = 4*4+2+1
__constant char State::OFF = 0
__constant char State::ON = 4*4+2
void main()
__constant char * const main::SCREEN = (char *) 1024



FINAL ASSEMBLER
Score: 12

  // File Comments
// Test of simple enum - value with complex calculation
  // Upstart
  // Commodore 64 PRG executable file
.file [name="enum-3.prg", type="prg", segments="Program"]
.segmentdef Program [segments="Basic, Code, Data"]
.segmentdef Basic [start=$0801]
.segmentdef Code [start=$80d]
.segmentdef Data [startAfter="Code"]
.segment Basic
:BasicUpstart(main)
  // Global Constants & labels
  .const BROKEN = 4*4+2+1
.segment Code
  // main
main: {
    .label SCREEN = $400
    // *SCREEN = state
    // [0] *main::SCREEN = BROKEN -- _deref_pbuc1=vbuc2 
    lda #BROKEN
    sta SCREEN
    // main::@return
    // }
    // [1] return 
    rts
}
  // File Data

