{
    "miasto": {
      "warstwadz": "miasto-7D",
	  "tytulWypisu":"miasta ....",
	  "nazwaSzablonu":"wzor",
	  "nazwaFolderuDoWypisow": "Miasto",
	  "nazwaGrupyZWarstwamiPlanu": "test",
      "obreby": {
          "1": {
            "nrobr": "1",
            "warstplan": "plan"
          },
          "2": {
            "nrobr": "2",
            "warstplan": "plan"
          },
          "3": {
            "nrobr": "3",
            "warstplan": "plan"
          },
          "4": {
            "nrobr": "4",
            "warstplan": "plan"
          },
          "5": {
            "nrobr": "5",
            "warstplan": "plan"
          }
  }
},
  "wies": {
    "warstwadz": "wies-7D",
	"tytulWypisu":"wsi",
    "obreby": {
      "test": {
        "nrobr": "1",
        "nazwaGrupyZWarstwamiPlanu": "plan-wies"
      }
      }
    },
  "pozostale": {
    "nazwaPolaNrDzialekDoWyszukiwania":"NUMER",
    "nazwaWarstwyZWyszukanymiDzialkami":"wyszukane",
    "nrKolWWarstwiePlanuZSymbolem": 1,
    "nrKolWWarstwiePlanuZPrzeznaczeniem": 2,
	"lokalizacjaFolderuZSzablonami":"C:\\Users\\Mariusz\\Desktop\\test\\szablony\\",
	"nazwaWarstwyPlanu":"test",
	"lokalizacjaFolderuZWypisami":"C:\\Users\\Mariusz\\Desktop\\test\\wypisy\\",
	"procentOdJakiegoMaPojawiacSiePrzeznaczenie": 0.1
  }
}
