('C:\\projekty_python\\wlasne_projekty\\resizer\\build\\res\\out00-PYZ.pyz',
 [('ntpath', 'C:\\Python36\\lib\\ntpath.py', 'PYMODULE'),
  ('_strptime', 'C:\\Python36\\lib\\_strptime.py', 'PYMODULE'),
  ('datetime', 'C:\\Python36\\lib\\datetime.py', 'PYMODULE'),
  ('stringprep', 'C:\\Python36\\lib\\stringprep.py', 'PYMODULE'),
  ('stat', 'C:\\Python36\\lib\\stat.py', 'PYMODULE'),
  ('genericpath', 'C:\\Python36\\lib\\genericpath.py', 'PYMODULE'),
  ('posixpath', 'C:\\Python36\\lib\\posixpath.py', 'PYMODULE'),
  ('fnmatch', 'C:\\Python36\\lib\\fnmatch.py', 'PYMODULE'),
  ('_compat_pickle', 'C:\\Python36\\lib\\_compat_pickle.py', 'PYMODULE'),
  ('__future__', 'C:\\Python36\\lib\\__future__.py', 'PYMODULE'),
  ('difflib', 'C:\\Python36\\lib\\difflib.py', 'PYMODULE'),
  ('ast', 'C:\\Python36\\lib\\ast.py', 'PYMODULE'),
  ('inspect', 'C:\\Python36\\lib\\inspect.py', 'PYMODULE'),
  ('cmd', 'C:\\Python36\\lib\\cmd.py', 'PYMODULE'),
  ('bdb', 'C:\\Python36\\lib\\bdb.py', 'PYMODULE'),
  ('opcode', 'C:\\Python36\\lib\\opcode.py', 'PYMODULE'),
  ('dis', 'C:\\Python36\\lib\\dis.py', 'PYMODULE'),
  ('codeop', 'C:\\Python36\\lib\\codeop.py', 'PYMODULE'),
  ('code', 'C:\\Python36\\lib\\code.py', 'PYMODULE'),
  ('glob', 'C:\\Python36\\lib\\glob.py', 'PYMODULE'),
  ('shlex', 'C:\\Python36\\lib\\shlex.py', 'PYMODULE'),
  ('importlib._bootstrap',
   'C:\\Python36\\lib\\importlib\\_bootstrap.py',
   'PYMODULE'),
  ('importlib._bootstrap_external',
   'C:\\Python36\\lib\\importlib\\_bootstrap_external.py',
   'PYMODULE'),
  ('importlib.machinery',
   'C:\\Python36\\lib\\importlib\\machinery.py',
   'PYMODULE'),
  ('importlib.util', 'C:\\Python36\\lib\\importlib\\util.py', 'PYMODULE'),
  ('importlib.abc', 'C:\\Python36\\lib\\importlib\\abc.py', 'PYMODULE'),
  ('importlib', 'C:\\Python36\\lib\\importlib\\__init__.py', 'PYMODULE'),
  ('pkgutil', 'C:\\Python36\\lib\\pkgutil.py', 'PYMODULE'),
  ('xml', 'C:\\Python36\\lib\\xml\\__init__.py', 'PYMODULE'),
  ('xml.sax.expatreader',
   'C:\\Python36\\lib\\xml\\sax\\expatreader.py',
   'PYMODULE'),
  ('xml.sax.saxutils', 'C:\\Python36\\lib\\xml\\sax\\saxutils.py', 'PYMODULE'),
  ('urllib.request', 'C:\\Python36\\lib\\urllib\\request.py', 'PYMODULE'),
  ('getpass', 'C:\\Python36\\lib\\getpass.py', 'PYMODULE'),
  ('nturl2path', 'C:\\Python36\\lib\\nturl2path.py', 'PYMODULE'),
  ('ftplib', 'C:\\Python36\\lib\\ftplib.py', 'PYMODULE'),
  ('netrc', 'C:\\Python36\\lib\\netrc.py', 'PYMODULE'),
  ('http.cookiejar', 'C:\\Python36\\lib\\http\\cookiejar.py', 'PYMODULE'),
  ('urllib.response', 'C:\\Python36\\lib\\urllib\\response.py', 'PYMODULE'),
  ('urllib.error', 'C:\\Python36\\lib\\urllib\\error.py', 'PYMODULE'),
  ('xml.sax', 'C:\\Python36\\lib\\xml\\sax\\__init__.py', 'PYMODULE'),
  ('xml.sax.handler', 'C:\\Python36\\lib\\xml\\sax\\handler.py', 'PYMODULE'),
  ('xml.sax._exceptions',
   'C:\\Python36\\lib\\xml\\sax\\_exceptions.py',
   'PYMODULE'),
  ('xml.sax.xmlreader',
   'C:\\Python36\\lib\\xml\\sax\\xmlreader.py',
   'PYMODULE'),
  ('xml.parsers', 'C:\\Python36\\lib\\xml\\parsers\\__init__.py', 'PYMODULE'),
  ('xml.parsers.expat',
   'C:\\Python36\\lib\\xml\\parsers\\expat.py',
   'PYMODULE'),
  ('plistlib', 'C:\\Python36\\lib\\plistlib.py', 'PYMODULE'),
  ('platform', 'C:\\Python36\\lib\\platform.py', 'PYMODULE'),
  ('urllib.parse', 'C:\\Python36\\lib\\urllib\\parse.py', 'PYMODULE'),
  ('tempfile', 'C:\\Python36\\lib\\tempfile.py', 'PYMODULE'),
  ('tty', 'C:\\Python36\\lib\\tty.py', 'PYMODULE'),
  ('pydoc_data', 'C:\\Python36\\lib\\pydoc_data\\__init__.py', 'PYMODULE'),
  ('pydoc_data.topics', 'C:\\Python36\\lib\\pydoc_data\\topics.py', 'PYMODULE'),
  ('html.entities', 'C:\\Python36\\lib\\html\\entities.py', 'PYMODULE'),
  ('html', 'C:\\Python36\\lib\\html\\__init__.py', 'PYMODULE'),
  ('ipaddress', 'C:\\Python36\\lib\\ipaddress.py', 'PYMODULE'),
  ('ssl', 'C:\\Python36\\lib\\ssl.py', 'PYMODULE'),
  ('http.client', 'C:\\Python36\\lib\\http\\client.py', 'PYMODULE'),
  ('mimetypes', 'C:\\Python36\\lib\\mimetypes.py', 'PYMODULE'),
  ('socketserver', 'C:\\Python36\\lib\\socketserver.py', 'PYMODULE'),
  ('http', 'C:\\Python36\\lib\\http\\__init__.py', 'PYMODULE'),
  ('http.server', 'C:\\Python36\\lib\\http\\server.py', 'PYMODULE'),
  ('optparse', 'C:\\Python36\\lib\\optparse.py', 'PYMODULE'),
  ('uu', 'C:\\Python36\\lib\\uu.py', 'PYMODULE'),
  ('quopri', 'C:\\Python36\\lib\\quopri.py', 'PYMODULE'),
  ('email.feedparser', 'C:\\Python36\\lib\\email\\feedparser.py', 'PYMODULE'),
  ('email.parser', 'C:\\Python36\\lib\\email\\parser.py', 'PYMODULE'),
  ('email', 'C:\\Python36\\lib\\email\\__init__.py', 'PYMODULE'),
  ('calendar', 'C:\\Python36\\lib\\calendar.py', 'PYMODULE'),
  ('email._parseaddr', 'C:\\Python36\\lib\\email\\_parseaddr.py', 'PYMODULE'),
  ('email.utils', 'C:\\Python36\\lib\\email\\utils.py', 'PYMODULE'),
  ('email.errors', 'C:\\Python36\\lib\\email\\errors.py', 'PYMODULE'),
  ('email.header', 'C:\\Python36\\lib\\email\\header.py', 'PYMODULE'),
  ('email._policybase', 'C:\\Python36\\lib\\email\\_policybase.py', 'PYMODULE'),
  ('email.base64mime', 'C:\\Python36\\lib\\email\\base64mime.py', 'PYMODULE'),
  ('email.encoders', 'C:\\Python36\\lib\\email\\encoders.py', 'PYMODULE'),
  ('email.charset', 'C:\\Python36\\lib\\email\\charset.py', 'PYMODULE'),
  ('base64', 'C:\\Python36\\lib\\base64.py', 'PYMODULE'),
  ('email._encoded_words',
   'C:\\Python36\\lib\\email\\_encoded_words.py',
   'PYMODULE'),
  ('hashlib', 'C:\\Python36\\lib\\hashlib.py', 'PYMODULE'),
  ('bisect', 'C:\\Python36\\lib\\bisect.py', 'PYMODULE'),
  ('random', 'C:\\Python36\\lib\\random.py', 'PYMODULE'),
  ('email.generator', 'C:\\Python36\\lib\\email\\generator.py', 'PYMODULE'),
  ('email.iterators', 'C:\\Python36\\lib\\email\\iterators.py', 'PYMODULE'),
  ('urllib', 'C:\\Python36\\lib\\urllib\\__init__.py', 'PYMODULE'),
  ('email._header_value_parser',
   'C:\\Python36\\lib\\email\\_header_value_parser.py',
   'PYMODULE'),
  ('email.headerregistry',
   'C:\\Python36\\lib\\email\\headerregistry.py',
   'PYMODULE'),
  ('email.quoprimime', 'C:\\Python36\\lib\\email\\quoprimime.py', 'PYMODULE'),
  ('email.contentmanager',
   'C:\\Python36\\lib\\email\\contentmanager.py',
   'PYMODULE'),
  ('email.policy', 'C:\\Python36\\lib\\email\\policy.py', 'PYMODULE'),
  ('email.message', 'C:\\Python36\\lib\\email\\message.py', 'PYMODULE'),
  ('bz2', 'C:\\Python36\\lib\\bz2.py', 'PYMODULE'),
  ('lzma', 'C:\\Python36\\lib\\lzma.py', 'PYMODULE'),
  ('_compression', 'C:\\Python36\\lib\\_compression.py', 'PYMODULE'),
  ('gzip', 'C:\\Python36\\lib\\gzip.py', 'PYMODULE'),
  ('tarfile', 'C:\\Python36\\lib\\tarfile.py', 'PYMODULE'),
  ('py_compile', 'C:\\Python36\\lib\\py_compile.py', 'PYMODULE'),
  ('zipfile', 'C:\\Python36\\lib\\zipfile.py', 'PYMODULE'),
  ('shutil', 'C:\\Python36\\lib\\shutil.py', 'PYMODULE'),
  ('socket', 'C:\\Python36\\lib\\socket.py', 'PYMODULE'),
  ('webbrowser', 'C:\\Python36\\lib\\webbrowser.py', 'PYMODULE'),
  ('pydoc', 'C:\\Python36\\lib\\pydoc.py', 'PYMODULE'),
  ('getopt', 'C:\\Python36\\lib\\getopt.py', 'PYMODULE'),
  ('pdb', 'C:\\Python36\\lib\\pdb.py', 'PYMODULE'),
  ('unittest.util', 'C:\\Python36\\lib\\unittest\\util.py', 'PYMODULE'),
  ('unittest.result', 'C:\\Python36\\lib\\unittest\\result.py', 'PYMODULE'),
  ('string', 'C:\\Python36\\lib\\string.py', 'PYMODULE'),
  ('logging', 'C:\\Python36\\lib\\logging\\__init__.py', 'PYMODULE'),
  ('unittest.case', 'C:\\Python36\\lib\\unittest\\case.py', 'PYMODULE'),
  ('unittest.suite', 'C:\\Python36\\lib\\unittest\\suite.py', 'PYMODULE'),
  ('unittest.loader', 'C:\\Python36\\lib\\unittest\\loader.py', 'PYMODULE'),
  ('unittest.runner', 'C:\\Python36\\lib\\unittest\\runner.py', 'PYMODULE'),
  ('unittest.main', 'C:\\Python36\\lib\\unittest\\main.py', 'PYMODULE'),
  ('unittest.signals', 'C:\\Python36\\lib\\unittest\\signals.py', 'PYMODULE'),
  ('unittest', 'C:\\Python36\\lib\\unittest\\__init__.py', 'PYMODULE'),
  ('doctest', 'C:\\Python36\\lib\\doctest.py', 'PYMODULE'),
  ('pprint', 'C:\\Python36\\lib\\pprint.py', 'PYMODULE'),
  ('pickle', 'C:\\Python36\\lib\\pickle.py', 'PYMODULE'),
  ('tracemalloc', 'C:\\Python36\\lib\\tracemalloc.py', 'PYMODULE'),
  ('warnings', 'C:\\Python36\\lib\\warnings.py', 'PYMODULE'),
  ('enum', 'C:\\Python36\\lib\\enum.py', 'PYMODULE'),
  ('signal', 'C:\\Python36\\lib\\signal.py', 'PYMODULE'),
  ('contextlib', 'C:\\Python36\\lib\\contextlib.py', 'PYMODULE'),
  ('_threading_local', 'C:\\Python36\\lib\\_threading_local.py', 'PYMODULE'),
  ('threading', 'C:\\Python36\\lib\\threading.py', 'PYMODULE'),
  ('selectors', 'C:\\Python36\\lib\\selectors.py', 'PYMODULE'),
  ('_dummy_thread', 'C:\\Python36\\lib\\_dummy_thread.py', 'PYMODULE'),
  ('dummy_threading', 'C:\\Python36\\lib\\dummy_threading.py', 'PYMODULE'),
  ('subprocess', 'C:\\Python36\\lib\\subprocess.py', 'PYMODULE'),
  ('os', 'C:\\Python36\\lib\\os.py', 'PYMODULE'),
  ('token', 'C:\\Python36\\lib\\token.py', 'PYMODULE'),
  ('copy', 'C:\\Python36\\lib\\copy.py', 'PYMODULE'),
  ('textwrap', 'C:\\Python36\\lib\\textwrap.py', 'PYMODULE'),
  ('struct', 'C:\\Python36\\lib\\struct.py', 'PYMODULE'),
  ('gettext', 'C:\\Python36\\lib\\gettext.py', 'PYMODULE'),
  ('argparse', 'C:\\Python36\\lib\\argparse.py', 'PYMODULE'),
  ('tokenize', 'C:\\Python36\\lib\\tokenize.py', 'PYMODULE'),
  ('PIL.Image',
   'c:\\projekty_python\\wlasne_projekty\\resizer\\resizer\\lib\\site-packages\\PIL\\Image.py',
   'PYMODULE'),
  ('PIL.ImImagePlugin',
   'c:\\projekty_python\\wlasne_projekty\\resizer\\resizer\\lib\\site-packages\\PIL\\ImImagePlugin.py',
   'PYMODULE'),
  ('PIL.ImageFile',
   'c:\\projekty_python\\wlasne_projekty\\resizer\\resizer\\lib\\site-packages\\PIL\\ImageFile.py',
   'PYMODULE'),
  ('PIL.PdfImagePlugin',
   'c:\\projekty_python\\wlasne_projekty\\resizer\\resizer\\lib\\site-packages\\PIL\\PdfImagePlugin.py',
   'PYMODULE'),
  ('PIL.PdfParser',
   'c:\\projekty_python\\wlasne_projekty\\resizer\\resizer\\lib\\site-packages\\PIL\\PdfParser.py',
   'PYMODULE'),
  ('PIL.ImageSequence',
   'c:\\projekty_python\\wlasne_projekty\\resizer\\resizer\\lib\\site-packages\\PIL\\ImageSequence.py',
   'PYMODULE'),
  ('PIL.McIdasImagePlugin',
   'c:\\projekty_python\\wlasne_projekty\\resizer\\resizer\\lib\\site-packages\\PIL\\McIdasImagePlugin.py',
   'PYMODULE'),
  ('PIL.DdsImagePlugin',
   'c:\\projekty_python\\wlasne_projekty\\resizer\\resizer\\lib\\site-packages\\PIL\\DdsImagePlugin.py',
   'PYMODULE'),
  ('PIL.TgaImagePlugin',
   'c:\\projekty_python\\wlasne_projekty\\resizer\\resizer\\lib\\site-packages\\PIL\\TgaImagePlugin.py',
   'PYMODULE'),
  ('PIL.IcnsImagePlugin',
   'c:\\projekty_python\\wlasne_projekty\\resizer\\resizer\\lib\\site-packages\\PIL\\IcnsImagePlugin.py',
   'PYMODULE'),
  ('PIL.IcoImagePlugin',
   'c:\\projekty_python\\wlasne_projekty\\resizer\\resizer\\lib\\site-packages\\PIL\\IcoImagePlugin.py',
   'PYMODULE'),
  ('PIL.MspImagePlugin',
   'c:\\projekty_python\\wlasne_projekty\\resizer\\resizer\\lib\\site-packages\\PIL\\MspImagePlugin.py',
   'PYMODULE'),
  ('PIL.FpxImagePlugin',
   'c:\\projekty_python\\wlasne_projekty\\resizer\\resizer\\lib\\site-packages\\PIL\\FpxImagePlugin.py',
   'PYMODULE'),
  ('PIL.MpoImagePlugin',
   'c:\\projekty_python\\wlasne_projekty\\resizer\\resizer\\lib\\site-packages\\PIL\\MpoImagePlugin.py',
   'PYMODULE'),
  ('PIL.XbmImagePlugin',
   'c:\\projekty_python\\wlasne_projekty\\resizer\\resizer\\lib\\site-packages\\PIL\\XbmImagePlugin.py',
   'PYMODULE'),
  ('PIL.DcxImagePlugin',
   'c:\\projekty_python\\wlasne_projekty\\resizer\\resizer\\lib\\site-packages\\PIL\\DcxImagePlugin.py',
   'PYMODULE'),
  ('PIL.PcxImagePlugin',
   'c:\\projekty_python\\wlasne_projekty\\resizer\\resizer\\lib\\site-packages\\PIL\\PcxImagePlugin.py',
   'PYMODULE'),
  ('PIL.BufrStubImagePlugin',
   'c:\\projekty_python\\wlasne_projekty\\resizer\\resizer\\lib\\site-packages\\PIL\\BufrStubImagePlugin.py',
   'PYMODULE'),
  ('PIL.XVThumbImagePlugin',
   'c:\\projekty_python\\wlasne_projekty\\resizer\\resizer\\lib\\site-packages\\PIL\\XVThumbImagePlugin.py',
   'PYMODULE'),
  ('PIL.MicImagePlugin',
   'c:\\projekty_python\\wlasne_projekty\\resizer\\resizer\\lib\\site-packages\\PIL\\MicImagePlugin.py',
   'PYMODULE'),
  ('PIL.WmfImagePlugin',
   'c:\\projekty_python\\wlasne_projekty\\resizer\\resizer\\lib\\site-packages\\PIL\\WmfImagePlugin.py',
   'PYMODULE'),
  ('PIL.FtexImagePlugin',
   'c:\\projekty_python\\wlasne_projekty\\resizer\\resizer\\lib\\site-packages\\PIL\\FtexImagePlugin.py',
   'PYMODULE'),
  ('PIL.SunImagePlugin',
   'c:\\projekty_python\\wlasne_projekty\\resizer\\resizer\\lib\\site-packages\\PIL\\SunImagePlugin.py',
   'PYMODULE'),
  ('PIL.GbrImagePlugin',
   'c:\\projekty_python\\wlasne_projekty\\resizer\\resizer\\lib\\site-packages\\PIL\\GbrImagePlugin.py',
   'PYMODULE'),
  ('PIL.WebPImagePlugin',
   'c:\\projekty_python\\wlasne_projekty\\resizer\\resizer\\lib\\site-packages\\PIL\\WebPImagePlugin.py',
   'PYMODULE'),
  ('PIL.TiffImagePlugin',
   'c:\\projekty_python\\wlasne_projekty\\resizer\\resizer\\lib\\site-packages\\PIL\\TiffImagePlugin.py',
   'PYMODULE'),
  ('fractions', 'C:\\Python36\\lib\\fractions.py', 'PYMODULE'),
  ('decimal', 'C:\\Python36\\lib\\decimal.py', 'PYMODULE'),
  ('_pydecimal', 'C:\\Python36\\lib\\_pydecimal.py', 'PYMODULE'),
  ('PIL.TiffTags',
   'c:\\projekty_python\\wlasne_projekty\\resizer\\resizer\\lib\\site-packages\\PIL\\TiffTags.py',
   'PYMODULE'),
  ('PIL.FliImagePlugin',
   'c:\\projekty_python\\wlasne_projekty\\resizer\\resizer\\lib\\site-packages\\PIL\\FliImagePlugin.py',
   'PYMODULE'),
  ('PIL.FitsStubImagePlugin',
   'c:\\projekty_python\\wlasne_projekty\\resizer\\resizer\\lib\\site-packages\\PIL\\FitsStubImagePlugin.py',
   'PYMODULE'),
  ('PIL.PixarImagePlugin',
   'c:\\projekty_python\\wlasne_projekty\\resizer\\resizer\\lib\\site-packages\\PIL\\PixarImagePlugin.py',
   'PYMODULE'),
  ('PIL.PsdImagePlugin',
   'c:\\projekty_python\\wlasne_projekty\\resizer\\resizer\\lib\\site-packages\\PIL\\PsdImagePlugin.py',
   'PYMODULE'),
  ('PIL.MpegImagePlugin',
   'c:\\projekty_python\\wlasne_projekty\\resizer\\resizer\\lib\\site-packages\\PIL\\MpegImagePlugin.py',
   'PYMODULE'),
  ('PIL.ImtImagePlugin',
   'c:\\projekty_python\\wlasne_projekty\\resizer\\resizer\\lib\\site-packages\\PIL\\ImtImagePlugin.py',
   'PYMODULE'),
  ('PIL.Hdf5StubImagePlugin',
   'c:\\projekty_python\\wlasne_projekty\\resizer\\resizer\\lib\\site-packages\\PIL\\Hdf5StubImagePlugin.py',
   'PYMODULE'),
  ('PIL.PcdImagePlugin',
   'c:\\projekty_python\\wlasne_projekty\\resizer\\resizer\\lib\\site-packages\\PIL\\PcdImagePlugin.py',
   'PYMODULE'),
  ('PIL.XpmImagePlugin',
   'c:\\projekty_python\\wlasne_projekty\\resizer\\resizer\\lib\\site-packages\\PIL\\XpmImagePlugin.py',
   'PYMODULE'),
  ('PIL.Jpeg2KImagePlugin',
   'c:\\projekty_python\\wlasne_projekty\\resizer\\resizer\\lib\\site-packages\\PIL\\Jpeg2KImagePlugin.py',
   'PYMODULE'),
  ('PIL.EpsImagePlugin',
   'c:\\projekty_python\\wlasne_projekty\\resizer\\resizer\\lib\\site-packages\\PIL\\EpsImagePlugin.py',
   'PYMODULE'),
  ('distutils.spawn', 'C:\\Python36\\lib\\distutils\\spawn.py', 'PYMODULE'),
  ('distutils.sysconfig',
   'C:\\Python36\\lib\\distutils\\sysconfig.py',
   'PYMODULE'),
  ('distutils.text_file',
   'C:\\Python36\\lib\\distutils\\text_file.py',
   'PYMODULE'),
  ('_osx_support', 'C:\\Python36\\lib\\_osx_support.py', 'PYMODULE'),
  ('distutils.log', 'C:\\Python36\\lib\\distutils\\log.py', 'PYMODULE'),
  ('distutils', 'C:\\Python36\\lib\\distutils\\__init__.py', 'PYMODULE'),
  ('distutils.debug', 'C:\\Python36\\lib\\distutils\\debug.py', 'PYMODULE'),
  ('distutils.errors', 'C:\\Python36\\lib\\distutils\\errors.py', 'PYMODULE'),
  ('PIL.CurImagePlugin',
   'c:\\projekty_python\\wlasne_projekty\\resizer\\resizer\\lib\\site-packages\\PIL\\CurImagePlugin.py',
   'PYMODULE'),
  ('PIL.PalmImagePlugin',
   'c:\\projekty_python\\wlasne_projekty\\resizer\\resizer\\lib\\site-packages\\PIL\\PalmImagePlugin.py',
   'PYMODULE'),
  ('PIL.GribStubImagePlugin',
   'c:\\projekty_python\\wlasne_projekty\\resizer\\resizer\\lib\\site-packages\\PIL\\GribStubImagePlugin.py',
   'PYMODULE'),
  ('PIL.SgiImagePlugin',
   'c:\\projekty_python\\wlasne_projekty\\resizer\\resizer\\lib\\site-packages\\PIL\\SgiImagePlugin.py',
   'PYMODULE'),
  ('PIL.IptcImagePlugin',
   'c:\\projekty_python\\wlasne_projekty\\resizer\\resizer\\lib\\site-packages\\PIL\\IptcImagePlugin.py',
   'PYMODULE'),
  ('PIL.SpiderImagePlugin',
   'c:\\projekty_python\\wlasne_projekty\\resizer\\resizer\\lib\\site-packages\\PIL\\SpiderImagePlugin.py',
   'PYMODULE'),
  ('PIL.ImageTk',
   'c:\\projekty_python\\wlasne_projekty\\resizer\\resizer\\lib\\site-packages\\PIL\\ImageTk.py',
   'PYMODULE'),
  ('PIL.BlpImagePlugin',
   'c:\\projekty_python\\wlasne_projekty\\resizer\\resizer\\lib\\site-packages\\PIL\\BlpImagePlugin.py',
   'PYMODULE'),
  ('PIL.ImageShow',
   'c:\\projekty_python\\wlasne_projekty\\resizer\\resizer\\lib\\site-packages\\PIL\\ImageShow.py',
   'PYMODULE'),
  ('pipes', 'C:\\Python36\\lib\\pipes.py', 'PYMODULE'),
  ('PIL.ImageQt',
   'c:\\projekty_python\\wlasne_projekty\\resizer\\resizer\\lib\\site-packages\\PIL\\ImageQt.py',
   'PYMODULE'),
  ('PIL.ImageColor',
   'c:\\projekty_python\\wlasne_projekty\\resizer\\resizer\\lib\\site-packages\\PIL\\ImageColor.py',
   'PYMODULE'),
  ('colorsys', 'C:\\Python36\\lib\\colorsys.py', 'PYMODULE'),
  ('PIL.ImageFilter',
   'c:\\projekty_python\\wlasne_projekty\\resizer\\resizer\\lib\\site-packages\\PIL\\ImageFilter.py',
   'PYMODULE'),
  ('PIL.PyAccess',
   'c:\\projekty_python\\wlasne_projekty\\resizer\\resizer\\lib\\site-packages\\PIL\\PyAccess.py',
   'PYMODULE'),
  ('PIL.ImagePalette',
   'c:\\projekty_python\\wlasne_projekty\\resizer\\resizer\\lib\\site-packages\\PIL\\ImagePalette.py',
   'PYMODULE'),
  ('PIL.PaletteFile',
   'c:\\projekty_python\\wlasne_projekty\\resizer\\resizer\\lib\\site-packages\\PIL\\PaletteFile.py',
   'PYMODULE'),
  ('PIL.GimpGradientFile',
   'c:\\projekty_python\\wlasne_projekty\\resizer\\resizer\\lib\\site-packages\\PIL\\GimpGradientFile.py',
   'PYMODULE'),
  ('PIL.GimpPaletteFile',
   'c:\\projekty_python\\wlasne_projekty\\resizer\\resizer\\lib\\site-packages\\PIL\\GimpPaletteFile.py',
   'PYMODULE'),
  ('PIL.PngImagePlugin',
   'c:\\projekty_python\\wlasne_projekty\\resizer\\resizer\\lib\\site-packages\\PIL\\PngImagePlugin.py',
   'PYMODULE'),
  ('PIL.PpmImagePlugin',
   'c:\\projekty_python\\wlasne_projekty\\resizer\\resizer\\lib\\site-packages\\PIL\\PpmImagePlugin.py',
   'PYMODULE'),
  ('PIL.JpegImagePlugin',
   'c:\\projekty_python\\wlasne_projekty\\resizer\\resizer\\lib\\site-packages\\PIL\\JpegImagePlugin.py',
   'PYMODULE'),
  ('PIL.JpegPresets',
   'c:\\projekty_python\\wlasne_projekty\\resizer\\resizer\\lib\\site-packages\\PIL\\JpegPresets.py',
   'PYMODULE'),
  ('PIL.GifImagePlugin',
   'c:\\projekty_python\\wlasne_projekty\\resizer\\resizer\\lib\\site-packages\\PIL\\GifImagePlugin.py',
   'PYMODULE'),
  ('PIL.ImageChops',
   'c:\\projekty_python\\wlasne_projekty\\resizer\\resizer\\lib\\site-packages\\PIL\\ImageChops.py',
   'PYMODULE'),
  ('PIL.BmpImagePlugin',
   'c:\\projekty_python\\wlasne_projekty\\resizer\\resizer\\lib\\site-packages\\PIL\\BmpImagePlugin.py',
   'PYMODULE'),
  ('pathlib', 'C:\\Python36\\lib\\pathlib.py', 'PYMODULE'),
  ('numbers', 'C:\\Python36\\lib\\numbers.py', 'PYMODULE'),
  ('PIL._binary',
   'c:\\projekty_python\\wlasne_projekty\\resizer\\resizer\\lib\\site-packages\\PIL\\_binary.py',
   'PYMODULE'),
  ('PIL.ImageMode',
   'c:\\projekty_python\\wlasne_projekty\\resizer\\resizer\\lib\\site-packages\\PIL\\ImageMode.py',
   'PYMODULE'),
  ('PIL._util',
   'c:\\projekty_python\\wlasne_projekty\\resizer\\resizer\\lib\\site-packages\\PIL\\_util.py',
   'PYMODULE'),
  ('PIL',
   'c:\\projekty_python\\wlasne_projekty\\resizer\\resizer\\lib\\site-packages\\PIL\\__init__.py',
   'PYMODULE'),
  ('PIL._version',
   'c:\\projekty_python\\wlasne_projekty\\resizer\\resizer\\lib\\site-packages\\PIL\\_version.py',
   'PYMODULE'),
  ('tkinter.filedialog',
   'C:\\Python36\\lib\\tkinter\\filedialog.py',
   'PYMODULE'),
  ('tkinter.commondialog',
   'C:\\Python36\\lib\\tkinter\\commondialog.py',
   'PYMODULE'),
  ('tkinter.dialog', 'C:\\Python36\\lib\\tkinter\\dialog.py', 'PYMODULE'),
  ('tkinter', 'C:\\Python36\\lib\\tkinter\\__init__.py', 'PYMODULE'),
  ('tkinter.constants', 'C:\\Python36\\lib\\tkinter\\constants.py', 'PYMODULE'),
  ('tkinter.ttk', 'C:\\Python36\\lib\\tkinter\\ttk.py', 'PYMODULE')])
