('E:\\Nauka\\projekty_python\\wlasne_projekty\\pdf_merger_QT\\build\\mergerQt\\PYZ-00.pyz',
 [('ntpath',
   'e:\\nauka\\projekty_python\\wlasne_projekty\\env\\lib\\ntpath.py',
   'PYMODULE'),
  ('_strptime', 'c:\\python36\\Lib\\_strptime.py', 'PYMODULE'),
  ('datetime', 'c:\\python36\\Lib\\datetime.py', 'PYMODULE'),
  ('_compat_pickle', 'c:\\python36\\Lib\\_compat_pickle.py', 'PYMODULE'),
  ('pickle', 'c:\\python36\\Lib\\pickle.py', 'PYMODULE'),
  ('tracemalloc', 'c:\\python36\\Lib\\tracemalloc.py', 'PYMODULE'),
  ('stringprep', 'c:\\python36\\Lib\\stringprep.py', 'PYMODULE'),
  ('__future__',
   'e:\\nauka\\projekty_python\\wlasne_projekty\\env\\lib\\__future__.py',
   'PYMODULE'),
  ('argparse', 'c:\\python36\\Lib\\argparse.py', 'PYMODULE'),
  ('difflib', 'c:\\python36\\Lib\\difflib.py', 'PYMODULE'),
  ('ast', 'c:\\python36\\Lib\\ast.py', 'PYMODULE'),
  ('inspect', 'c:\\python36\\Lib\\inspect.py', 'PYMODULE'),
  ('os',
   'e:\\nauka\\projekty_python\\wlasne_projekty\\env\\lib\\os.py',
   'PYMODULE'),
  ('cmd', 'c:\\python36\\Lib\\cmd.py', 'PYMODULE'),
  ('bdb', 'c:\\python36\\Lib\\bdb.py', 'PYMODULE'),
  ('opcode', 'c:\\python36\\Lib\\opcode.py', 'PYMODULE'),
  ('dis', 'c:\\python36\\Lib\\dis.py', 'PYMODULE'),
  ('codeop', 'c:\\python36\\Lib\\codeop.py', 'PYMODULE'),
  ('code', 'c:\\python36\\Lib\\code.py', 'PYMODULE'),
  ('glob', 'c:\\python36\\Lib\\glob.py', 'PYMODULE'),
  ('shlex', 'c:\\python36\\Lib\\shlex.py', 'PYMODULE'),
  ('importlib._bootstrap',
   'e:\\nauka\\projekty_python\\wlasne_projekty\\env\\lib\\importlib\\_bootstrap.py',
   'PYMODULE'),
  ('importlib._bootstrap_external',
   'e:\\nauka\\projekty_python\\wlasne_projekty\\env\\lib\\importlib\\_bootstrap_external.py',
   'PYMODULE'),
  ('importlib.machinery',
   'e:\\nauka\\projekty_python\\wlasne_projekty\\env\\lib\\importlib\\machinery.py',
   'PYMODULE'),
  ('importlib.util',
   'e:\\nauka\\projekty_python\\wlasne_projekty\\env\\lib\\importlib\\util.py',
   'PYMODULE'),
  ('importlib.abc',
   'e:\\nauka\\projekty_python\\wlasne_projekty\\env\\lib\\importlib\\abc.py',
   'PYMODULE'),
  ('importlib',
   'e:\\nauka\\projekty_python\\wlasne_projekty\\env\\lib\\importlib\\__init__.py',
   'PYMODULE'),
  ('pkgutil', 'c:\\python36\\Lib\\pkgutil.py', 'PYMODULE'),
  ('xml', 'c:\\python36\\Lib\\xml\\__init__.py', 'PYMODULE'),
  ('xml.sax.expatreader',
   'c:\\python36\\Lib\\xml\\sax\\expatreader.py',
   'PYMODULE'),
  ('xml.sax.saxutils', 'c:\\python36\\Lib\\xml\\sax\\saxutils.py', 'PYMODULE'),
  ('urllib.request', 'c:\\python36\\Lib\\urllib\\request.py', 'PYMODULE'),
  ('getpass', 'c:\\python36\\Lib\\getpass.py', 'PYMODULE'),
  ('nturl2path', 'c:\\python36\\Lib\\nturl2path.py', 'PYMODULE'),
  ('ftplib', 'c:\\python36\\Lib\\ftplib.py', 'PYMODULE'),
  ('netrc', 'c:\\python36\\Lib\\netrc.py', 'PYMODULE'),
  ('http.cookiejar', 'c:\\python36\\Lib\\http\\cookiejar.py', 'PYMODULE'),
  ('urllib.response', 'c:\\python36\\Lib\\urllib\\response.py', 'PYMODULE'),
  ('urllib.error', 'c:\\python36\\Lib\\urllib\\error.py', 'PYMODULE'),
  ('xml.sax', 'c:\\python36\\Lib\\xml\\sax\\__init__.py', 'PYMODULE'),
  ('xml.sax.handler', 'c:\\python36\\Lib\\xml\\sax\\handler.py', 'PYMODULE'),
  ('xml.sax._exceptions',
   'c:\\python36\\Lib\\xml\\sax\\_exceptions.py',
   'PYMODULE'),
  ('xml.sax.xmlreader',
   'c:\\python36\\Lib\\xml\\sax\\xmlreader.py',
   'PYMODULE'),
  ('xml.parsers', 'c:\\python36\\Lib\\xml\\parsers\\__init__.py', 'PYMODULE'),
  ('xml.parsers.expat',
   'c:\\python36\\Lib\\xml\\parsers\\expat.py',
   'PYMODULE'),
  ('plistlib', 'c:\\python36\\Lib\\plistlib.py', 'PYMODULE'),
  ('platform', 'c:\\python36\\Lib\\platform.py', 'PYMODULE'),
  ('token',
   'e:\\nauka\\projekty_python\\wlasne_projekty\\env\\lib\\token.py',
   'PYMODULE'),
  ('tokenize',
   'e:\\nauka\\projekty_python\\wlasne_projekty\\env\\lib\\tokenize.py',
   'PYMODULE'),
  ('urllib.parse', 'c:\\python36\\Lib\\urllib\\parse.py', 'PYMODULE'),
  ('tempfile',
   'e:\\nauka\\projekty_python\\wlasne_projekty\\env\\lib\\tempfile.py',
   'PYMODULE'),
  ('subprocess', 'c:\\python36\\Lib\\subprocess.py', 'PYMODULE'),
  ('tty', 'c:\\python36\\Lib\\tty.py', 'PYMODULE'),
  ('pydoc_data', 'c:\\python36\\Lib\\pydoc_data\\__init__.py', 'PYMODULE'),
  ('pydoc_data.topics', 'c:\\python36\\Lib\\pydoc_data\\topics.py', 'PYMODULE'),
  ('textwrap', 'c:\\python36\\Lib\\textwrap.py', 'PYMODULE'),
  ('html.entities', 'c:\\python36\\Lib\\html\\entities.py', 'PYMODULE'),
  ('html', 'c:\\python36\\Lib\\html\\__init__.py', 'PYMODULE'),
  ('ipaddress', 'c:\\python36\\Lib\\ipaddress.py', 'PYMODULE'),
  ('ssl', 'c:\\python36\\Lib\\ssl.py', 'PYMODULE'),
  ('http.client', 'c:\\python36\\Lib\\http\\client.py', 'PYMODULE'),
  ('mimetypes', 'c:\\python36\\Lib\\mimetypes.py', 'PYMODULE'),
  ('socketserver', 'c:\\python36\\Lib\\socketserver.py', 'PYMODULE'),
  ('http', 'c:\\python36\\Lib\\http\\__init__.py', 'PYMODULE'),
  ('http.server', 'c:\\python36\\Lib\\http\\server.py', 'PYMODULE'),
  ('optparse', 'c:\\python36\\Lib\\optparse.py', 'PYMODULE'),
  ('uu', 'c:\\python36\\Lib\\uu.py', 'PYMODULE'),
  ('quopri', 'c:\\python36\\Lib\\quopri.py', 'PYMODULE'),
  ('email.feedparser', 'c:\\python36\\Lib\\email\\feedparser.py', 'PYMODULE'),
  ('email.parser', 'c:\\python36\\Lib\\email\\parser.py', 'PYMODULE'),
  ('email', 'c:\\python36\\Lib\\email\\__init__.py', 'PYMODULE'),
  ('calendar', 'c:\\python36\\Lib\\calendar.py', 'PYMODULE'),
  ('email._parseaddr', 'c:\\python36\\Lib\\email\\_parseaddr.py', 'PYMODULE'),
  ('email.utils', 'c:\\python36\\Lib\\email\\utils.py', 'PYMODULE'),
  ('email.errors', 'c:\\python36\\Lib\\email\\errors.py', 'PYMODULE'),
  ('email.header', 'c:\\python36\\Lib\\email\\header.py', 'PYMODULE'),
  ('email._policybase', 'c:\\python36\\Lib\\email\\_policybase.py', 'PYMODULE'),
  ('email.base64mime', 'c:\\python36\\Lib\\email\\base64mime.py', 'PYMODULE'),
  ('email.encoders', 'c:\\python36\\Lib\\email\\encoders.py', 'PYMODULE'),
  ('email.charset', 'c:\\python36\\Lib\\email\\charset.py', 'PYMODULE'),
  ('base64',
   'e:\\nauka\\projekty_python\\wlasne_projekty\\env\\lib\\base64.py',
   'PYMODULE'),
  ('email._encoded_words',
   'c:\\python36\\Lib\\email\\_encoded_words.py',
   'PYMODULE'),
  ('hashlib',
   'e:\\nauka\\projekty_python\\wlasne_projekty\\env\\lib\\hashlib.py',
   'PYMODULE'),
  ('bisect',
   'e:\\nauka\\projekty_python\\wlasne_projekty\\env\\lib\\bisect.py',
   'PYMODULE'),
  ('random',
   'e:\\nauka\\projekty_python\\wlasne_projekty\\env\\lib\\random.py',
   'PYMODULE'),
  ('email.generator', 'c:\\python36\\Lib\\email\\generator.py', 'PYMODULE'),
  ('email.iterators', 'c:\\python36\\Lib\\email\\iterators.py', 'PYMODULE'),
  ('urllib', 'c:\\python36\\Lib\\urllib\\__init__.py', 'PYMODULE'),
  ('email._header_value_parser',
   'c:\\python36\\Lib\\email\\_header_value_parser.py',
   'PYMODULE'),
  ('email.headerregistry',
   'c:\\python36\\Lib\\email\\headerregistry.py',
   'PYMODULE'),
  ('email.quoprimime', 'c:\\python36\\Lib\\email\\quoprimime.py', 'PYMODULE'),
  ('email.contentmanager',
   'c:\\python36\\Lib\\email\\contentmanager.py',
   'PYMODULE'),
  ('email.policy', 'c:\\python36\\Lib\\email\\policy.py', 'PYMODULE'),
  ('email.message', 'c:\\python36\\Lib\\email\\message.py', 'PYMODULE'),
  ('bz2', 'c:\\python36\\Lib\\bz2.py', 'PYMODULE'),
  ('lzma', 'c:\\python36\\Lib\\lzma.py', 'PYMODULE'),
  ('_compression', 'c:\\python36\\Lib\\_compression.py', 'PYMODULE'),
  ('gzip', 'c:\\python36\\Lib\\gzip.py', 'PYMODULE'),
  ('tarfile',
   'e:\\nauka\\projekty_python\\wlasne_projekty\\env\\lib\\tarfile.py',
   'PYMODULE'),
  ('_dummy_thread',
   'e:\\nauka\\projekty_python\\wlasne_projekty\\env\\lib\\_dummy_thread.py',
   'PYMODULE'),
  ('dummy_threading', 'c:\\python36\\Lib\\dummy_threading.py', 'PYMODULE'),
  ('py_compile', 'c:\\python36\\Lib\\py_compile.py', 'PYMODULE'),
  ('zipfile', 'c:\\python36\\Lib\\zipfile.py', 'PYMODULE'),
  ('shutil',
   'e:\\nauka\\projekty_python\\wlasne_projekty\\env\\lib\\shutil.py',
   'PYMODULE'),
  ('selectors', 'c:\\python36\\Lib\\selectors.py', 'PYMODULE'),
  ('socket', 'c:\\python36\\Lib\\socket.py', 'PYMODULE'),
  ('webbrowser', 'c:\\python36\\Lib\\webbrowser.py', 'PYMODULE'),
  ('pydoc', 'c:\\python36\\Lib\\pydoc.py', 'PYMODULE'),
  ('copy',
   'e:\\nauka\\projekty_python\\wlasne_projekty\\env\\lib\\copy.py',
   'PYMODULE'),
  ('struct',
   'e:\\nauka\\projekty_python\\wlasne_projekty\\env\\lib\\struct.py',
   'PYMODULE'),
  ('gettext', 'c:\\python36\\Lib\\gettext.py', 'PYMODULE'),
  ('getopt', 'c:\\python36\\Lib\\getopt.py', 'PYMODULE'),
  ('pdb', 'c:\\python36\\Lib\\pdb.py', 'PYMODULE'),
  ('unittest.util', 'c:\\python36\\Lib\\unittest\\util.py', 'PYMODULE'),
  ('unittest.result', 'c:\\python36\\Lib\\unittest\\result.py', 'PYMODULE'),
  ('string', 'c:\\python36\\Lib\\string.py', 'PYMODULE'),
  ('_threading_local', 'c:\\python36\\Lib\\_threading_local.py', 'PYMODULE'),
  ('threading', 'c:\\python36\\Lib\\threading.py', 'PYMODULE'),
  ('logging', 'c:\\python36\\Lib\\logging\\__init__.py', 'PYMODULE'),
  ('pprint', 'c:\\python36\\Lib\\pprint.py', 'PYMODULE'),
  ('contextlib', 'c:\\python36\\Lib\\contextlib.py', 'PYMODULE'),
  ('unittest.case', 'c:\\python36\\Lib\\unittest\\case.py', 'PYMODULE'),
  ('unittest.suite', 'c:\\python36\\Lib\\unittest\\suite.py', 'PYMODULE'),
  ('stat',
   'e:\\nauka\\projekty_python\\wlasne_projekty\\env\\lib\\stat.py',
   'PYMODULE'),
  ('genericpath',
   'e:\\nauka\\projekty_python\\wlasne_projekty\\env\\lib\\genericpath.py',
   'PYMODULE'),
  ('posixpath',
   'e:\\nauka\\projekty_python\\wlasne_projekty\\env\\lib\\posixpath.py',
   'PYMODULE'),
  ('fnmatch',
   'e:\\nauka\\projekty_python\\wlasne_projekty\\env\\lib\\fnmatch.py',
   'PYMODULE'),
  ('unittest.loader', 'c:\\python36\\Lib\\unittest\\loader.py', 'PYMODULE'),
  ('unittest.runner', 'c:\\python36\\Lib\\unittest\\runner.py', 'PYMODULE'),
  ('unittest.main', 'c:\\python36\\Lib\\unittest\\main.py', 'PYMODULE'),
  ('signal', 'c:\\python36\\Lib\\signal.py', 'PYMODULE'),
  ('unittest.signals', 'c:\\python36\\Lib\\unittest\\signals.py', 'PYMODULE'),
  ('unittest', 'c:\\python36\\Lib\\unittest\\__init__.py', 'PYMODULE'),
  ('doctest', 'c:\\python36\\Lib\\doctest.py', 'PYMODULE'),
  ('PyPDF2',
   'e:\\nauka\\projekty_python\\wlasne_projekty\\env\\lib\\site-packages\\PyPDF2\\__init__.py',
   'PYMODULE'),
  ('PyPDF2._version',
   'e:\\nauka\\projekty_python\\wlasne_projekty\\env\\lib\\site-packages\\PyPDF2\\_version.py',
   'PYMODULE'),
  ('PyPDF2.pagerange',
   'e:\\nauka\\projekty_python\\wlasne_projekty\\env\\lib\\site-packages\\PyPDF2\\pagerange.py',
   'PYMODULE'),
  ('PyPDF2.utils',
   'e:\\nauka\\projekty_python\\wlasne_projekty\\env\\lib\\site-packages\\PyPDF2\\utils.py',
   'PYMODULE'),
  ('PyPDF2.merger',
   'e:\\nauka\\projekty_python\\wlasne_projekty\\env\\lib\\site-packages\\PyPDF2\\merger.py',
   'PYMODULE'),
  ('PyPDF2.generic',
   'e:\\nauka\\projekty_python\\wlasne_projekty\\env\\lib\\site-packages\\PyPDF2\\generic.py',
   'PYMODULE'),
  ('decimal', 'c:\\python36\\Lib\\decimal.py', 'PYMODULE'),
  ('_pydecimal', 'c:\\python36\\Lib\\_pydecimal.py', 'PYMODULE'),
  ('numbers', 'c:\\python36\\Lib\\numbers.py', 'PYMODULE'),
  ('PyPDF2.pdf',
   'e:\\nauka\\projekty_python\\wlasne_projekty\\env\\lib\\site-packages\\PyPDF2\\pdf.py',
   'PYMODULE'),
  ('uuid', 'c:\\python36\\Lib\\uuid.py', 'PYMODULE'),
  ('ctypes.util', 'c:\\python36\\Lib\\ctypes\\util.py', 'PYMODULE'),
  ('ctypes.macholib.dyld',
   'c:\\python36\\Lib\\ctypes\\macholib\\dyld.py',
   'PYMODULE'),
  ('ctypes.macholib',
   'c:\\python36\\Lib\\ctypes\\macholib\\__init__.py',
   'PYMODULE'),
  ('ctypes.macholib.dylib',
   'c:\\python36\\Lib\\ctypes\\macholib\\dylib.py',
   'PYMODULE'),
  ('ctypes.macholib.framework',
   'c:\\python36\\Lib\\ctypes\\macholib\\framework.py',
   'PYMODULE'),
  ('ctypes', 'c:\\python36\\Lib\\ctypes\\__init__.py', 'PYMODULE'),
  ('ctypes._endian', 'c:\\python36\\Lib\\ctypes\\_endian.py', 'PYMODULE'),
  ('PyPDF2.xmp',
   'e:\\nauka\\projekty_python\\wlasne_projekty\\env\\lib\\site-packages\\PyPDF2\\xmp.py',
   'PYMODULE'),
  ('xml.dom.minidom', 'c:\\python36\\Lib\\xml\\dom\\minidom.py', 'PYMODULE'),
  ('xml.dom.pulldom', 'c:\\python36\\Lib\\xml\\dom\\pulldom.py', 'PYMODULE'),
  ('xml.dom.expatbuilder',
   'c:\\python36\\Lib\\xml\\dom\\expatbuilder.py',
   'PYMODULE'),
  ('xml.dom.NodeFilter',
   'c:\\python36\\Lib\\xml\\dom\\NodeFilter.py',
   'PYMODULE'),
  ('xml.dom.xmlbuilder',
   'c:\\python36\\Lib\\xml\\dom\\xmlbuilder.py',
   'PYMODULE'),
  ('xml.dom.minicompat',
   'c:\\python36\\Lib\\xml\\dom\\minicompat.py',
   'PYMODULE'),
  ('xml.dom.domreg', 'c:\\python36\\Lib\\xml\\dom\\domreg.py', 'PYMODULE'),
  ('xml.dom', 'c:\\python36\\Lib\\xml\\dom\\__init__.py', 'PYMODULE'),
  ('PyPDF2.filters',
   'e:\\nauka\\projekty_python\\wlasne_projekty\\env\\lib\\site-packages\\PyPDF2\\filters.py',
   'PYMODULE'),
  ('PyQt5',
   'e:\\nauka\\projekty_python\\wlasne_projekty\\env\\lib\\site-packages\\PyQt5\\__init__.py',
   'PYMODULE')])
