('E:\\Nauka\\projekty_python\\wlasne_projekty\\pdf_merger_QT\\build\\mergerQt\\PKG-00.pkg',
 {'BINARY': 1,
  'DATA': 1,
  'EXECUTABLE': 1,
  'EXTENSION': 1,
  'PYMODULE': 1,
  'PYSOURCE': 1,
  'PYZ': 0},
 [('PYZ-00.pyz',
   'E:\\Nauka\\projekty_python\\wlasne_projekty\\pdf_merger_QT\\build\\mergerQt\\PYZ-00.pyz',
   'PYZ'),
  ('struct',
   'e:\\nauka\\projekty_python\\wlasne_projekty\\env\\lib\\struct.pyo',
   'PYMODULE'),
  ('pyimod01_os_path',
   'e:\\nauka\\projekty_python\\wlasne_projekty\\env\\lib\\site-packages\\PyInstaller\\loader\\pyimod01_os_path.pyc',
   'PYMODULE'),
  ('pyimod02_archive',
   'e:\\nauka\\projekty_python\\wlasne_projekty\\env\\lib\\site-packages\\PyInstaller\\loader\\pyimod02_archive.pyc',
   'PYMODULE'),
  ('pyimod03_importers',
   'e:\\nauka\\projekty_python\\wlasne_projekty\\env\\lib\\site-packages\\PyInstaller\\loader\\pyimod03_importers.pyc',
   'PYMODULE'),
  ('pyiboot01_bootstrap',
   'e:\\nauka\\projekty_python\\wlasne_projekty\\env\\lib\\site-packages\\PyInstaller\\loader\\pyiboot01_bootstrap.py',
   'PYSOURCE'),
  ('pyi_rth_qt5',
   'e:\\nauka\\projekty_python\\wlasne_projekty\\env\\lib\\site-packages\\PyInstaller\\loader\\rthooks\\pyi_rth_qt5.py',
   'PYSOURCE'),
  ('mergerQt',
   'E:\\Nauka\\projekty_python\\wlasne_projekty\\pdf_merger_QT\\mergerQt.py',
   'PYSOURCE'),
  ('mergerQt.exe.manifest',
   'E:\\Nauka\\projekty_python\\wlasne_projekty\\pdf_merger_QT\\build\\mergerQt\\mergerQt.exe.manifest',
   'BINARY')],
 True,
 False,
 False)
