(['E:\\Nauka\\projekty_python\\wlasne_projekty\\pdf_merger_QT\\mergerQt.py'],
 ['E:\\Nauka\\projekty_python\\wlasne_projekty\\pdf_merger_QT',
  'E:\\Nauka\\projekty_python\\wlasne_projekty\\pdf_merger_QT'],
 ['codecs'],
 [],
 [],
 [],
 False,
 False,
 '3.6.6 (v3.6.6:4cf1f54eb7, Jun 27 2018, 03:37:03) [MSC v.1900 64 bit (AMD64)]',
 [('pyi_rth_qt5',
   'e:\\nauka\\projekty_python\\wlasne_projekty\\env\\lib\\site-packages\\PyInstaller\\loader\\rthooks\\pyi_rth_qt5.py',
   'PYSOURCE'),
  ('mergerQt',
   'E:\\Nauka\\projekty_python\\wlasne_projekty\\pdf_merger_QT\\mergerQt.py',
   'PYSOURCE')],
 [('ntpath',
   'e:\\nauka\\projekty_python\\wlasne_projekty\\env\\lib\\ntpath.py',
   'PYMODULE'),
  ('_strptime', 'c:\\python36\\Lib\\_strptime.py', 'PYMODULE'),
  ('datetime', 'c:\\python36\\Lib\\datetime.py', 'PYMODULE'),
  ('_compat_pickle', 'c:\\python36\\Lib\\_compat_pickle.py', 'PYMODULE'),
  ('pickle', 'c:\\python36\\Lib\\pickle.py', 'PYMODULE'),
  ('tracemalloc', 'c:\\python36\\Lib\\tracemalloc.py', 'PYMODULE'),
  ('stringprep', 'c:\\python36\\Lib\\stringprep.py', 'PYMODULE'),
  ('__future__',
   'e:\\nauka\\projekty_python\\wlasne_projekty\\env\\lib\\__future__.py',
   'PYMODULE'),
  ('argparse', 'c:\\python36\\Lib\\argparse.py', 'PYMODULE'),
  ('difflib', 'c:\\python36\\Lib\\difflib.py', 'PYMODULE'),
  ('ast', 'c:\\python36\\Lib\\ast.py', 'PYMODULE'),
  ('inspect', 'c:\\python36\\Lib\\inspect.py', 'PYMODULE'),
  ('os',
   'e:\\nauka\\projekty_python\\wlasne_projekty\\env\\lib\\os.py',
   'PYMODULE'),
  ('cmd', 'c:\\python36\\Lib\\cmd.py', 'PYMODULE'),
  ('bdb', 'c:\\python36\\Lib\\bdb.py', 'PYMODULE'),
  ('opcode', 'c:\\python36\\Lib\\opcode.py', 'PYMODULE'),
  ('dis', 'c:\\python36\\Lib\\dis.py', 'PYMODULE'),
  ('codeop', 'c:\\python36\\Lib\\codeop.py', 'PYMODULE'),
  ('code', 'c:\\python36\\Lib\\code.py', 'PYMODULE'),
  ('glob', 'c:\\python36\\Lib\\glob.py', 'PYMODULE'),
  ('shlex', 'c:\\python36\\Lib\\shlex.py', 'PYMODULE'),
  ('importlib._bootstrap',
   'e:\\nauka\\projekty_python\\wlasne_projekty\\env\\lib\\importlib\\_bootstrap.py',
   'PYMODULE'),
  ('importlib._bootstrap_external',
   'e:\\nauka\\projekty_python\\wlasne_projekty\\env\\lib\\importlib\\_bootstrap_external.py',
   'PYMODULE'),
  ('importlib.machinery',
   'e:\\nauka\\projekty_python\\wlasne_projekty\\env\\lib\\importlib\\machinery.py',
   'PYMODULE'),
  ('importlib.util',
   'e:\\nauka\\projekty_python\\wlasne_projekty\\env\\lib\\importlib\\util.py',
   'PYMODULE'),
  ('importlib.abc',
   'e:\\nauka\\projekty_python\\wlasne_projekty\\env\\lib\\importlib\\abc.py',
   'PYMODULE'),
  ('importlib',
   'e:\\nauka\\projekty_python\\wlasne_projekty\\env\\lib\\importlib\\__init__.py',
   'PYMODULE'),
  ('pkgutil', 'c:\\python36\\Lib\\pkgutil.py', 'PYMODULE'),
  ('xml', 'c:\\python36\\Lib\\xml\\__init__.py', 'PYMODULE'),
  ('xml.sax.expatreader',
   'c:\\python36\\Lib\\xml\\sax\\expatreader.py',
   'PYMODULE'),
  ('xml.sax.saxutils', 'c:\\python36\\Lib\\xml\\sax\\saxutils.py', 'PYMODULE'),
  ('urllib.request', 'c:\\python36\\Lib\\urllib\\request.py', 'PYMODULE'),
  ('getpass', 'c:\\python36\\Lib\\getpass.py', 'PYMODULE'),
  ('nturl2path', 'c:\\python36\\Lib\\nturl2path.py', 'PYMODULE'),
  ('ftplib', 'c:\\python36\\Lib\\ftplib.py', 'PYMODULE'),
  ('netrc', 'c:\\python36\\Lib\\netrc.py', 'PYMODULE'),
  ('http.cookiejar', 'c:\\python36\\Lib\\http\\cookiejar.py', 'PYMODULE'),
  ('urllib.response', 'c:\\python36\\Lib\\urllib\\response.py', 'PYMODULE'),
  ('urllib.error', 'c:\\python36\\Lib\\urllib\\error.py', 'PYMODULE'),
  ('xml.sax', 'c:\\python36\\Lib\\xml\\sax\\__init__.py', 'PYMODULE'),
  ('xml.sax.handler', 'c:\\python36\\Lib\\xml\\sax\\handler.py', 'PYMODULE'),
  ('xml.sax._exceptions',
   'c:\\python36\\Lib\\xml\\sax\\_exceptions.py',
   'PYMODULE'),
  ('xml.sax.xmlreader',
   'c:\\python36\\Lib\\xml\\sax\\xmlreader.py',
   'PYMODULE'),
  ('xml.parsers', 'c:\\python36\\Lib\\xml\\parsers\\__init__.py', 'PYMODULE'),
  ('xml.parsers.expat',
   'c:\\python36\\Lib\\xml\\parsers\\expat.py',
   'PYMODULE'),
  ('plistlib', 'c:\\python36\\Lib\\plistlib.py', 'PYMODULE'),
  ('platform', 'c:\\python36\\Lib\\platform.py', 'PYMODULE'),
  ('token',
   'e:\\nauka\\projekty_python\\wlasne_projekty\\env\\lib\\token.py',
   'PYMODULE'),
  ('tokenize',
   'e:\\nauka\\projekty_python\\wlasne_projekty\\env\\lib\\tokenize.py',
   'PYMODULE'),
  ('urllib.parse', 'c:\\python36\\Lib\\urllib\\parse.py', 'PYMODULE'),
  ('tempfile',
   'e:\\nauka\\projekty_python\\wlasne_projekty\\env\\lib\\tempfile.py',
   'PYMODULE'),
  ('subprocess', 'c:\\python36\\Lib\\subprocess.py', 'PYMODULE'),
  ('tty', 'c:\\python36\\Lib\\tty.py', 'PYMODULE'),
  ('pydoc_data', 'c:\\python36\\Lib\\pydoc_data\\__init__.py', 'PYMODULE'),
  ('pydoc_data.topics', 'c:\\python36\\Lib\\pydoc_data\\topics.py', 'PYMODULE'),
  ('textwrap', 'c:\\python36\\Lib\\textwrap.py', 'PYMODULE'),
  ('html.entities', 'c:\\python36\\Lib\\html\\entities.py', 'PYMODULE'),
  ('html', 'c:\\python36\\Lib\\html\\__init__.py', 'PYMODULE'),
  ('ipaddress', 'c:\\python36\\Lib\\ipaddress.py', 'PYMODULE'),
  ('ssl', 'c:\\python36\\Lib\\ssl.py', 'PYMODULE'),
  ('http.client', 'c:\\python36\\Lib\\http\\client.py', 'PYMODULE'),
  ('mimetypes', 'c:\\python36\\Lib\\mimetypes.py', 'PYMODULE'),
  ('socketserver', 'c:\\python36\\Lib\\socketserver.py', 'PYMODULE'),
  ('http', 'c:\\python36\\Lib\\http\\__init__.py', 'PYMODULE'),
  ('http.server', 'c:\\python36\\Lib\\http\\server.py', 'PYMODULE'),
  ('optparse', 'c:\\python36\\Lib\\optparse.py', 'PYMODULE'),
  ('uu', 'c:\\python36\\Lib\\uu.py', 'PYMODULE'),
  ('quopri', 'c:\\python36\\Lib\\quopri.py', 'PYMODULE'),
  ('email.feedparser', 'c:\\python36\\Lib\\email\\feedparser.py', 'PYMODULE'),
  ('email.parser', 'c:\\python36\\Lib\\email\\parser.py', 'PYMODULE'),
  ('email', 'c:\\python36\\Lib\\email\\__init__.py', 'PYMODULE'),
  ('calendar', 'c:\\python36\\Lib\\calendar.py', 'PYMODULE'),
  ('email._parseaddr', 'c:\\python36\\Lib\\email\\_parseaddr.py', 'PYMODULE'),
  ('email.utils', 'c:\\python36\\Lib\\email\\utils.py', 'PYMODULE'),
  ('email.errors', 'c:\\python36\\Lib\\email\\errors.py', 'PYMODULE'),
  ('email.header', 'c:\\python36\\Lib\\email\\header.py', 'PYMODULE'),
  ('email._policybase', 'c:\\python36\\Lib\\email\\_policybase.py', 'PYMODULE'),
  ('email.base64mime', 'c:\\python36\\Lib\\email\\base64mime.py', 'PYMODULE'),
  ('email.encoders', 'c:\\python36\\Lib\\email\\encoders.py', 'PYMODULE'),
  ('email.charset', 'c:\\python36\\Lib\\email\\charset.py', 'PYMODULE'),
  ('base64',
   'e:\\nauka\\projekty_python\\wlasne_projekty\\env\\lib\\base64.py',
   'PYMODULE'),
  ('email._encoded_words',
   'c:\\python36\\Lib\\email\\_encoded_words.py',
   'PYMODULE'),
  ('hashlib',
   'e:\\nauka\\projekty_python\\wlasne_projekty\\env\\lib\\hashlib.py',
   'PYMODULE'),
  ('bisect',
   'e:\\nauka\\projekty_python\\wlasne_projekty\\env\\lib\\bisect.py',
   'PYMODULE'),
  ('random',
   'e:\\nauka\\projekty_python\\wlasne_projekty\\env\\lib\\random.py',
   'PYMODULE'),
  ('email.generator', 'c:\\python36\\Lib\\email\\generator.py', 'PYMODULE'),
  ('email.iterators', 'c:\\python36\\Lib\\email\\iterators.py', 'PYMODULE'),
  ('urllib', 'c:\\python36\\Lib\\urllib\\__init__.py', 'PYMODULE'),
  ('email._header_value_parser',
   'c:\\python36\\Lib\\email\\_header_value_parser.py',
   'PYMODULE'),
  ('email.headerregistry',
   'c:\\python36\\Lib\\email\\headerregistry.py',
   'PYMODULE'),
  ('email.quoprimime', 'c:\\python36\\Lib\\email\\quoprimime.py', 'PYMODULE'),
  ('email.contentmanager',
   'c:\\python36\\Lib\\email\\contentmanager.py',
   'PYMODULE'),
  ('email.policy', 'c:\\python36\\Lib\\email\\policy.py', 'PYMODULE'),
  ('email.message', 'c:\\python36\\Lib\\email\\message.py', 'PYMODULE'),
  ('bz2', 'c:\\python36\\Lib\\bz2.py', 'PYMODULE'),
  ('lzma', 'c:\\python36\\Lib\\lzma.py', 'PYMODULE'),
  ('_compression', 'c:\\python36\\Lib\\_compression.py', 'PYMODULE'),
  ('gzip', 'c:\\python36\\Lib\\gzip.py', 'PYMODULE'),
  ('tarfile',
   'e:\\nauka\\projekty_python\\wlasne_projekty\\env\\lib\\tarfile.py',
   'PYMODULE'),
  ('_dummy_thread',
   'e:\\nauka\\projekty_python\\wlasne_projekty\\env\\lib\\_dummy_thread.py',
   'PYMODULE'),
  ('dummy_threading', 'c:\\python36\\Lib\\dummy_threading.py', 'PYMODULE'),
  ('py_compile', 'c:\\python36\\Lib\\py_compile.py', 'PYMODULE'),
  ('zipfile', 'c:\\python36\\Lib\\zipfile.py', 'PYMODULE'),
  ('shutil',
   'e:\\nauka\\projekty_python\\wlasne_projekty\\env\\lib\\shutil.py',
   'PYMODULE'),
  ('selectors', 'c:\\python36\\Lib\\selectors.py', 'PYMODULE'),
  ('socket', 'c:\\python36\\Lib\\socket.py', 'PYMODULE'),
  ('webbrowser', 'c:\\python36\\Lib\\webbrowser.py', 'PYMODULE'),
  ('pydoc', 'c:\\python36\\Lib\\pydoc.py', 'PYMODULE'),
  ('copy',
   'e:\\nauka\\projekty_python\\wlasne_projekty\\env\\lib\\copy.py',
   'PYMODULE'),
  ('struct',
   'e:\\nauka\\projekty_python\\wlasne_projekty\\env\\lib\\struct.py',
   'PYMODULE'),
  ('gettext', 'c:\\python36\\Lib\\gettext.py', 'PYMODULE'),
  ('getopt', 'c:\\python36\\Lib\\getopt.py', 'PYMODULE'),
  ('pdb', 'c:\\python36\\Lib\\pdb.py', 'PYMODULE'),
  ('unittest.util', 'c:\\python36\\Lib\\unittest\\util.py', 'PYMODULE'),
  ('unittest.result', 'c:\\python36\\Lib\\unittest\\result.py', 'PYMODULE'),
  ('string', 'c:\\python36\\Lib\\string.py', 'PYMODULE'),
  ('_threading_local', 'c:\\python36\\Lib\\_threading_local.py', 'PYMODULE'),
  ('threading', 'c:\\python36\\Lib\\threading.py', 'PYMODULE'),
  ('logging', 'c:\\python36\\Lib\\logging\\__init__.py', 'PYMODULE'),
  ('pprint', 'c:\\python36\\Lib\\pprint.py', 'PYMODULE'),
  ('contextlib', 'c:\\python36\\Lib\\contextlib.py', 'PYMODULE'),
  ('unittest.case', 'c:\\python36\\Lib\\unittest\\case.py', 'PYMODULE'),
  ('unittest.suite', 'c:\\python36\\Lib\\unittest\\suite.py', 'PYMODULE'),
  ('stat',
   'e:\\nauka\\projekty_python\\wlasne_projekty\\env\\lib\\stat.py',
   'PYMODULE'),
  ('genericpath',
   'e:\\nauka\\projekty_python\\wlasne_projekty\\env\\lib\\genericpath.py',
   'PYMODULE'),
  ('posixpath',
   'e:\\nauka\\projekty_python\\wlasne_projekty\\env\\lib\\posixpath.py',
   'PYMODULE'),
  ('fnmatch',
   'e:\\nauka\\projekty_python\\wlasne_projekty\\env\\lib\\fnmatch.py',
   'PYMODULE'),
  ('unittest.loader', 'c:\\python36\\Lib\\unittest\\loader.py', 'PYMODULE'),
  ('unittest.runner', 'c:\\python36\\Lib\\unittest\\runner.py', 'PYMODULE'),
  ('unittest.main', 'c:\\python36\\Lib\\unittest\\main.py', 'PYMODULE'),
  ('signal', 'c:\\python36\\Lib\\signal.py', 'PYMODULE'),
  ('unittest.signals', 'c:\\python36\\Lib\\unittest\\signals.py', 'PYMODULE'),
  ('unittest', 'c:\\python36\\Lib\\unittest\\__init__.py', 'PYMODULE'),
  ('doctest', 'c:\\python36\\Lib\\doctest.py', 'PYMODULE'),
  ('PyPDF2',
   'e:\\nauka\\projekty_python\\wlasne_projekty\\env\\lib\\site-packages\\PyPDF2\\__init__.py',
   'PYMODULE'),
  ('PyPDF2._version',
   'e:\\nauka\\projekty_python\\wlasne_projekty\\env\\lib\\site-packages\\PyPDF2\\_version.py',
   'PYMODULE'),
  ('PyPDF2.pagerange',
   'e:\\nauka\\projekty_python\\wlasne_projekty\\env\\lib\\site-packages\\PyPDF2\\pagerange.py',
   'PYMODULE'),
  ('PyPDF2.utils',
   'e:\\nauka\\projekty_python\\wlasne_projekty\\env\\lib\\site-packages\\PyPDF2\\utils.py',
   'PYMODULE'),
  ('PyPDF2.merger',
   'e:\\nauka\\projekty_python\\wlasne_projekty\\env\\lib\\site-packages\\PyPDF2\\merger.py',
   'PYMODULE'),
  ('PyPDF2.generic',
   'e:\\nauka\\projekty_python\\wlasne_projekty\\env\\lib\\site-packages\\PyPDF2\\generic.py',
   'PYMODULE'),
  ('decimal', 'c:\\python36\\Lib\\decimal.py', 'PYMODULE'),
  ('_pydecimal', 'c:\\python36\\Lib\\_pydecimal.py', 'PYMODULE'),
  ('numbers', 'c:\\python36\\Lib\\numbers.py', 'PYMODULE'),
  ('PyPDF2.pdf',
   'e:\\nauka\\projekty_python\\wlasne_projekty\\env\\lib\\site-packages\\PyPDF2\\pdf.py',
   'PYMODULE'),
  ('uuid', 'c:\\python36\\Lib\\uuid.py', 'PYMODULE'),
  ('ctypes.util', 'c:\\python36\\Lib\\ctypes\\util.py', 'PYMODULE'),
  ('ctypes.macholib.dyld',
   'c:\\python36\\Lib\\ctypes\\macholib\\dyld.py',
   'PYMODULE'),
  ('ctypes.macholib',
   'c:\\python36\\Lib\\ctypes\\macholib\\__init__.py',
   'PYMODULE'),
  ('ctypes.macholib.dylib',
   'c:\\python36\\Lib\\ctypes\\macholib\\dylib.py',
   'PYMODULE'),
  ('ctypes.macholib.framework',
   'c:\\python36\\Lib\\ctypes\\macholib\\framework.py',
   'PYMODULE'),
  ('ctypes', 'c:\\python36\\Lib\\ctypes\\__init__.py', 'PYMODULE'),
  ('ctypes._endian', 'c:\\python36\\Lib\\ctypes\\_endian.py', 'PYMODULE'),
  ('PyPDF2.xmp',
   'e:\\nauka\\projekty_python\\wlasne_projekty\\env\\lib\\site-packages\\PyPDF2\\xmp.py',
   'PYMODULE'),
  ('xml.dom.minidom', 'c:\\python36\\Lib\\xml\\dom\\minidom.py', 'PYMODULE'),
  ('xml.dom.pulldom', 'c:\\python36\\Lib\\xml\\dom\\pulldom.py', 'PYMODULE'),
  ('xml.dom.expatbuilder',
   'c:\\python36\\Lib\\xml\\dom\\expatbuilder.py',
   'PYMODULE'),
  ('xml.dom.NodeFilter',
   'c:\\python36\\Lib\\xml\\dom\\NodeFilter.py',
   'PYMODULE'),
  ('xml.dom.xmlbuilder',
   'c:\\python36\\Lib\\xml\\dom\\xmlbuilder.py',
   'PYMODULE'),
  ('xml.dom.minicompat',
   'c:\\python36\\Lib\\xml\\dom\\minicompat.py',
   'PYMODULE'),
  ('xml.dom.domreg', 'c:\\python36\\Lib\\xml\\dom\\domreg.py', 'PYMODULE'),
  ('xml.dom', 'c:\\python36\\Lib\\xml\\dom\\__init__.py', 'PYMODULE'),
  ('PyPDF2.filters',
   'e:\\nauka\\projekty_python\\wlasne_projekty\\env\\lib\\site-packages\\PyPDF2\\filters.py',
   'PYMODULE'),
  ('PyQt5',
   'e:\\nauka\\projekty_python\\wlasne_projekty\\env\\lib\\site-packages\\PyQt5\\__init__.py',
   'PYMODULE')],
 [('api-ms-win-crt-stdio-l1-1-0.dll',
   'C:\\Windows\\system32\\api-ms-win-crt-stdio-l1-1-0.dll',
   'BINARY'),
  ('python36.dll',
   'e:\\nauka\\projekty_python\\wlasne_projekty\\env\\scripts\\python36.dll',
   'BINARY'),
  ('api-ms-win-crt-heap-l1-1-0.dll',
   'C:\\Windows\\system32\\api-ms-win-crt-heap-l1-1-0.dll',
   'BINARY'),
  ('api-ms-win-crt-locale-l1-1-0.dll',
   'C:\\Windows\\system32\\api-ms-win-crt-locale-l1-1-0.dll',
   'BINARY'),
  ('api-ms-win-crt-runtime-l1-1-0.dll',
   'C:\\Windows\\system32\\api-ms-win-crt-runtime-l1-1-0.dll',
   'BINARY'),
  ('VCRUNTIME140.dll', 'C:\\Windows\\system32\\vcruntime140.dll', 'BINARY'),
  ('api-ms-win-crt-math-l1-1-0.dll',
   'C:\\Windows\\system32\\api-ms-win-crt-math-l1-1-0.dll',
   'BINARY'),
  ('ucrtbase.dll', 'C:\\Windows\\system32\\ucrtbase.dll', 'BINARY'),
  ('api-ms-win-crt-string-l1-1-0.dll',
   'C:\\Windows\\system32\\api-ms-win-crt-string-l1-1-0.dll',
   'BINARY'),
  ('api-ms-win-crt-process-l1-1-0.dll',
   'C:\\Windows\\system32\\api-ms-win-crt-process-l1-1-0.dll',
   'BINARY'),
  ('api-ms-win-crt-time-l1-1-0.dll',
   'C:\\Windows\\system32\\api-ms-win-crt-time-l1-1-0.dll',
   'BINARY'),
  ('api-ms-win-crt-environment-l1-1-0.dll',
   'C:\\Windows\\system32\\api-ms-win-crt-environment-l1-1-0.dll',
   'BINARY'),
  ('api-ms-win-crt-convert-l1-1-0.dll',
   'C:\\Windows\\system32\\api-ms-win-crt-convert-l1-1-0.dll',
   'BINARY'),
  ('api-ms-win-crt-filesystem-l1-1-0.dll',
   'C:\\Windows\\system32\\api-ms-win-crt-filesystem-l1-1-0.dll',
   'BINARY'),
  ('api-ms-win-crt-conio-l1-1-0.dll',
   'C:\\Windows\\system32\\api-ms-win-crt-conio-l1-1-0.dll',
   'BINARY'),
  ('api-ms-win-core-heap-l1-1-0.dll',
   'C:\\Windows\\system32\\api-ms-win-core-heap-l1-1-0.dll',
   'BINARY'),
  ('api-ms-win-core-processenvironment-l1-1-0.dll',
   'C:\\Windows\\system32\\api-ms-win-core-processenvironment-l1-1-0.dll',
   'BINARY'),
  ('api-ms-win-core-file-l1-2-0.dll',
   'C:\\Windows\\system32\\api-ms-win-core-file-l1-2-0.dll',
   'BINARY'),
  ('api-ms-win-core-synch-l1-1-0.dll',
   'C:\\Windows\\system32\\api-ms-win-core-synch-l1-1-0.dll',
   'BINARY'),
  ('api-ms-win-core-processthreads-l1-1-1.dll',
   'C:\\Windows\\system32\\api-ms-win-core-processthreads-l1-1-1.dll',
   'BINARY'),
  ('api-ms-win-core-console-l1-1-0.dll',
   'C:\\Windows\\system32\\api-ms-win-core-console-l1-1-0.dll',
   'BINARY'),
  ('api-ms-win-core-file-l1-1-0.dll',
   'C:\\Windows\\system32\\api-ms-win-core-file-l1-1-0.dll',
   'BINARY'),
  ('api-ms-win-core-datetime-l1-1-0.dll',
   'C:\\Windows\\system32\\api-ms-win-core-datetime-l1-1-0.dll',
   'BINARY'),
  ('api-ms-win-core-processthreads-l1-1-0.dll',
   'C:\\Windows\\system32\\api-ms-win-core-processthreads-l1-1-0.dll',
   'BINARY'),
  ('api-ms-win-core-file-l2-1-0.dll',
   'C:\\Windows\\system32\\api-ms-win-core-file-l2-1-0.dll',
   'BINARY'),
  ('api-ms-win-core-timezone-l1-1-0.dll',
   'C:\\Windows\\system32\\api-ms-win-core-timezone-l1-1-0.dll',
   'BINARY'),
  ('api-ms-win-core-string-l1-1-0.dll',
   'C:\\Windows\\system32\\api-ms-win-core-string-l1-1-0.dll',
   'BINARY'),
  ('api-ms-win-core-libraryloader-l1-1-0.dll',
   'C:\\Windows\\system32\\api-ms-win-core-libraryloader-l1-1-0.dll',
   'BINARY'),
  ('api-ms-win-core-profile-l1-1-0.dll',
   'C:\\Windows\\system32\\api-ms-win-core-profile-l1-1-0.dll',
   'BINARY'),
  ('api-ms-win-core-memory-l1-1-0.dll',
   'C:\\Windows\\system32\\api-ms-win-core-memory-l1-1-0.dll',
   'BINARY'),
  ('api-ms-win-core-localization-l1-2-0.dll',
   'C:\\Windows\\system32\\api-ms-win-core-localization-l1-2-0.dll',
   'BINARY'),
  ('api-ms-win-core-errorhandling-l1-1-0.dll',
   'C:\\Windows\\system32\\api-ms-win-core-errorhandling-l1-1-0.dll',
   'BINARY'),
  ('api-ms-win-core-interlocked-l1-1-0.dll',
   'C:\\Windows\\system32\\api-ms-win-core-interlocked-l1-1-0.dll',
   'BINARY'),
  ('api-ms-win-core-namedpipe-l1-1-0.dll',
   'C:\\Windows\\system32\\api-ms-win-core-namedpipe-l1-1-0.dll',
   'BINARY'),
  ('api-ms-win-core-synch-l1-2-0.dll',
   'C:\\Windows\\system32\\api-ms-win-core-synch-l1-2-0.dll',
   'BINARY'),
  ('api-ms-win-core-sysinfo-l1-1-0.dll',
   'C:\\Windows\\system32\\api-ms-win-core-sysinfo-l1-1-0.dll',
   'BINARY'),
  ('api-ms-win-core-debug-l1-1-0.dll',
   'C:\\Windows\\system32\\api-ms-win-core-debug-l1-1-0.dll',
   'BINARY'),
  ('api-ms-win-core-rtlsupport-l1-1-0.dll',
   'C:\\Windows\\system32\\api-ms-win-core-rtlsupport-l1-1-0.dll',
   'BINARY'),
  ('api-ms-win-core-util-l1-1-0.dll',
   'C:\\Windows\\system32\\api-ms-win-core-util-l1-1-0.dll',
   'BINARY'),
  ('api-ms-win-core-handle-l1-1-0.dll',
   'C:\\Windows\\system32\\api-ms-win-core-handle-l1-1-0.dll',
   'BINARY'),
  ('PyQt5\\Qt\\plugins\\imageformats\\qtga.dll',
   'E:\\nauka\\projekty_python\\wlasne_projekty\\env\\lib\\site-packages\\PyQt5\\Qt\\plugins\\imageformats\\qtga.dll',
   'BINARY'),
  ('PyQt5\\Qt\\plugins\\styles\\qwindowsvistastyle.dll',
   'E:\\nauka\\projekty_python\\wlasne_projekty\\env\\lib\\site-packages\\PyQt5\\Qt\\plugins\\styles\\qwindowsvistastyle.dll',
   'BINARY'),
  ('PyQt5\\Qt\\bin\\d3dcompiler_47.dll',
   'E:\\nauka\\projekty_python\\wlasne_projekty\\env\\lib\\site-packages\\PyQt5\\Qt\\bin\\d3dcompiler_47.dll',
   'BINARY'),
  ('PyQt5\\Qt\\bin\\libEGL.dll',
   'E:\\nauka\\projekty_python\\wlasne_projekty\\env\\lib\\site-packages\\PyQt5\\Qt\\bin\\libEGL.dll',
   'BINARY'),
  ('PyQt5\\Qt\\plugins\\imageformats\\qjpeg.dll',
   'E:\\nauka\\projekty_python\\wlasne_projekty\\env\\lib\\site-packages\\PyQt5\\Qt\\plugins\\imageformats\\qjpeg.dll',
   'BINARY'),
  ('PyQt5\\Qt\\plugins\\imageformats\\qico.dll',
   'E:\\nauka\\projekty_python\\wlasne_projekty\\env\\lib\\site-packages\\PyQt5\\Qt\\plugins\\imageformats\\qico.dll',
   'BINARY'),
  ('PyQt5\\Qt\\plugins\\imageformats\\qtiff.dll',
   'E:\\nauka\\projekty_python\\wlasne_projekty\\env\\lib\\site-packages\\PyQt5\\Qt\\plugins\\imageformats\\qtiff.dll',
   'BINARY'),
  ('PyQt5\\Qt\\plugins\\imageformats\\qicns.dll',
   'E:\\nauka\\projekty_python\\wlasne_projekty\\env\\lib\\site-packages\\PyQt5\\Qt\\plugins\\imageformats\\qicns.dll',
   'BINARY'),
  ('PyQt5\\Qt\\plugins\\platforms\\qwebgl.dll',
   'E:\\nauka\\projekty_python\\wlasne_projekty\\env\\lib\\site-packages\\PyQt5\\Qt\\plugins\\platforms\\qwebgl.dll',
   'BINARY'),
  ('PyQt5\\Qt\\plugins\\platforms\\qwindows.dll',
   'E:\\nauka\\projekty_python\\wlasne_projekty\\env\\lib\\site-packages\\PyQt5\\Qt\\plugins\\platforms\\qwindows.dll',
   'BINARY'),
  ('PyQt5\\Qt\\plugins\\platformthemes\\qflatpak.dll',
   'E:\\nauka\\projekty_python\\wlasne_projekty\\env\\lib\\site-packages\\PyQt5\\Qt\\plugins\\platformthemes\\qflatpak.dll',
   'BINARY'),
  ('PyQt5\\Qt\\plugins\\imageformats\\qgif.dll',
   'E:\\nauka\\projekty_python\\wlasne_projekty\\env\\lib\\site-packages\\PyQt5\\Qt\\plugins\\imageformats\\qgif.dll',
   'BINARY'),
  ('PyQt5\\Qt\\bin\\opengl32sw.dll',
   'E:\\nauka\\projekty_python\\wlasne_projekty\\env\\lib\\site-packages\\PyQt5\\Qt\\bin\\opengl32sw.dll',
   'BINARY'),
  ('PyQt5\\Qt\\plugins\\imageformats\\qsvg.dll',
   'E:\\nauka\\projekty_python\\wlasne_projekty\\env\\lib\\site-packages\\PyQt5\\Qt\\plugins\\imageformats\\qsvg.dll',
   'BINARY'),
  ('PyQt5\\Qt\\plugins\\imageformats\\qwbmp.dll',
   'E:\\nauka\\projekty_python\\wlasne_projekty\\env\\lib\\site-packages\\PyQt5\\Qt\\plugins\\imageformats\\qwbmp.dll',
   'BINARY'),
  ('PyQt5\\Qt\\plugins\\platforms\\qoffscreen.dll',
   'E:\\nauka\\projekty_python\\wlasne_projekty\\env\\lib\\site-packages\\PyQt5\\Qt\\plugins\\platforms\\qoffscreen.dll',
   'BINARY'),
  ('PyQt5\\Qt\\plugins\\platforms\\qminimal.dll',
   'E:\\nauka\\projekty_python\\wlasne_projekty\\env\\lib\\site-packages\\PyQt5\\Qt\\plugins\\platforms\\qminimal.dll',
   'BINARY'),
  ('PyQt5\\Qt\\plugins\\imageformats\\qwebp.dll',
   'E:\\nauka\\projekty_python\\wlasne_projekty\\env\\lib\\site-packages\\PyQt5\\Qt\\plugins\\imageformats\\qwebp.dll',
   'BINARY'),
  ('PyQt5\\Qt\\plugins\\iconengines\\qsvgicon.dll',
   'E:\\nauka\\projekty_python\\wlasne_projekty\\env\\lib\\site-packages\\PyQt5\\Qt\\plugins\\iconengines\\qsvgicon.dll',
   'BINARY'),
  ('PyQt5\\Qt\\bin\\libGLESv2.dll',
   'E:\\nauka\\projekty_python\\wlasne_projekty\\env\\lib\\site-packages\\PyQt5\\Qt\\bin\\libGLESv2.dll',
   'BINARY'),
  ('_ssl', 'c:\\python36\\DLLs\\_ssl.pyd', 'EXTENSION'),
  ('unicodedata', 'c:\\python36\\DLLs\\unicodedata.pyd', 'EXTENSION'),
  ('pyexpat', 'c:\\python36\\DLLs\\pyexpat.pyd', 'EXTENSION'),
  ('_hashlib', 'c:\\python36\\DLLs\\_hashlib.pyd', 'EXTENSION'),
  ('select', 'c:\\python36\\DLLs\\select.pyd', 'EXTENSION'),
  ('_bz2', 'c:\\python36\\DLLs\\_bz2.pyd', 'EXTENSION'),
  ('_lzma', 'c:\\python36\\DLLs\\_lzma.pyd', 'EXTENSION'),
  ('_socket', 'c:\\python36\\DLLs\\_socket.pyd', 'EXTENSION'),
  ('_decimal', 'c:\\python36\\DLLs\\_decimal.pyd', 'EXTENSION'),
  ('_ctypes', 'c:\\python36\\DLLs\\_ctypes.pyd', 'EXTENSION'),
  ('PyQt5.QtCore',
   'e:\\nauka\\projekty_python\\wlasne_projekty\\env\\lib\\site-packages\\PyQt5\\QtCore.pyd',
   'EXTENSION'),
  ('PyQt5.sip',
   'e:\\nauka\\projekty_python\\wlasne_projekty\\env\\lib\\site-packages\\PyQt5\\sip.pyd',
   'EXTENSION'),
  ('PyQt5.QtWidgets',
   'e:\\nauka\\projekty_python\\wlasne_projekty\\env\\lib\\site-packages\\PyQt5\\QtWidgets.pyd',
   'EXTENSION'),
  ('PyQt5.QtGui',
   'e:\\nauka\\projekty_python\\wlasne_projekty\\env\\lib\\site-packages\\PyQt5\\QtGui.pyd',
   'EXTENSION'),
  ('Qt5Gui.dll',
   'e:\\nauka\\projekty_python\\wlasne_projekty\\env\\lib\\site-packages\\PyQt5\\Qt\\bin\\qt5gui.dll',
   'BINARY'),
  ('Qt5Core.dll',
   'e:\\nauka\\projekty_python\\wlasne_projekty\\env\\lib\\site-packages\\PyQt5\\Qt\\bin\\qt5core.dll',
   'BINARY'),
  ('Qt5Widgets.dll',
   'e:\\nauka\\projekty_python\\wlasne_projekty\\env\\lib\\site-packages\\PyQt5\\Qt\\bin\\qt5widgets.dll',
   'BINARY'),
  ('libGLESv2.dll',
   'E:\\nauka\\projekty_python\\wlasne_projekty\\env\\lib\\site-packages\\PyQt5\\Qt\\bin\\libGLESv2.dll',
   'BINARY'),
  ('api-ms-win-crt-utility-l1-1-0.dll',
   'C:\\Windows\\system32\\api-ms-win-crt-utility-l1-1-0.dll',
   'BINARY'),
  ('Qt5Network.dll',
   'e:\\nauka\\projekty_python\\wlasne_projekty\\env\\lib\\site-packages\\PyQt5\\Qt\\bin\\qt5network.dll',
   'BINARY'),
  ('Qt5WebSockets.dll',
   'e:\\nauka\\projekty_python\\wlasne_projekty\\env\\lib\\site-packages\\PyQt5\\Qt\\bin\\qt5websockets.dll',
   'BINARY'),
  ('Qt5Quick.dll',
   'e:\\nauka\\projekty_python\\wlasne_projekty\\env\\lib\\site-packages\\PyQt5\\Qt\\bin\\qt5quick.dll',
   'BINARY'),
  ('Qt5DBus.dll',
   'e:\\nauka\\projekty_python\\wlasne_projekty\\env\\lib\\site-packages\\PyQt5\\Qt\\bin\\qt5dbus.dll',
   'BINARY'),
  ('Qt5Svg.dll',
   'e:\\nauka\\projekty_python\\wlasne_projekty\\env\\lib\\site-packages\\PyQt5\\Qt\\bin\\qt5svg.dll',
   'BINARY'),
  ('MSVCP140.dll',
   'E:\\nauka\\projekty_python\\wlasne_projekty\\env\\lib\\site-packages\\PyQt5\\Qt\\bin\\MSVCP140.dll',
   'BINARY'),
  ('python3.dll',
   'e:\\nauka\\projekty_python\\wlasne_projekty\\env\\scripts\\python3.dll',
   'BINARY'),
  ('Qt5Qml.dll',
   'e:\\nauka\\projekty_python\\wlasne_projekty\\env\\lib\\site-packages\\PyQt5\\Qt\\bin\\Qt5Qml.dll',
   'BINARY'),
  ('api-ms-win-crt-multibyte-l1-1-0.dll',
   'C:\\Windows\\system32\\api-ms-win-crt-multibyte-l1-1-0.dll',
   'BINARY')],
 [],
 [],
 [('base_library.zip',
   'E:\\Nauka\\projekty_python\\wlasne_projekty\\pdf_merger_QT\\build\\mergerQt\\base_library.zip',
   'DATA'),
  ('PyQt5\\Qt\\translations\\qtbase_ca.qm',
   'E:\\nauka\\projekty_python\\wlasne_projekty\\env\\lib\\site-packages\\PyQt5\\Qt\\translations\\qtbase_ca.qm',
   'DATA'),
  ('PyQt5\\Qt\\translations\\qtbase_it.qm',
   'E:\\nauka\\projekty_python\\wlasne_projekty\\env\\lib\\site-packages\\PyQt5\\Qt\\translations\\qtbase_it.qm',
   'DATA'),
  ('PyQt5\\Qt\\translations\\qtbase_he.qm',
   'E:\\nauka\\projekty_python\\wlasne_projekty\\env\\lib\\site-packages\\PyQt5\\Qt\\translations\\qtbase_he.qm',
   'DATA'),
  ('PyQt5\\Qt\\translations\\qtbase_es.qm',
   'E:\\nauka\\projekty_python\\wlasne_projekty\\env\\lib\\site-packages\\PyQt5\\Qt\\translations\\qtbase_es.qm',
   'DATA'),
  ('PyQt5\\Qt\\translations\\qtbase_de.qm',
   'E:\\nauka\\projekty_python\\wlasne_projekty\\env\\lib\\site-packages\\PyQt5\\Qt\\translations\\qtbase_de.qm',
   'DATA'),
  ('PyQt5\\Qt\\translations\\qtbase_hu.qm',
   'E:\\nauka\\projekty_python\\wlasne_projekty\\env\\lib\\site-packages\\PyQt5\\Qt\\translations\\qtbase_hu.qm',
   'DATA'),
  ('PyQt5\\Qt\\translations\\qtbase_lv.qm',
   'E:\\nauka\\projekty_python\\wlasne_projekty\\env\\lib\\site-packages\\PyQt5\\Qt\\translations\\qtbase_lv.qm',
   'DATA'),
  ('PyQt5\\Qt\\translations\\qtbase_da.qm',
   'E:\\nauka\\projekty_python\\wlasne_projekty\\env\\lib\\site-packages\\PyQt5\\Qt\\translations\\qtbase_da.qm',
   'DATA'),
  ('PyQt5\\Qt\\translations\\qtbase_fr.qm',
   'E:\\nauka\\projekty_python\\wlasne_projekty\\env\\lib\\site-packages\\PyQt5\\Qt\\translations\\qtbase_fr.qm',
   'DATA'),
  ('PyQt5\\Qt\\translations\\qtbase_pl.qm',
   'E:\\nauka\\projekty_python\\wlasne_projekty\\env\\lib\\site-packages\\PyQt5\\Qt\\translations\\qtbase_pl.qm',
   'DATA'),
  ('PyQt5\\Qt\\translations\\qtbase_fi.qm',
   'E:\\nauka\\projekty_python\\wlasne_projekty\\env\\lib\\site-packages\\PyQt5\\Qt\\translations\\qtbase_fi.qm',
   'DATA'),
  ('PyQt5\\Qt\\translations\\qtbase_cs.qm',
   'E:\\nauka\\projekty_python\\wlasne_projekty\\env\\lib\\site-packages\\PyQt5\\Qt\\translations\\qtbase_cs.qm',
   'DATA'),
  ('PyQt5\\Qt\\translations\\qtbase_ar.qm',
   'E:\\nauka\\projekty_python\\wlasne_projekty\\env\\lib\\site-packages\\PyQt5\\Qt\\translations\\qtbase_ar.qm',
   'DATA'),
  ('PyQt5\\Qt\\translations\\qtbase_ko.qm',
   'E:\\nauka\\projekty_python\\wlasne_projekty\\env\\lib\\site-packages\\PyQt5\\Qt\\translations\\qtbase_ko.qm',
   'DATA'),
  ('PyQt5\\Qt\\translations\\qtbase_en.qm',
   'E:\\nauka\\projekty_python\\wlasne_projekty\\env\\lib\\site-packages\\PyQt5\\Qt\\translations\\qtbase_en.qm',
   'DATA'),
  ('PyQt5\\Qt\\translations\\qtbase_uk.qm',
   'E:\\nauka\\projekty_python\\wlasne_projekty\\env\\lib\\site-packages\\PyQt5\\Qt\\translations\\qtbase_uk.qm',
   'DATA'),
  ('PyQt5\\Qt\\bin\\qt.conf',
   'E:\\nauka\\projekty_python\\wlasne_projekty\\env\\lib\\site-packages\\PyQt5\\Qt\\bin\\qt.conf',
   'DATA'),
  ('PyQt5\\Qt\\translations\\qtbase_ru.qm',
   'E:\\nauka\\projekty_python\\wlasne_projekty\\env\\lib\\site-packages\\PyQt5\\Qt\\translations\\qtbase_ru.qm',
   'DATA'),
  ('PyQt5\\Qt\\translations\\qtbase_ja.qm',
   'E:\\nauka\\projekty_python\\wlasne_projekty\\env\\lib\\site-packages\\PyQt5\\Qt\\translations\\qtbase_ja.qm',
   'DATA'),
  ('PyQt5\\Qt\\translations\\qtbase_gd.qm',
   'E:\\nauka\\projekty_python\\wlasne_projekty\\env\\lib\\site-packages\\PyQt5\\Qt\\translations\\qtbase_gd.qm',
   'DATA'),
  ('PyQt5\\Qt\\translations\\qtbase_bg.qm',
   'E:\\nauka\\projekty_python\\wlasne_projekty\\env\\lib\\site-packages\\PyQt5\\Qt\\translations\\qtbase_bg.qm',
   'DATA'),
  ('PyQt5\\Qt\\translations\\qtbase_sk.qm',
   'E:\\nauka\\projekty_python\\wlasne_projekty\\env\\lib\\site-packages\\PyQt5\\Qt\\translations\\qtbase_sk.qm',
   'DATA')],
 [])
