%YAML 1.1
%TAG !u! tag:unity3d.com,2011:
--- !u!74 &7400000
AnimationClip:
  m_ObjectHideFlags: 0
  m_PrefabParentObject: {fileID: 0}
  m_PrefabInternal: {fileID: 0}
  m_Name: CatJumpUp
  serializedVersion: 6
  m_Legacy: 0
  m_Compressed: 0
  m_UseHighQualityCurve: 1
  m_RotationCurves: []
  m_CompressedRotationCurves: []
  m_EulerCurves: []
  m_PositionCurves:
  - curve:
      serializedVersion: 2
      m_Curve:
      - serializedVersion: 2
        time: 0
        value: {x: 1.5, y: 2.34, z: 0}
        inSlope: {x: 0, y: 0, z: 0}
        outSlope: {x: 0, y: 0, z: 0}
        tangentMode: 0
      - serializedVersion: 2
        time: 0.09090909
        value: {x: 1.8, y: 2.69, z: 0}
        inSlope: {x: 0, y: 2.7866666, z: 0}
        outSlope: {x: 0, y: 2.7866666, z: 0}
        tangentMode: 0
      - serializedVersion: 2
        time: 0.27272728
        value: {x: 1.21, y: 3.1, z: 0}
        inSlope: {x: -2.2000012, y: 4.363333, z: 0}
        outSlope: {x: -2.2000012, y: 4.363333, z: 0}
        tangentMode: 0
      - serializedVersion: 2
        time: 0.36363637
        value: {x: 1.06, y: 3.88, z: 0}
        inSlope: {x: -3.3000019, y: 15.51, z: 0}
        outSlope: {x: -3.3000019, y: 15.51, z: 0}
        tangentMode: 0
      - serializedVersion: 2
        time: 0.45454547
        value: {x: 0.56, y: 5.92, z: 0}
        inSlope: {x: -6.104999, y: 22.824997, z: 0}
        outSlope: {x: -6.104999, y: 22.824997, z: 0}
        tangentMode: 0
      - serializedVersion: 2
        time: 0.54545456
        value: {x: -0.05, y: 8.03, z: 0}
        inSlope: {x: -13.420001, y: 17.545, z: 0}
        outSlope: {x: -13.420001, y: 17.545, z: 0}
        tangentMode: 0
      - serializedVersion: 2
        time: 0.6363636
        value: {x: -2.57, y: 9.11, z: 0}
        inSlope: {x: 0, y: 7.7000084, z: 0}
        outSlope: {x: 0, y: 7.7000084, z: 0}
        tangentMode: 0
      - serializedVersion: 2
        time: 0.72727275
        value: {x: -2.57, y: 9.46, z: 0}
        inSlope: {x: 0, y: 0, z: 0}
        outSlope: {x: 0, y: 0, z: 0}
        tangentMode: 0
      - serializedVersion: 2
        time: 0.90909094
        value: {x: -2.92, y: 6.05, z: 0}
        inSlope: {x: 0, y: -21.120003, z: 0}
        outSlope: {x: 0, y: -21.120003, z: 0}
        tangentMode: 0
      - serializedVersion: 2
        time: 1
        value: {x: -2.19, y: 3.7, z: 0}
        inSlope: {x: 5.775, y: -20.240002, z: 0}
        outSlope: {x: 5.775, y: -20.240002, z: 0}
        tangentMode: 0
      - serializedVersion: 2
        time: 1.0909091
        value: {x: -1.87, y: 2.37, z: 0}
        inSlope: {x: 5.5000014, y: -12.815003, z: 0}
        outSlope: {x: 5.5000014, y: -12.815003, z: 0}
        tangentMode: 0
      - serializedVersion: 2
        time: 1.1818181
        value: {x: -1.19, y: 1.37, z: 0}
        inSlope: {x: 0, y: 0, z: 0}
        outSlope: {x: 0, y: 0, z: 0}
        tangentMode: 0
      - serializedVersion: 2
        time: 1.3636364
        value: {x: -2.3, y: 1.71, z: 0}
        inSlope: {x: -3.666666, y: 4.9866652, z: 0}
        outSlope: {x: -3.666666, y: 4.9866652, z: 0}
        tangentMode: 0
      - serializedVersion: 2
        time: 1.4545455
        value: {x: -2.55, y: 3.28, z: 0}
        inSlope: {x: 0, y: 0, z: 0}
        outSlope: {x: 0, y: 0, z: 0}
        tangentMode: 0
      - serializedVersion: 2
        time: 1.6363636
        value: {x: -1.69, y: 3.16, z: 0}
        inSlope: {x: 0, y: 0, z: 0}
        outSlope: {x: 0, y: 0, z: 0}
        tangentMode: 0
      m_PreInfinity: 2
      m_PostInfinity: 2
      m_RotationOrder: 4
    path: Collider
  m_ScaleCurves: []
  m_FloatCurves:
  - curve:
      serializedVersion: 2
      m_Curve:
      - serializedVersion: 2
        time: 0
        value: 0.62957025
        inSlope: 0
        outSlope: 0
        tangentMode: 136
      - serializedVersion: 2
        time: 0.6363636
        value: 0.90010786
        inSlope: 0
        outSlope: 0
        tangentMode: 136
      m_PreInfinity: 2
      m_PostInfinity: 2
      m_RotationOrder: 4
    attribute: m_Offset.x
    path: Collider
    classID: 58
    script: {fileID: 0}
  - curve:
      serializedVersion: 2
      m_Curve:
      - serializedVersion: 2
        time: 0
        value: 1.1295702
        inSlope: 0
        outSlope: 0
        tangentMode: 136
      - serializedVersion: 2
        time: 0.6363636
        value: 1.4001079
        inSlope: 0
        outSlope: 0
        tangentMode: 136
      m_PreInfinity: 2
      m_PostInfinity: 2
      m_RotationOrder: 4
    attribute: m_Radius
    path: Collider
    classID: 58
    script: {fileID: 0}
  m_PPtrCurves:
  - curve:
    - time: 0
      value: {fileID: 21300000, guid: 06dadef315576524f930fb9410f92f6c, type: 3}
    - time: 0.09090909
      value: {fileID: 21300002, guid: 06dadef315576524f930fb9410f92f6c, type: 3}
    - time: 0.18181819
      value: {fileID: 21300004, guid: 06dadef315576524f930fb9410f92f6c, type: 3}
    - time: 0.27272728
      value: {fileID: 21300006, guid: 06dadef315576524f930fb9410f92f6c, type: 3}
    - time: 0.36363637
      value: {fileID: 21300008, guid: 06dadef315576524f930fb9410f92f6c, type: 3}
    - time: 0.45454547
      value: {fileID: 21300010, guid: 06dadef315576524f930fb9410f92f6c, type: 3}
    - time: 0.54545456
      value: {fileID: 21300012, guid: 06dadef315576524f930fb9410f92f6c, type: 3}
    - time: 0.6363636
      value: {fileID: 21300014, guid: 06dadef315576524f930fb9410f92f6c, type: 3}
    - time: 0.72727275
      value: {fileID: 21300016, guid: 06dadef315576524f930fb9410f92f6c, type: 3}
    - time: 0.8181818
      value: {fileID: 21300018, guid: 06dadef315576524f930fb9410f92f6c, type: 3}
    - time: 0.90909094
      value: {fileID: 21300020, guid: 06dadef315576524f930fb9410f92f6c, type: 3}
    - time: 1
      value: {fileID: 21300022, guid: 06dadef315576524f930fb9410f92f6c, type: 3}
    - time: 1.0909091
      value: {fileID: 21300024, guid: 06dadef315576524f930fb9410f92f6c, type: 3}
    - time: 1.1818181
      value: {fileID: 21300026, guid: 06dadef315576524f930fb9410f92f6c, type: 3}
    - time: 1.2727273
      value: {fileID: 21300028, guid: 06dadef315576524f930fb9410f92f6c, type: 3}
    - time: 1.3636364
      value: {fileID: 21300030, guid: 06dadef315576524f930fb9410f92f6c, type: 3}
    - time: 1.4545455
      value: {fileID: 21300032, guid: 06dadef315576524f930fb9410f92f6c, type: 3}
    - time: 1.5454545
      value: {fileID: 21300034, guid: 06dadef315576524f930fb9410f92f6c, type: 3}
    - time: 1.6363636
      value: {fileID: 21300036, guid: 06dadef315576524f930fb9410f92f6c, type: 3}
    - time: 1.7272727
      value: {fileID: 21300038, guid: 06dadef315576524f930fb9410f92f6c, type: 3}
    attribute: m_Sprite
    path: 
    classID: 212
    script: {fileID: 0}
  m_SampleRate: 11
  m_WrapMode: 0
  m_Bounds:
    m_Center: {x: 0, y: 0, z: 0}
    m_Extent: {x: 0, y: 0, z: 0}
  m_ClipBindingConstant:
    genericBindings:
    - serializedVersion: 2
      path: 860563329
      attribute: 1
      script: {fileID: 0}
      typeID: 4
      customType: 0
      isPPtrCurve: 0
    - serializedVersion: 2
      path: 860563329
      attribute: 413499720
      script: {fileID: 0}
      typeID: 58
      customType: 0
      isPPtrCurve: 0
    - serializedVersion: 2
      path: 860563329
      attribute: 1984117138
      script: {fileID: 0}
      typeID: 58
      customType: 0
      isPPtrCurve: 0
    - serializedVersion: 2
      path: 0
      attribute: 0
      script: {fileID: 0}
      typeID: 212
      customType: 23
      isPPtrCurve: 1
    pptrCurveMapping:
    - {fileID: 21300000, guid: 06dadef315576524f930fb9410f92f6c, type: 3}
    - {fileID: 21300002, guid: 06dadef315576524f930fb9410f92f6c, type: 3}
    - {fileID: 21300004, guid: 06dadef315576524f930fb9410f92f6c, type: 3}
    - {fileID: 21300006, guid: 06dadef315576524f930fb9410f92f6c, type: 3}
    - {fileID: 21300008, guid: 06dadef315576524f930fb9410f92f6c, type: 3}
    - {fileID: 21300010, guid: 06dadef315576524f930fb9410f92f6c, type: 3}
    - {fileID: 21300012, guid: 06dadef315576524f930fb9410f92f6c, type: 3}
    - {fileID: 21300014, guid: 06dadef315576524f930fb9410f92f6c, type: 3}
    - {fileID: 21300016, guid: 06dadef315576524f930fb9410f92f6c, type: 3}
    - {fileID: 21300018, guid: 06dadef315576524f930fb9410f92f6c, type: 3}
    - {fileID: 21300020, guid: 06dadef315576524f930fb9410f92f6c, type: 3}
    - {fileID: 21300022, guid: 06dadef315576524f930fb9410f92f6c, type: 3}
    - {fileID: 21300024, guid: 06dadef315576524f930fb9410f92f6c, type: 3}
    - {fileID: 21300026, guid: 06dadef315576524f930fb9410f92f6c, type: 3}
    - {fileID: 21300028, guid: 06dadef315576524f930fb9410f92f6c, type: 3}
    - {fileID: 21300030, guid: 06dadef315576524f930fb9410f92f6c, type: 3}
    - {fileID: 21300032, guid: 06dadef315576524f930fb9410f92f6c, type: 3}
    - {fileID: 21300034, guid: 06dadef315576524f930fb9410f92f6c, type: 3}
    - {fileID: 21300036, guid: 06dadef315576524f930fb9410f92f6c, type: 3}
    - {fileID: 21300038, guid: 06dadef315576524f930fb9410f92f6c, type: 3}
  m_AnimationClipSettings:
    serializedVersion: 2
    m_AdditiveReferencePoseClip: {fileID: 0}
    m_AdditiveReferencePoseTime: 0
    m_StartTime: 0
    m_StopTime: 1.8181819
    m_OrientationOffsetY: 0
    m_Level: 0
    m_CycleOffset: 0
    m_HasAdditiveReferencePose: 0
    m_LoopTime: 1
    m_LoopBlend: 0
    m_LoopBlendOrientation: 0
    m_LoopBlendPositionY: 0
    m_LoopBlendPositionXZ: 0
    m_KeepOriginalOrientation: 0
    m_KeepOriginalPositionY: 1
    m_KeepOriginalPositionXZ: 0
    m_HeightFromFeet: 0
    m_Mirror: 0
  m_EditorCurves:
  - curve:
      serializedVersion: 2
      m_Curve:
      - serializedVersion: 2
        time: 0
        value: 0.62957025
        inSlope: 0
        outSlope: 0
        tangentMode: 136
      - serializedVersion: 2
        time: 0.6363636
        value: 0.90010786
        inSlope: 0
        outSlope: 0
        tangentMode: 136
      m_PreInfinity: 2
      m_PostInfinity: 2
      m_RotationOrder: 4
    attribute: m_Offset.x
    path: Collider
    classID: 58
    script: {fileID: 0}
  - curve:
      serializedVersion: 2
      m_Curve:
      - serializedVersion: 2
        time: 0
        value: 1.1295702
        inSlope: 0
        outSlope: 0
        tangentMode: 136
      - serializedVersion: 2
        time: 0.6363636
        value: 1.4001079
        inSlope: 0
        outSlope: 0
        tangentMode: 136
      m_PreInfinity: 2
      m_PostInfinity: 2
      m_RotationOrder: 4
    attribute: m_Radius
    path: Collider
    classID: 58
    script: {fileID: 0}
  - curve:
      serializedVersion: 2
      m_Curve:
      - serializedVersion: 2
        time: 0
        value: 1.5
        inSlope: 0
        outSlope: 0
        tangentMode: 136
      - serializedVersion: 2
        time: 0.09090909
        value: 1.8
        inSlope: 0
        outSlope: 0
        tangentMode: 136
      - serializedVersion: 2
        time: 0.27272728
        value: 1.21
        inSlope: -2.2000012
        outSlope: -2.2000012
        tangentMode: 136
      - serializedVersion: 2
        time: 0.36363637
        value: 1.06
        inSlope: -3.3000019
        outSlope: -3.3000019
        tangentMode: 136
      - serializedVersion: 2
        time: 0.45454547
        value: 0.56
        inSlope: -6.104999
        outSlope: -6.104999
        tangentMode: 136
      - serializedVersion: 2
        time: 0.54545456
        value: -0.05
        inSlope: -13.420001
        outSlope: -13.420001
        tangentMode: 136
      - serializedVersion: 2
        time: 0.6363636
        value: -2.57
        inSlope: 0
        outSlope: 0
        tangentMode: 136
      - serializedVersion: 2
        time: 0.72727275
        value: -2.57
        inSlope: 0
        outSlope: 0
        tangentMode: 136
      - serializedVersion: 2
        time: 0.90909094
        value: -2.92
        inSlope: 0
        outSlope: 0
        tangentMode: 136
      - serializedVersion: 2
        time: 1
        value: -2.19
        inSlope: 5.775
        outSlope: 5.775
        tangentMode: 136
      - serializedVersion: 2
        time: 1.0909091
        value: -1.87
        inSlope: 5.5000014
        outSlope: 5.5000014
        tangentMode: 136
      - serializedVersion: 2
        time: 1.1818181
        value: -1.19
        inSlope: 0
        outSlope: 0
        tangentMode: 136
      - serializedVersion: 2
        time: 1.3636364
        value: -2.3
        inSlope: -3.666666
        outSlope: -3.666666
        tangentMode: 136
      - serializedVersion: 2
        time: 1.4545455
        value: -2.55
        inSlope: 0
        outSlope: 0
        tangentMode: 136
      - serializedVersion: 2
        time: 1.6363636
        value: -1.69
        inSlope: 0
        outSlope: 0
        tangentMode: 136
      m_PreInfinity: 2
      m_PostInfinity: 2
      m_RotationOrder: 4
    attribute: m_LocalPosition.x
    path: Collider
    classID: 4
    script: {fileID: 0}
  - curve:
      serializedVersion: 2
      m_Curve:
      - serializedVersion: 2
        time: 0
        value: 2.34
        inSlope: 0
        outSlope: 0
        tangentMode: 136
      - serializedVersion: 2
        time: 0.09090909
        value: 2.69
        inSlope: 2.7866666
        outSlope: 2.7866666
        tangentMode: 136
      - serializedVersion: 2
        time: 0.27272728
        value: 3.1
        inSlope: 4.363333
        outSlope: 4.363333
        tangentMode: 136
      - serializedVersion: 2
        time: 0.36363637
        value: 3.88
        inSlope: 15.51
        outSlope: 15.51
        tangentMode: 136
      - serializedVersion: 2
        time: 0.45454547
        value: 5.92
        inSlope: 22.824997
        outSlope: 22.824997
        tangentMode: 136
      - serializedVersion: 2
        time: 0.54545456
        value: 8.03
        inSlope: 17.545
        outSlope: 17.545
        tangentMode: 136
      - serializedVersion: 2
        time: 0.6363636
        value: 9.11
        inSlope: 7.7000084
        outSlope: 7.7000084
        tangentMode: 136
      - serializedVersion: 2
        time: 0.72727275
        value: 9.46
        inSlope: 0
        outSlope: 0
        tangentMode: 136
      - serializedVersion: 2
        time: 0.90909094
        value: 6.05
        inSlope: -21.120003
        outSlope: -21.120003
        tangentMode: 136
      - serializedVersion: 2
        time: 1
        value: 3.7
        inSlope: -20.240002
        outSlope: -20.240002
        tangentMode: 136
      - serializedVersion: 2
        time: 1.0909091
        value: 2.37
        inSlope: -12.815003
        outSlope: -12.815003
        tangentMode: 136
      - serializedVersion: 2
        time: 1.1818181
        value: 1.37
        inSlope: 0
        outSlope: 0
        tangentMode: 136
      - serializedVersion: 2
        time: 1.3636364
        value: 1.71
        inSlope: 4.9866652
        outSlope: 4.9866652
        tangentMode: 136
      - serializedVersion: 2
        time: 1.4545455
        value: 3.28
        inSlope: 0
        outSlope: 0
        tangentMode: 136
      - serializedVersion: 2
        time: 1.6363636
        value: 3.16
        inSlope: 0
        outSlope: 0
        tangentMode: 136
      m_PreInfinity: 2
      m_PostInfinity: 2
      m_RotationOrder: 4
    attribute: m_LocalPosition.y
    path: Collider
    classID: 4
    script: {fileID: 0}
  - curve:
      serializedVersion: 2
      m_Curve:
      - serializedVersion: 2
        time: 0
        value: 0
        inSlope: 0
        outSlope: 0
        tangentMode: 136
      - serializedVersion: 2
        time: 0.09090909
        value: 0
        inSlope: 0
        outSlope: 0
        tangentMode: 136
      - serializedVersion: 2
        time: 0.27272728
        value: 0
        inSlope: 0
        outSlope: 0
        tangentMode: 136
      - serializedVersion: 2
        time: 0.36363637
        value: 0
        inSlope: 0
        outSlope: 0
        tangentMode: 136
      - serializedVersion: 2
        time: 0.45454547
        value: 0
        inSlope: 0
        outSlope: 0
        tangentMode: 136
      - serializedVersion: 2
        time: 0.54545456
        value: 0
        inSlope: 0
        outSlope: 0
        tangentMode: 136
      - serializedVersion: 2
        time: 0.6363636
        value: 0
        inSlope: 0
        outSlope: 0
        tangentMode: 136
      - serializedVersion: 2
        time: 0.72727275
        value: 0
        inSlope: 0
        outSlope: 0
        tangentMode: 136
      - serializedVersion: 2
        time: 0.90909094
        value: 0
        inSlope: 0
        outSlope: 0
        tangentMode: 136
      - serializedVersion: 2
        time: 1
        value: 0
        inSlope: 0
        outSlope: 0
        tangentMode: 136
      - serializedVersion: 2
        time: 1.0909091
        value: 0
        inSlope: 0
        outSlope: 0
        tangentMode: 136
      - serializedVersion: 2
        time: 1.1818181
        value: 0
        inSlope: 0
        outSlope: 0
        tangentMode: 136
      - serializedVersion: 2
        time: 1.3636364
        value: 0
        inSlope: 0
        outSlope: 0
        tangentMode: 136
      - serializedVersion: 2
        time: 1.4545455
        value: 0
        inSlope: 0
        outSlope: 0
        tangentMode: 136
      - serializedVersion: 2
        time: 1.6363636
        value: 0
        inSlope: 0
        outSlope: 0
        tangentMode: 136
      m_PreInfinity: 2
      m_PostInfinity: 2
      m_RotationOrder: 4
    attribute: m_LocalPosition.z
    path: Collider
    classID: 4
    script: {fileID: 0}
  m_EulerEditorCurves: []
  m_HasGenericRootTransform: 0
  m_HasMotionFloatCurves: 0
  m_GenerateMotionCurves: 0
  m_Events:
  - time: 1.1818181
    functionName: PlaySmokeParticles
    data: 
    objectReferenceParameter: {fileID: 0}
    floatParameter: 0
    intParameter: 0
    messageOptions: 0
