<svg
        id="Capa_4"
        xmlns="http://www.w3.org/2000/svg"
        viewBox="0 0 43.81 31.79">
    <defs>
        <style>
            .cls-1,.cls-2{
                fill:none;
                stroke:#211915;
            }
            .cls-1{
                stroke-linejoin:round;
            }
            .cls-2{
                stroke-miterlimit:10;
            }
        </style>
    </defs>
    <title>note</title>
    <polygon
            class="cls-1"
            points="0.5 0.5 35.87 0.5 35.87 7.6 43.31 7.6 43.31 31.29 0.5 31.29 0.5 0.5"/>
    <line
            class="cls-2"
            x1="35.87"
            y1="0.5"
            x2="43.31"
            y2="7.6"/>
</svg>