{
  "name": "marionetoj-logrotate",
  "version": "0.2.0",
  "author": "Johan Fleury (Arcaik)",
  "summary": "Manage logrotate",
  "license": "GPL-3.0-or-later",
  "source": "https://gitlab.com/marionetoj/puppet-modules/logrotate",
  "project_page": "https://gitlab.com/marionetoj/puppet-modules/logrotate",
  "issues_url": "https://gitlab.com/marionetoj/puppet-modules/logrotate/-/issues",
  "dependencies": [
    {
      "name": "puppetlabs-stdlib",
      "version_requirement": ">= 4.0.0 < 7.0.0"
    }
  ],
  "operatingsystem_support": [
    {
      "operatingsystem": "Debian",
      "operatingsystemrelease": [
        "9",
        "10"
      ]
    }
  ],
  "requirements": [
    {
      "name": "puppet",
      "version_requirement": ">= 4.10.0 < 7.0.0"
    }
  ],
  "tags": [
    "logrotate"
  ],
  "pdk-version": "1.17.0",
  "template-url": "https://gitlab.com/marionetoj/puppet-modules/pdk-templates.git#main",
  "template-ref": "heads/main-0-g82ccd8a"
}
