[
    "index.html",
    "agenda.html",
    "language-tree.html",
    "origins.html",
    "timeline.html",
    "great-vowel-shift.html",
    "example.html",
    "english-today.html",
    "bibliography.html"
]