<?xml version="1.0" encoding="UTF-8"?>
<svg width="512" height="512" version="1.1" viewBox="0 0 512 512" xmlns="http://www.w3.org/2000/svg">
 <path d="m471.95 253.05c0 120.9-98.01 218.9-218.9 218.9-120.9 0-218.9-98.01-218.9-218.9 0-120.9 98.01-218.9 218.9-218.9 120.9 0 218.9 98.01 218.9 218.9" fill="#0080a2" fill-rule="evenodd"/>
 <path d="m145.11 161.92c69.223 36.391 0 0-25.15-21.101-16.457 24.931-32.027 41.59-33.813 74.335-3.3894 55.009 20.219 109.73 58.688 148.26 68.871 66.094 78.22 81.497 115.76 116.57 129.5-27.481 191.17-91.43 220.04-223.5l4.339-19.847c-33.151-32.56-12.959-12.307-92.169-92.619-2.7639 19.905 14.388 59.715 9.4242 60.319-5.8958 0.71724-34.081-40.062-38.891-41.441-10.734-3.0764-21.063-17.781-34.644-30.899-33.199-24.148-82.319-23.228-115.56-24.023" opacity=".25"/>
 <path d="m243.03 98.107c-12.512 1.9067-24.897 4.9708-36.901 9.204-12.19 4.9877-23.79 11.858-34.122 20.384-9.3224 7.779-18.232 16.347-24.867 26.913-7.253 9.9031-12.792 21.184-17.045 32.889-4.7498 12.197-5.9219 25.59-6.5673 38.663-1.2112 14.033 0.38564 28.396 4.2852 41.849 3.8055 13.552 9.7152 26.501 17.435 37.993 3.7098 5.3548 6.1922 11.792 6.3518 18.509 10.734 0.30134 18.658 9.5403 26.66 16.091 10.337 7.0072 21.563 12.744 33.215 16.815 15.163 5.9751 31.286 8.077 47.256 9.9404 11.749 1.3689 23.666 3.2692 35.444 1.1406 11.288-1.5584 22.722-3.4435 33.344-7.9458 11.105-4.9564 21.089-12.445 30.078-20.928 8.7045-7.9973 15.342-18.103 21.091-28.642 6.751-10.847 10.482-23.394 12.265-36.209 2.2201-12.018 2.1826-24.718 1.0761-36.903-1.9839-13.267-5.686-26.107-9.9961-38.698-4.4982-12.338-10.798-23.832-18.651-34.065-7.8766-11.587-17.166-21.898-26.237-32.389-8.1859-9.4073-18.583-16.588-29.345-22.144-10.134-5.4493-21.266-8.0683-32.436-9.6828-10.676-1.6595-21.524-3.7406-32.335-2.7853zm14.495 12.733c12.355 0.75618 25.055 2.0891 36.563 7.2832 10.711 5.1928 21.336 11.212 30.103 19.729 11.546 10.367 21.569 22.514 30.294 35.642 7.2946 9.7206 11.916 21.419 16.397 32.842 3.4801 13.202 8.2276 26.262 8.6428 40.126 0.96038 13.716-1.0637 27.508-5.0818 40.518-3.8163 11.703-9.9119 22.65-17.026 32.438-4.5531 6.4713-10.47 11.626-16.64 16.234 0.53776-11.924-1.4767-23.86-0.19121-35.743 1.4137-12.91 8.5027-24.196 10.226-37.072 2.5915-11.887 0.97285-24.522-1.9536-36.219-3.0588-7.6503-2.3838-17.682 4.927-22.272-1.5016-10.533-12.757-13.423-17.956-21.468-9.7474-9.4375-19.41-18.97-28.536-29.102-2.613-2.2312-5.7031-7.1737-8.1426-7.9215 1.1082 4.9658-7.8282 4.5828-8.1766 0-9.3879-6.3106-20.662-7.751-31.477-8.5348-13.747-0.80215-27.602 1.4091-40.626 6.1474-11.912 5.0738-21.883 13.699-31.963 21.884-9.523 9.8255-18.184 21.157-22.3 34.815-4.5442 11.389-5.9477 23.709-5.947 35.951-0.40854 13.616 5.4906 25.783 9.8637 38.116 4.3848 11.558-3.2873 22.488-9.1204 31.576-6.4553-11.189-14.232-21.872-17.84-34.617-4.863-13.093-5.9604-27.378-6.69-41.322 0.35631-12.508 2.4043-25.06 6.2625-36.885 3.7888-11.325 9.2395-22.053 16.24-31.475 7.1974-10.834 16.562-19.796 26.557-27.593 10.858-6.765 21.761-14.216 34.193-17.11 11.411-4.0358 23.472-5.6113 35.449-5.9582 1.3146-0.0675 2.6322 0.026 3.9475-0.0116zm-139.37 25.068c-11.629 6.3288-15.467 20.633-20.001 32.652-4.2367 13.069-8.0829 26.425-9.3952 40.241-1.9301 13.813-1.4312 27.785-0.08831 41.627 1.1773 15.057 5.367 29.572 9.7858 43.844 4.5364 12.2 10.507 23.735 16.848 34.939 8.0203 13.584 19.24 24.437 29.982 35.489 9.5107 9.1533 20.926 15.555 32.063 22.101 10.748 6.1594 22.564 9.7124 34.354 12.785 8.1863 0.6099 15.911 7.6349 23.898 2.1187 10.583-5.8774 3.7808-21.829-5.9467-23.874-11.7-3.0214-23.496-6.0387-34.7-10.876-10.553-4.4842-20.433-10.624-29.598-17.773-9.0116-8.3685-17.993-16.85-25.3-27.017-6.9422-9.4005-12.359-19.88-16.591-30.961-6.6081-15.553-9.9703-32.484-11.795-49.389-1.3453-12.679 0.98204-25.382 2.6042-37.918 2.1127-12.732 4.6502-25.737 10.943-36.954 4.4557-8.8643 8.5116-20.563 1.024-28.994-2.0547-2.035-5.3502-2.9321-8.0857-2.0423zm270.2 8.3559c-11.667 7.019-5.6708 23.696-0.57549 33.547 5.8562 12.621 10.141 25.937 14.327 39.268 1.3635 11.381 5.0435 22.636 3.7166 34.219-1.4003 12.037-1.4007 24.307-4.5317 36.1-1.8454 12.376-8.5397 23.074-13.308 34.328-5.607 12.17-13.257 23.37-23.427 31.608-9.0336 8.3704-18.927 15.827-29.993 20.781-10.715 5.5367-22.257 9.2537-34.167 10.069-10.728 2.2391-23.891-3.9688-32.462 5.5819-5.891 11.949 9.5365 22.96 19.636 19.322 12.46-1.1522 25.117-1.3144 37.229-4.9975 11.372-1.7856 21.824-7.7284 31.632-13.898 13.802-9.1501 26.812-20.042 37.031-33.649 7.184-9.0392 13.762-18.771 18.306-29.646 6.7905-14.53 10.016-30.516 13.752-46.156 1.634-13.208 3.1901-26.447 3.345-39.79-1.1334-13.738-3.3012-27.274-6.69-40.586-3.5838-13.44-9.5737-25.925-14.123-38.994-4.6628-7.1528-9.9827-18.974-19.698-17.11zm-133.43 5.1727c10.947-0.28825 22.061 2.6282 31.642 8.2768 8.8718 4.571 20.302 11.229 19.276 23.555-9.096 4.6464-13.393-8.5972-20.813-11.539-9.6702-5.8123-20.951-7.0883-31.848-7.3482-10.546-0.4795-21.15 2.4251-30.74 7.0498-10.432 5.1322-19.283 13.584-26.983 22.581-6.523 7.7474-7.8455 21.567-19.187 23.718-1.4494 0.40259-4.8133 0.96322-2.7822-2.1442 1.0005-11.26 7.9717-20.352 13.907-29.187 7.0885-9.767 16.631-17.187 26.303-23.781 10.567-6.6965 22.934-10.113 35.082-11.444 2.0422-0.38262 4.0956 0.24725 6.1435 0.26429zm1.115 24.67c11.14 2.1194 22.308 5.6317 31.431 12.993 5.7627 4.2634 5.3757 12.484 1.6473 18.043-6.3648 10.683 7.3129 17.641 10.778 26.261 2.9954 7.1154 7.812 13.188 11.522 19.895-3.8604 11.776-13.268 20.044-22.315 27.268-7.7664 6.7119-17.569 10.174-27.489 10.532-11.024-0.24955-22.429-1.439-32.632-6.1674-10.127-3.9161-17.999-12.599-24.349-21.614-2.9241-5.7433-10.174-11.542-6.9449-18.773 11.126 0.51452 19.773 12.852 31.592 11.539 4.8146-9.5575 2.8085-20.812 1.4867-31.036h-21.557c7.5572-13.529 15.114-27.057 22.672-40.586-8.0528 4.9074-16.106 9.8148-24.158 14.722 7.6279-7.8702 16.235-15.033 26.236-18.988 7.215-2.1723 14.492-4.5301 22.08-4.0903zm78.05 48.146c2.3038 1.97 1.9266 7.6159 3.2846 10.883 1.2705 4.8855 1.0494 10.146-0.31119 14.981-8.6824-3.9043-13.557-18.874-4.0883-24.67l0.74329-1.1937h0.37173zm-162.42 4.3769c9.7645 5.0465 14.017 17.197 13.38 28.251 0.63983 3.9032-1.6532 10.17-6.3183 7.9579-7.7456-3.2318-4.0415-14.102-6.9187-20.76-1.0769-5.2192-1.4953-10.511-1.258-15.847l1.115 0.39793zm50.918 67.643c13.169 3.3928 26.267 8.7264 39.972 8.3559 9.3714-0.437 20.01-1.5323 27.671 5.5705 0.26981 6.8463-8.4589 4.6311-12.574 6.1541-11.759 0.90033-23.882 2.3027-35.371-1.3793-11.63-2.9829-24.276-5.4802-33.45-14.324-2.3511-2.1268 3.246-2.1778 4.0883-3.5811 3.1336-1.0182 6.4254-1.5067 9.6633-0.79577zm-28.247 12.335c10.915 3.9904 20.237 12.274 31.722 14.658 12.238 4.7258 25.032 7.3932 38.02 8.0661 12.657 1.6519 25.243-1.1662 37.2-5.2747 12.759-3.3913 24.058 5.4993 33.493 13.497l1.5414 1.2835c-9.3214 9.0127-22.466 11.157-34.193 14.722-11.716 3.1698-24.001 3.0362-35.989 2.2018-12.521-0.86834-24.797-3.934-37.124-6.2773-11.96-2.6478-23.567-7.2702-34.43-13.213-8.2766-5.2789-18.91-9.9206-22.54-20.114 6.9378-3.2911 13.917-10.319 22.3-9.5496z" fill="#ececec" overflow="visible"/>
 <g transform="translate(0 -540.36)" fill-rule="evenodd">
  <path d="m256 541.36c-140.83 0-255 114.17-255 255s114.17 255 255 255 255-114.17 255-255-114.17-255-255-255m8.827 44.931c120.9 0 218.9 98 218.9 218.9s-98 218.9-218.9 218.9-218.93-98-218.93-218.9 98.03-218.9 218.93-218.9" fill-opacity=".067"/>
  <g fill-opacity=".129">
   <path d="m256 544.79c-138.94 0-251.57 112.63-251.57 251.57s112.63 251.54 251.57 251.54 251.57-112.6 251.57-251.54-112.63-251.57-251.57-251.57m5.885 38.556c120.9 0 218.9 98 218.9 218.9s-98 218.9-218.9 218.9-218.93-98-218.93-218.9 98.03-218.9 218.93-218.9"/>
   <path d="m256 548.72c-136.77 0-247.64 110.87-247.64 247.64s110.87 247.64 247.64 247.64 247.64-110.87 247.64-247.64-110.87-247.64-247.64-247.64m2.942 31.691c120.9 0 218.9 98 218.9 218.9s-98 218.9-218.9 218.9-218.93-98-218.93-218.9 98.03-218.9 218.93-218.9"/>
  </g>
  <path d="m253.04 548.22c-135.42 0-245.19 109.78-245.19 245.19 0 135.42 109.78 245.19 245.19 245.19 135.42 0 245.19-109.78 245.19-245.19 0-135.42-109.78-245.19-245.19-245.19zm0 26.297c120.9 0 218.9 98 218.9 218.9s-98 218.9-218.9 218.9-218.93-98-218.93-218.9 98.03-218.9 218.93-218.9z" fill="#ffffff" stroke="#000000" stroke-opacity=".31" stroke-width="4.904"/>
 </g>
</svg>
