<?xml version="1.0" encoding="UTF-8"?>
<svg id="Warstwa_1" data-name="Warstwa 1" xmlns="http://www.w3.org/2000/svg" viewBox="0 0 1024 312">
  <defs>
    <style>
      .cls-1, .cls-2 {
        stroke-width: 0px;
      }

      .cls-2 {
        fill: #0015ff;
      }
    </style>
  </defs>
  <path class="cls-1" d="m343.2,195.34c18.33,0,29.27-14.88,29.27-39.81s-9.72-39.3-28.89-39.3c-12.03,0-20.89,4.49-25.61,12.99l-.06.1-1.24-.31.04-.62c.11-1.71.22-3.33.22-4.95,0-.91.03-1.82.06-2.77.03-1.01.06-2.04.07-3.17h-23.54c.25,10.74.25,22.12.25,36.51,0,20.04,0,44.97-.38,57.7h23.79l-.02-.9c-.12-5.5-.23-10.7-.23-16.08,0-3.97,0-7.1-.13-10.52v-.12s.72-.18.72-.18l.06.08c4.88,7.32,13.97,11.35,25.62,11.35Zm-26.57-22.31l-.07-.04v-20.12c0-12.03,6.49-18.66,18.27-18.66,10.45,0,15.1,6.62,15.1,21.45s-4.74,21.33-16.37,21.33c-6.87,0-12.41-1.29-16.93-3.95Z"/>
  <path class="cls-1" d="m385.17,146.26c0,17.23,0,33.51-.38,47.81h23.41c-.38-14.91-.38-27.6-.38-46.79,0-21.62,0-35.93.38-51.1h-23.41c.38,16.06.38,31.08.38,50.09Z"/>
  <path class="cls-1" d="m478.16,187.06c-.07,2.17-.14,4.37-.22,7.01h23.53c-.37-10.62-.37-22.5-.37-38.92,0-17.42,0-27.06.37-37.65h-23.41c.14,8.48.25,16.96.25,40.95,0,11.94-6.29,18.79-17.26,18.79-9.5,0-13.2-3.99-13.2-14.22,0-20.89.16-35.36.5-45.52h-23.79c.37,8.2.37,16.39.37,25.86,0,3.26-.02,6.18-.05,9.56-.04,4.18-.07,8.92-.07,15.42,0,9.03,2.38,15.9,7.07,20.4,4.48,4.29,11.09,6.47,19.66,6.47,13.33,0,21.55-4.25,25.86-13.36l.05-.1.86.17v.12c-.06,1.77-.11,3.39-.16,5.02Z"/>
  <path class="cls-1" d="m580.06,189.23c5.38-3.92,8.1-9.75,8.1-17.34s-2.06-12.73-6.48-16.44c-4.74-3.97-12.34-6.44-23.95-7.77-16.64-1.81-19.9-4.35-19.9-8.14,0-4.06,3.97-5.72,13.71-5.72,11.91,0,14.34,2.95,14.34,7.37v1.12c2.14-.12,5.91-.25,9.74-.25,4.41,0,8.66.14,11.15.37l.05-.55c.1-1.09.19-2.03.19-2.97,0-7.79-2.67-13.39-8.15-17.13-5.73-3.91-14.55-5.81-26.95-5.81-24.64,0-36.11,7.37-36.11,23.19,0,7.13,2,12.23,6.29,16.05,4.94,4.4,13.08,7.15,24.89,8.41,16.12,1.41,19.27,3.96,19.27,7.88,0,4.49-3.84,6.23-13.71,6.23-11.18,0-15.74-2.25-15.74-7.76v-1.11c-2.54.23-6.17.36-9.99.36-5.22,0-9.43-.33-11.14-.49,0,.54-.04,1.11-.07,1.66-.03.58-.06,1.12-.06,1.61,0,7.83,2.53,13.48,7.74,17.28,5.93,4.32,15.42,6.43,29.01,6.43,12.51,0,21.85-2.19,27.76-6.49Z"/>
  <path class="cls-1" d="m614.37,194.06c3.09-.17,7.28-.25,12.44-.25s10.92.12,13.96.25c1.88-7.69,5.57-24.61,8.59-39.46,1.12-4.27,2.05-8.63,2.86-12.48l.34-1.59h.74l.02.12c.81,4.31,1.85,9.17,2.92,13.69,2.81,15.02,6.24,32.25,7.83,39.71,2.56-.12,8.32-.25,15.1-.25,4.16,0,8.51.08,12.95.25.88-3.45,2.37-9.54,4.25-17.24,4.49-18.33,11.26-45.98,15.06-59.34h-20.6c-1.05,7.68-4.74,27.59-7.59,42.38-.98,4.44-1.79,8.75-2.4,12.81l-.02.12h-1l-.03-.11c-.3-1.3-.6-2.77-.93-4.34-.51-2.49-1.09-5.31-1.87-8.47-3.47-15.6-7.19-35.49-8.1-42.38-3.37.12-8.6.25-12.8.25-3.83,0-10.86-.12-14.33-.25-.87,6.26-3.92,21.27-6.61,34.53-.52,2.54-1.02,5.01-1.49,7.34-.3,1.33-.59,2.62-.87,3.86-.8,3.53-1.48,6.58-2.05,9.21l-.02.11h-1l-.02-.12c-.15-.79-.3-1.63-.46-2.52-.55-3-1.17-6.39-1.94-10.29-3.08-15.95-6.93-36.46-7.72-42.13h-24.52c3.75,11.67,9.47,35.72,14.08,55.07,2.18,9.15,4.06,17.07,5.23,21.51Z"/>
  <path class="cls-1" d="m783.84,124.71c-5.69-5.92-14.49-8.8-26.9-8.8-25.86,0-39.54,13.86-39.54,40.07,0,13.16,3.49,23.25,10.37,30.01,6.63,6.51,16.27,9.8,28.66,9.8,14.89,0,24.27-2.51,29.53-7.89,3.88-3.97,5.61-9.67,5.45-17.94-2.69.25-6.01.37-10.13.37s-7.44-.12-10.38-.37c-.34,6.65-4.31,9.25-14.09,9.25-11.97,0-16.79-4.61-17.77-17v-.16s.14,0,.14,0c2.57,0,5.74-.03,9.1-.05,4.13-.03,8.8-.07,13.47-.07,10.96,0,22.29,0,29.15.25.25-3.49.5-7.89.5-14.06,0-10.44-2.48-18.09-7.57-23.39Zm-13.32,25.44v.13h-.14c-4.98.07-10.11.13-15.22.13s-10.7-.06-15.85-.25v-.14s-.14-.01-.14-.01c1.19-13.02,5.6-17.64,16.88-17.64,10.37,0,14.6,4.12,14.6,14.23.03,1.18-.01,2.38-.13,3.56Z"/>
  <path class="cls-1" d="m833.47,142.73c2.57-3.25,6.53-4.66,13.26-4.73.15,0,.3,0,.45,0,3.49,0,6.95.5,10.31,1.48.15-6.05,1.12-16.45,1.76-21.52-3.34-.9-6.79-1.36-10.24-1.36-.14,0-.27,0-.4,0-11.51,0-18.71,5.7-22.03,17.4l-.03.12-1.13-.17v-.12c0-6.04.12-11.24.37-16.34h-20.11c.25,10.74.25,21.56.25,37.91s0,27.93-.25,38.67h24.55c-.52-8.81-.62-22.98-.62-33.35,0-9.06,1.19-14.61,3.87-17.99Z"/>
  <path class="cls-1" d="m892.04,162.48l.04.04c7.53,7.54,16.93,20.05,23.34,28.81,1.47,2.09,2.95,2.73,6.35,2.73h24.24c-6.03-5.95-12.03-13.68-17.83-21.16-4.86-6.27-9.45-12.18-13.74-16.65l-.09-.1.09-.1c6.32-6.86,15.46-18.89,22.81-28.56,2.85-3.75,5.55-7.3,7.68-10.02h-26.11c-4.99,8.2-10.61,16.12-16.7,23.54-3.02,3.77-6.65,7.79-10.17,11.68l-.15.17h-.46v-5.47c0-3.78,0-7.33,0-10.7-.02-16.13-.03-27.8.38-40.53h-23.53c.37,11.74.33,23.47.28,35.89-.02,4.36-.03,8.87-.03,13.56,0,18.25,0,34.02-.25,48.44h23.41c-.25-10.72-.25-19.87-.25-31.44v-.14h.71Z"/>
  <g>
    <polygon class="cls-2" points="223.04 209.23 223.04 233.64 268.01 233.65 268.01 78.38 223.04 78.38 223.04 102.79 243.72 102.79 243.72 209.23 223.04 209.23"/>
    <polygon class="cls-2" points="122.99 102.77 122.99 78.35 78 78.35 78 233.62 122.99 233.62 122.99 209.21 102.48 209.21 102.48 102.77 122.99 102.77"/>
  </g>
  <polygon class="cls-1" points="211.55 143.53 185.06 143.53 185.06 117.11 160.28 117.11 160.28 143.53 133.79 143.53 133.79 168.2 160.28 168.2 160.28 194.91 185.06 194.91 185.06 168.2 211.55 168.2 211.55 143.53"/>
</svg>