<svg width="100%" height="100%" viewBox="0 0 600 160" fill="none" xmlns="http://www.w3.org/2000/svg">
<path d="M11.2049 84.1022C17.2647 84.1022 22.2954 79.0254 22.2954 72.9102C22.2954 66.6796 17.2647 61.6028 11.2049 61.6028C5.03077 61.6028 0 66.6796 0 72.9102C0 79.0254 5.03077 84.1022 11.2049 84.1022Z" fill="#BAD904"/>
<path d="M47.1884 1.60424H32.2105V82.7177H47.6458V50.0646C47.6458 41.5263 53.3626 37.6034 58.5077 37.6034C63.6528 37.7187 68.2262 40.6033 68.2262 47.9877V82.7177H83.7758V46.4878C83.7758 32.7573 76.001 23.9883 63.1954 23.8729C57.0213 23.8729 50.0468 26.7575 47.0741 32.6419L47.1884 1.60424Z" fill="#333333"/>
<path d="M112.218 83.8715C117.706 83.8715 125.138 81.6792 127.767 73.7179C127.996 80.0639 135.085 84.2176 142.974 83.5253L145.832 83.1792V72.1025C142.288 72.4487 141.259 70.4872 141.259 68.5257V46.9493C141.259 31.6035 131.769 23.7575 117.934 23.7575C100.098 23.7575 93.581 35.1803 94.3813 45.1032H108.216C108.216 39.2187 112.218 36.1034 117.363 36.1034C121.936 36.1034 126.51 38.1803 126.51 45.4493V52.1415C123.537 49.6031 118.849 48.3339 113.818 48.3339C103.414 48.3339 92.6663 53.6414 92.6663 65.8719C92.6663 77.4101 101.699 83.8715 112.218 83.8715ZM115.305 71.9871C112.103 71.8718 106.844 70.8333 106.844 65.6411C106.844 60.7951 111.417 58.6029 116.219 58.6029C120.564 58.6029 124.68 59.9874 126.967 62.5258C126.853 70.0257 119.535 72.1025 115.305 71.9871Z" fill="#333333"/>
<path d="M203.651 25.3729H188.33V58.0259C188.33 66.9103 182.156 70.4872 177.125 70.4872C172.438 70.4872 168.665 67.6026 168.665 60.449V25.3729H153.344V62.1797C153.344 75.9101 161.118 84.1022 173.009 84.1022C179.183 84.1022 186.044 80.9869 189.245 74.4102L190.503 82.7177H203.651V25.3729Z" fill="#333333"/>
<path d="M239.326 84.5638C252.36 84.5638 261.736 77.6409 261.736 66.4488C261.736 55.9491 255.218 50.6415 239.554 47.5262C234.181 46.3724 229.036 45.4493 229.036 41.0648C229.036 36.7957 234.295 35.2957 237.839 35.2957C241.384 35.2957 248.587 37.1418 248.473 44.757H261.85C261.964 33.7958 254.075 23.4114 237.725 23.4114C224.005 23.4114 215.087 30.7958 215.087 41.6417C215.087 52.1415 222.29 56.7567 235.553 59.2951C243.671 61.0259 246.758 62.6412 246.872 66.3334C246.986 70.3718 243.099 72.6794 238.297 72.6794C232.809 72.6794 227.549 69.4487 227.321 63.1027H213.257C212.571 74.4102 222.061 84.5638 239.326 84.5638Z" fill="#333333"/>
<path d="M301.222 0.104272C285.329 -0.934165 276.068 5.75798 276.068 21.3345V25.3729H266.235V38.2956H276.068V82.7177H291.503V38.2956H305.109V25.3729H291.503V20.873C291.503 14.8731 293.79 13.027 299.964 13.1424L305.338 13.2578V0.335032L301.222 0.104272Z" fill="#333333"/>
<path d="M337.453 84.333C355.175 84.333 366.952 70.8333 366.952 53.8722C366.952 36.6803 354.947 23.5268 337.339 23.5268C320.189 23.5268 307.84 36.6803 307.84 53.8722C307.84 70.8333 319.731 84.333 337.453 84.333ZM337.453 70.3718C327.735 70.3718 323.39 62.0643 323.39 54.2183C323.39 46.1416 327.506 37.3726 337.453 37.3726C347.286 37.3726 351.517 46.1416 351.517 54.2183C351.517 61.9489 347.401 70.3718 337.453 70.3718Z" fill="#333333"/>
<path d="M408.789 24.3344C399.185 23.4114 393.354 27.4498 391.524 35.7573L390.381 25.3729H377.004V82.7177H392.439V52.9491C392.439 40.6033 400.557 39.3341 408.789 40.1418V24.3344Z" fill="#333333"/>
<path d="M477.803 23.9883C473.23 23.9883 465.455 26.0652 462.253 32.5266C459.624 26.9882 454.135 23.9883 447.275 23.9883C441.33 23.9883 434.47 27.1036 431.497 33.6804L430.468 25.3729H416.976V82.7177H432.297V49.8338C432.297 41.9879 437.1 38.411 442.359 38.411C447.39 38.411 449.905 41.5263 449.905 48.5646V82.7177H465.34V49.8338C465.34 41.9879 469.685 38.411 474.945 38.411C479.861 38.411 482.834 41.7571 482.834 48.5646V82.7177H498.269V46.257C498.155 31.8343 490.266 23.9883 477.803 23.9883Z" fill="#333333"/>
<path d="M526.684 83.8715C532.172 83.8715 539.604 81.6792 542.234 73.7179C542.462 80.0639 549.551 84.2176 557.44 83.5253L560.299 83.1792V72.1025C556.754 72.4487 555.725 70.4872 555.725 68.5257V46.9493C555.725 31.6035 546.235 23.7575 532.401 23.7575C514.565 23.7575 508.047 35.1803 508.848 45.1032H522.682C522.682 39.2187 526.684 36.1034 531.829 36.1034C536.403 36.1034 540.976 38.1803 540.976 45.4493V52.1415C538.003 49.6031 533.316 48.3339 528.285 48.3339C517.88 48.3339 507.133 53.6414 507.133 65.8719C507.133 77.4101 516.165 83.8715 526.684 83.8715ZM529.771 71.9871C526.57 71.8718 521.31 70.8333 521.31 65.6411C521.31 60.7951 525.884 58.6029 530.686 58.6029C535.031 58.6029 539.147 59.9874 541.433 62.5258C541.319 70.0257 534.002 72.1025 529.771 71.9871Z" fill="#333333"/>
<path d="M595.198 70.0257C587.766 70.0257 584.908 67.8334 584.908 61.0259V38.2956H599.314V25.3729H583.193C585.822 23.0653 587.88 19.7192 587.766 11.4117H573.474C573.588 12.2194 573.474 24.6806 561.469 29.4113V38.2956H569.701V62.6412C569.701 77.4101 578.734 83.1792 592.682 83.1792C595.198 83.1792 597.828 82.9484 600 82.6023V69.6795C598.399 69.9103 596.913 70.0257 595.198 70.0257Z" fill="#333333"/>
<path d="M54.8318 148.967H59.5967L47.9277 116.634H41.3639L29.6949 148.967H34.4598L36.988 141.723H52.2549L54.8318 148.967ZM38.4467 137.59L44.6215 120.038L50.7963 137.59H38.4467Z" fill="#333333"/>
<path d="M72.238 124.511C64.2643 124.511 61.5415 130.783 61.5415 136.618C61.5415 142.89 64.7018 148.238 72.4325 148.238C75.9332 148.238 78.6074 146.342 79.3367 143.911V147.314C79.3853 152.662 77.0029 155.677 72.6756 155.677C68.7374 155.677 65.966 153.732 65.8201 149.842H61.736C61.4443 154.948 65.188 159.518 72.627 159.518C79.4825 159.518 83.7125 154.899 83.7125 147.168L83.7612 125.094H79.8715L79.4825 129.081C78.8018 126.65 75.836 124.511 72.238 124.511ZM72.7729 128.595C77.1487 128.595 79.4825 131.756 79.4825 135.84V137.444C79.4825 141.917 76.5653 144.3 72.8215 144.3C67.9108 144.3 66.0632 140.604 66.0632 136.861C66.0632 133.068 67.2301 128.595 72.7729 128.595Z" fill="#333333"/>
<path d="M100.169 124.511C93.4112 124.511 88.9381 129.616 88.9381 136.909C88.9381 143.813 92.9736 149.502 100.558 149.551C106.296 149.551 109.894 146.099 110.769 141.431H106.49C105.712 144.397 103.427 145.71 100.558 145.71C95.6478 145.71 93.1681 141.626 93.3626 137.833H111.061V136.326C111.061 127.72 105.177 124.511 100.169 124.511ZM100.218 128.158C104.351 128.158 106.539 131.512 106.539 134.624H93.5571C93.8002 131.658 96.0367 128.158 100.218 128.158Z" fill="#333333"/>
<path d="M116.551 148.967H120.975V135.159C120.975 131.123 124.184 128.595 127.345 128.595C129.97 128.595 132.207 130.151 132.207 134.332V148.967H136.631V133.798C136.631 127.72 133.422 124.511 128.22 124.511C124.719 124.511 121.607 126.748 120.781 129.616L120.441 125.094H116.551V148.967Z" fill="#333333"/>
<path d="M152.402 145.223C149.145 145.223 147.88 144.251 147.88 141.334V128.936H153.958V125.094H147.103C148.221 124.073 149.047 122.663 148.999 119.503H144.866C144.866 119.795 144.769 124.851 139.809 126.407V128.936H143.553V141.82C143.553 146.779 146.519 149.064 151.624 149.064C152.499 149.064 153.326 149.064 154.298 148.919V145.126C153.618 145.175 153.083 145.223 152.402 145.223Z" fill="#333333"/>
<path d="M177.35 125.094H172.974V139.049C172.974 142.938 169.959 145.515 166.945 145.515C164.514 145.515 162.18 144.057 162.18 139.924V125.094H157.853V140.556C157.853 146.633 161.353 149.551 165.972 149.551C169.376 149.551 172.05 147.509 173.12 145.029L173.508 148.967H177.35V125.094Z" fill="#333333"/>
<path d="M195.351 124.657C191.024 124.317 188.982 126.164 188.155 129.324L187.961 125.094H183.974V148.967H188.399V135.159C188.399 130.491 191.219 128.741 195.351 129.179V124.657Z" fill="#333333"/>
<path d="M220.927 114.69C214.946 114.398 212.321 117.364 212.321 122.226V125.094H207.702V128.936H212.321V148.967H216.697V128.936H222.774V125.094H216.697V122.226C216.697 119.454 217.961 118.628 220.44 118.628H222.871V114.787L220.927 114.69Z" fill="#333333"/>
<path d="M234.087 115.468H229.177V120.378H234.087V115.468ZM243.471 115.468H238.512V120.378H243.471V115.468ZM246.34 125.094H241.964V139.049C241.964 142.938 238.949 145.515 235.935 145.515C233.504 145.515 231.17 144.057 231.17 139.924V125.094H226.843V140.556C226.843 146.633 230.343 149.551 234.962 149.551C238.366 149.551 241.04 147.509 242.11 145.029L242.499 148.967H246.34V125.094Z" fill="#333333"/>
<path d="M264.341 124.657C260.014 124.317 257.972 126.164 257.146 129.324L256.951 125.094H252.964V148.967H257.389V135.159C257.389 130.491 260.209 128.741 264.341 129.179V124.657Z" fill="#333333"/>
<path d="M296.383 115.176V128.936C295.654 126.504 292.785 124.511 289.285 124.511C281.554 124.511 278.15 130.929 278.15 137.007C278.15 142.89 281.408 149.551 289.236 149.551C292.542 149.551 295.703 147.509 296.578 144.786L296.869 148.967H300.808V115.176H296.383ZM289.625 128.547C293.417 128.547 296.48 131.221 296.48 135.645V137.93C296.48 142.063 294.001 145.467 289.625 145.467C284.082 145.467 282.672 140.653 282.672 136.909C282.672 133.166 284.763 128.547 289.625 128.547Z" fill="#333333"/>
<path d="M312.239 115.662H306.987V120.767H312.239V115.662ZM311.85 125.094H307.425V148.967H311.85V125.094Z" fill="#333333"/>
<path d="M328.019 124.511C320.045 124.511 317.322 130.783 317.322 136.618C317.322 142.89 320.483 148.238 328.213 148.238C331.714 148.238 334.388 146.342 335.118 143.911V147.314C335.166 152.662 332.784 155.677 328.457 155.677C324.518 155.677 321.747 153.732 321.601 149.842H317.517C317.225 154.948 320.969 159.518 328.408 159.518C335.263 159.518 339.493 154.899 339.493 147.168L339.542 125.094H335.652L335.263 129.081C334.583 126.65 331.617 124.511 328.019 124.511ZM328.554 128.595C332.93 128.595 335.263 131.756 335.263 135.84V137.444C335.263 141.917 332.346 144.3 328.602 144.3C323.692 144.3 321.844 140.604 321.844 136.861C321.844 133.068 323.011 128.595 328.554 128.595Z" fill="#333333"/>
<path d="M350.651 115.662H345.4V120.767H350.651V115.662ZM350.262 125.094H345.837V148.967H350.262V125.094Z" fill="#333333"/>
<path d="M367.112 145.223C363.854 145.223 362.59 144.251 362.59 141.334V128.936H368.668V125.094H361.812C362.931 124.073 363.757 122.663 363.708 119.503H359.576C359.576 119.795 359.478 124.851 354.519 126.407V128.936H358.263V141.82C358.263 146.779 361.229 149.064 366.334 149.064C367.209 149.064 368.036 149.064 369.008 148.919V145.126C368.327 145.175 367.793 145.223 367.112 145.223Z" fill="#333333"/>
<path d="M379.855 149.453C382.967 149.453 385.933 147.8 386.905 144.932C386.76 147.46 389.045 149.356 392.108 149.21L393.032 149.113V145.758C391.379 145.807 390.99 144.737 390.99 143.959V133.846C390.99 127.185 386.857 124.56 381.8 124.56C374.945 124.56 372.271 128.838 372.465 132.922H376.598C376.598 130.443 378.202 128.158 381.606 128.206C384.912 128.206 386.711 129.957 386.711 133.457V136.763C385.155 135.499 382.773 134.819 380.585 134.819C376.112 134.819 371.687 137.298 371.687 142.16C371.687 146.828 375.382 149.453 379.855 149.453ZM380.293 145.758C378.105 145.71 375.82 144.786 375.82 142.112C375.82 139.681 378.251 138.222 380.876 138.222C383.113 138.222 385.301 138.903 386.711 140.264C386.711 144.251 383.016 145.758 380.293 145.758Z" fill="#333333"/>
<path d="M402.206 115.176H397.782V148.967H402.206V115.176Z" fill="#333333"/>
<path d="M418.91 124.511C412.152 124.511 407.679 129.616 407.679 136.909C407.679 143.813 411.715 149.502 419.299 149.551C425.037 149.551 428.635 146.099 429.51 141.431H425.231C424.453 144.397 422.168 145.71 419.299 145.71C414.389 145.71 411.909 141.626 412.104 137.833H429.801V136.326C429.801 127.72 423.918 124.511 418.91 124.511ZM418.959 128.158C423.092 128.158 425.28 131.512 425.28 134.624H412.298C412.541 131.658 414.778 128.158 418.959 128.158Z" fill="#333333"/>
<path d="M445.601 148.967H450.171V121.302L459.117 141.82H464.903L473.85 121.302V148.967H478.42V116.634H470.981L462.083 137.493L453.088 116.634H445.601V148.967Z" fill="#333333"/>
<path d="M495.403 124.511C488.644 124.511 484.171 129.616 484.171 136.909C484.171 143.813 488.207 149.502 495.791 149.551C501.529 149.551 505.127 146.099 506.002 141.431H501.723C500.945 144.397 498.66 145.71 495.791 145.71C490.881 145.71 488.401 141.626 488.596 137.833H506.294V136.326C506.294 127.72 500.41 124.511 495.403 124.511ZM495.451 128.158C499.584 128.158 501.772 131.512 501.772 134.624H488.79C489.033 131.658 491.27 128.158 495.451 128.158Z" fill="#333333"/>
<path d="M528.898 115.176V128.936C528.169 126.504 525.3 124.511 521.8 124.511C514.069 124.511 510.666 130.929 510.666 137.007C510.666 142.89 513.923 149.551 521.751 149.551C525.057 149.551 528.218 147.509 529.093 144.786L529.385 148.967H533.323V115.176H528.898ZM522.14 128.547C525.933 128.547 528.996 131.221 528.996 135.645V137.93C528.996 142.063 526.516 145.467 522.14 145.467C516.597 145.467 515.187 140.653 515.187 136.909C515.187 133.166 517.278 128.547 522.14 128.547Z" fill="#333333"/>
<path d="M544.754 115.662H539.503V120.767H544.754V115.662ZM544.365 125.094H539.94V148.967H544.365V125.094Z" fill="#333333"/>
<path d="M561.069 124.511C554.311 124.511 549.838 129.616 549.838 136.909C549.838 143.813 553.873 149.502 561.458 149.551C567.195 149.551 570.793 146.099 571.668 141.431H567.39C566.612 144.397 564.327 145.71 561.458 145.71C556.547 145.71 554.068 141.626 554.262 137.833H571.96V136.326C571.96 127.72 566.077 124.511 561.069 124.511ZM561.118 128.158C565.25 128.158 567.438 131.512 567.438 134.624H554.457C554.7 131.658 556.936 128.158 561.118 128.158Z" fill="#333333"/>
<path d="M577.45 148.967H581.875V135.159C581.875 131.123 585.084 128.595 588.244 128.595C590.87 128.595 593.106 130.151 593.106 134.332V148.967H597.531V133.798C597.531 127.72 594.322 124.511 589.119 124.511C585.619 124.511 582.507 126.748 581.68 129.616L581.34 125.094H577.45V148.967Z" fill="#333333"/>
</svg>
