{
  "environment": "web",
  "source": "tutorial.md",
  "format": "html",
  "prefix": "../../",
  "mainga": "UA-49880327-14",
  "updated": "2020-05-22T22:02:38+08:00",
  "id": "29101",
  "duration": 71,
  "title": "Create a prototype thermal camera solution using Python on a Raspberry Pi",
  "author": "Kenneth Phang Tak Yan",
  "summary": "Create a prototype thermal camera solution using Python on a Raspberry Pi",
  "theme": "",
  "status": [
    "draft"
  ],
  "category": [
    "python"
  ],
  "tags": [
    "iot"
  ],
  "feedback": "github.com/kenken64",
  "ga": "0",
  "url": "29101"
}
