{
  "branchId": "de",
  "branchName": "tbde",
  "channelId": "app",
  "countryCode": "DE",
  "locale": "de_DE_tbde1",
  "documentFolderName": "app",
  "displayNamePart": "App",
  "inheritsConfigurationFrom": "../root, ../common-corp",
  "fundPage": true,
  "updaterVersion": "1.36.0.1",
  "sitemapTranslation": {
    "articles": "artikel",
    "downloads": "dwonloads",
    "faq": "faq",
    "funds": "investieren",
    "howTo": "how-to",
    "pressRelease": "pressemitteilungen",
    "projects": "projekte",
    "vacancies": "stellenangebot"
  }
}
