Library\Bee\artifacts\movedfrom\Unity.2D.Animation.Runtime.ref.dll_7442030340276972016.movedfrom
Library\Bee\artifacts\movedfrom\Unity.2D.Animation.Triangle.Runtime.ref.dll_2466708177045823920.movedfrom
Library\Bee\artifacts\movedfrom\Unity.2D.Common.Editor.ref.dll_13644118841584069410.movedfrom
Library\Bee\artifacts\movedfrom\Unity.2D.Common.Runtime.ref.dll_8609069629425828841.movedfrom
Library\Bee\artifacts\movedfrom\Unity.2D.Sprite.Editor.ref.dll_15977261275114544680.movedfrom
Library\Bee\artifacts\movedfrom\Unity.InternalAPIEditorBridge.001.ref.dll_14012374195079120638.movedfrom
Library\Bee\artifacts\movedfrom\Unity.InternalAPIEngineBridge.001.ref.dll_13038110867686256195.movedfrom
Library\Bee\artifacts\movedfrom\UnityEditor.TestRunner.ref.dll_1819107689489022899.movedfrom
Library\Bee\artifacts\movedfrom\UnityEditor.UI.ref.dll_5519394401220875509.movedfrom
Library\Bee\artifacts\movedfrom\UnityEngine.TestRunner.ref.dll_16527383234446630302.movedfrom
Library\Bee\artifacts\movedfrom\UnityEngine.UI.ref.dll_648142665722821984.movedfrom
Library\Bee\artifacts\movedfrom\UnityEditor.Graphs.dll_17058732107727453340.movedfrom
Library\Bee\artifacts\movedfrom\UnityEditor.CoreModule.dll_5865815263131442282.movedfrom
Library\Bee\artifacts\movedfrom\UnityEditor.DeviceSimulatorModule.dll_12217670543514895223.movedfrom
Library\Bee\artifacts\movedfrom\UnityEditor.dll_14889009576097390859.movedfrom
Library\Bee\artifacts\movedfrom\UnityEditor.GraphViewModule.dll_2435412085459866940.movedfrom
Library\Bee\artifacts\movedfrom\UnityEditor.PackageManagerUIModule.dll_10254094506671278406.movedfrom
Library\Bee\artifacts\movedfrom\UnityEditor.QuickSearchModule.dll_198703427324771422.movedfrom
Library\Bee\artifacts\movedfrom\UnityEditor.SceneTemplateModule.dll_9211097908475859615.movedfrom
Library\Bee\artifacts\movedfrom\UnityEditor.UIBuilderModule.dll_8526720919173844592.movedfrom
Library\Bee\artifacts\movedfrom\UnityEditor.UIElementsModule.dll_17710995775630415718.movedfrom
Library\Bee\artifacts\movedfrom\UnityEditor.UIElementsSamplesModule.dll_2584090279077724775.movedfrom
Library\Bee\artifacts\movedfrom\UnityEditor.UIServiceModule.dll_12630082246178971274.movedfrom
Library\Bee\artifacts\movedfrom\UnityEditor.UnityConnectModule.dll_3796420730908606496.movedfrom
Library\Bee\artifacts\movedfrom\UnityEngine.AccessibilityModule.dll_12860539277821491772.movedfrom
Library\Bee\artifacts\movedfrom\UnityEngine.AIModule.dll_14676138455372857726.movedfrom
Library\Bee\artifacts\movedfrom\UnityEngine.AndroidJNIModule.dll_8364030743185491516.movedfrom
Library\Bee\artifacts\movedfrom\UnityEngine.AnimationModule.dll_17316849144079591906.movedfrom
Library\Bee\artifacts\movedfrom\UnityEngine.ARModule.dll_9592354044262768711.movedfrom
Library\Bee\artifacts\movedfrom\UnityEngine.AssetBundleModule.dll_5092201909758931280.movedfrom
Library\Bee\artifacts\movedfrom\UnityEngine.AudioModule.dll_15335194297481118292.movedfrom
Library\Bee\artifacts\movedfrom\UnityEngine.ClothModule.dll_4303729242707992888.movedfrom
Library\Bee\artifacts\movedfrom\UnityEngine.ClusterInputModule.dll_12991774006125548262.movedfrom
Library\Bee\artifacts\movedfrom\UnityEngine.ClusterRendererModule.dll_12626586002160390395.movedfrom
Library\Bee\artifacts\movedfrom\UnityEngine.CoreModule.dll_8397070605673367445.movedfrom
Library\Bee\artifacts\movedfrom\UnityEngine.CrashReportingModule.dll_13778617834240191053.movedfrom
Library\Bee\artifacts\movedfrom\UnityEngine.DirectorModule.dll_1510594211058291442.movedfrom
Library\Bee\artifacts\movedfrom\UnityEngine.dll_91384995576294896.movedfrom
Library\Bee\artifacts\movedfrom\UnityEngine.DSPGraphModule.dll_1893788759879902227.movedfrom
Library\Bee\artifacts\movedfrom\UnityEngine.GameCenterModule.dll_11412204744840935213.movedfrom
Library\Bee\artifacts\movedfrom\UnityEngine.GIModule.dll_7199117496826325400.movedfrom
Library\Bee\artifacts\movedfrom\UnityEngine.GridModule.dll_5906892196138556812.movedfrom
Library\Bee\artifacts\movedfrom\UnityEngine.HotReloadModule.dll_8186009831947584868.movedfrom
Library\Bee\artifacts\movedfrom\UnityEngine.ImageConversionModule.dll_1958118894435911919.movedfrom
Library\Bee\artifacts\movedfrom\UnityEngine.IMGUIModule.dll_950590876443661877.movedfrom
Library\Bee\artifacts\movedfrom\UnityEngine.InputLegacyModule.dll_15560004636863686465.movedfrom
Library\Bee\artifacts\movedfrom\UnityEngine.InputModule.dll_4271476948626925304.movedfrom
Library\Bee\artifacts\movedfrom\UnityEngine.JSONSerializeModule.dll_1337949046995524294.movedfrom
Library\Bee\artifacts\movedfrom\UnityEngine.LocalizationModule.dll_17480959390784701919.movedfrom
Library\Bee\artifacts\movedfrom\UnityEngine.ParticleSystemModule.dll_1317801207872435675.movedfrom
Library\Bee\artifacts\movedfrom\UnityEngine.PerformanceReportingModule.dll_8451050419273298260.movedfrom
Library\Bee\artifacts\movedfrom\UnityEngine.Physics2DModule.dll_4393189405181944183.movedfrom
Library\Bee\artifacts\movedfrom\UnityEngine.PhysicsModule.dll_5446934127078358949.movedfrom
Library\Bee\artifacts\movedfrom\UnityEngine.ProfilerModule.dll_5133240067988232703.movedfrom
Library\Bee\artifacts\movedfrom\UnityEngine.RuntimeInitializeOnLoadManagerInitializerModule.dll_12296472196212064320.movedfrom
Library\Bee\artifacts\movedfrom\UnityEngine.ScreenCaptureModule.dll_3204600404648773416.movedfrom
Library\Bee\artifacts\movedfrom\UnityEngine.SharedInternalsModule.dll_11474575468594938943.movedfrom
Library\Bee\artifacts\movedfrom\UnityEngine.SpriteMaskModule.dll_9767390944305679527.movedfrom
Library\Bee\artifacts\movedfrom\UnityEngine.SpriteShapeModule.dll_6920994701065677146.movedfrom
Library\Bee\artifacts\movedfrom\UnityEngine.StreamingModule.dll_11882391222937706784.movedfrom
Library\Bee\artifacts\movedfrom\UnityEngine.SubstanceModule.dll_9336472363618721582.movedfrom
Library\Bee\artifacts\movedfrom\UnityEngine.SubsystemsModule.dll_17454303653555664058.movedfrom
Library\Bee\artifacts\movedfrom\UnityEngine.TerrainModule.dll_7340270536396867731.movedfrom
Library\Bee\artifacts\movedfrom\UnityEngine.TerrainPhysicsModule.dll_1352326779646521448.movedfrom
Library\Bee\artifacts\movedfrom\UnityEngine.TextCoreModule.dll_12515935854636729090.movedfrom
Library\Bee\artifacts\movedfrom\UnityEngine.TextRenderingModule.dll_6176820074085697309.movedfrom
Library\Bee\artifacts\movedfrom\UnityEngine.TilemapModule.dll_349671818957711772.movedfrom
Library\Bee\artifacts\movedfrom\UnityEngine.TLSModule.dll_4614923979821653817.movedfrom
Library\Bee\artifacts\movedfrom\UnityEngine.UIElementsModule.dll_17760092577621160113.movedfrom
Library\Bee\artifacts\movedfrom\UnityEngine.UIElementsNativeModule.dll_15620613491606780264.movedfrom
Library\Bee\artifacts\movedfrom\UnityEngine.UIModule.dll_14348394025163818794.movedfrom
Library\Bee\artifacts\movedfrom\UnityEngine.UmbraModule.dll_5739338612908748231.movedfrom
Library\Bee\artifacts\movedfrom\UnityEngine.UNETModule.dll_517539174981041422.movedfrom
Library\Bee\artifacts\movedfrom\UnityEngine.UnityAnalyticsModule.dll_3596465155824191447.movedfrom
Library\Bee\artifacts\movedfrom\UnityEngine.UnityConnectModule.dll_2454211766843113675.movedfrom
Library\Bee\artifacts\movedfrom\UnityEngine.UnityCurlModule.dll_2553100899358088143.movedfrom
Library\Bee\artifacts\movedfrom\UnityEngine.UnityTestProtocolModule.dll_16113666562148472765.movedfrom
Library\Bee\artifacts\movedfrom\UnityEngine.UnityWebRequestAssetBundleModule.dll_11093517069970846696.movedfrom
Library\Bee\artifacts\movedfrom\UnityEngine.UnityWebRequestAudioModule.dll_17096928019120798700.movedfrom
Library\Bee\artifacts\movedfrom\UnityEngine.UnityWebRequestModule.dll_3227860941287318382.movedfrom
Library\Bee\artifacts\movedfrom\UnityEngine.UnityWebRequestTextureModule.dll_2520929054939596609.movedfrom
Library\Bee\artifacts\movedfrom\UnityEngine.UnityWebRequestWWWModule.dll_10170247242984612605.movedfrom
Library\Bee\artifacts\movedfrom\UnityEngine.VehiclesModule.dll_10140328372959306381.movedfrom
Library\Bee\artifacts\movedfrom\UnityEngine.VFXModule.dll_13900951063317514406.movedfrom
Library\Bee\artifacts\movedfrom\UnityEngine.VideoModule.dll_18004004145740602873.movedfrom
Library\Bee\artifacts\movedfrom\UnityEngine.VirtualTexturingModule.dll_18254291761886394867.movedfrom
Library\Bee\artifacts\movedfrom\UnityEngine.VRModule.dll_1869524763059457186.movedfrom
Library\Bee\artifacts\movedfrom\UnityEngine.WindModule.dll_16922062717613737470.movedfrom
Library\Bee\artifacts\movedfrom\UnityEngine.XRModule.dll_5526099134780463616.movedfrom
Library\Bee\artifacts\movedfrom\UnityEditor.UWP.Extensions.dll_13191870966843480513.movedfrom
Library\Bee\artifacts\movedfrom\UnityEditor.WindowsStandalone.Extensions.dll_7349290186239620566.movedfrom