{
"instructions_readme": "1) Open Chrome, 2) go to chrome://tracing, 3) click Load, 4) navigate to this file.",
"traceEvents":[
{ "cat":"", "pid":1, "tid":0, "ts":0, "ph":"M", "name":"process_name", "args": { "name":"tundra" } }
,{ "pid":1, "tid":0, "ts":570985638071, "dur":465, "ph":"X", "name": "DriverCheckDagSignatures",  "args": { "durationMS":0, "detail":"" }}
,{ "pid":1, "tid":0, "ts":570985638536, "dur":300, "ph":"X", "name": "DriverInitData",  "args": { "durationMS":0, "detail":"" }}
,{ "pid":1, "tid":0, "ts":570985638919, "dur":14, "ph":"X", "name": "Tundra",  "args": { "durationMS":0, "detail":"RemoveStaleOutputs" }}
,{ "pid":1, "tid":0, "ts":570985638949, "dur":1, "ph":"X", "name": "Tundra",  "args": { "durationMS":0, "detail":"PrepareNodes" }}
,{ "pid":1, "tid":0, "ts":570985638950, "dur":562, "ph":"X", "name": "Tundra",  "args": { "durationMS":1, "detail":"BuildQueueInit" }}
,{ "pid":1, "tid":0, "ts":570985654084, "dur":10824, "ph":"X", "name": "JoinBuildThread",  "args": { "durationMS":11, "detail":"" }}
,{ "pid":1, "tid":0, "ts":570985664919, "dur":3, "ph":"X", "name": "JoinBuildThread",  "args": { "durationMS":0, "detail":"" }}
,{ "pid":1, "tid":0, "ts":570985664930, "dur":2, "ph":"X", "name": "JoinBuildThread",  "args": { "durationMS":0, "detail":"" }}
,{ "pid":1, "tid":0, "ts":570985664939, "dur":2, "ph":"X", "name": "JoinBuildThread",  "args": { "durationMS":0, "detail":"" }}
,{ "pid":1, "tid":0, "ts":570985664948, "dur":2, "ph":"X", "name": "JoinBuildThread",  "args": { "durationMS":0, "detail":"" }}
,{ "pid":1, "tid":0, "ts":570985664957, "dur":2, "ph":"X", "name": "JoinBuildThread",  "args": { "durationMS":0, "detail":"" }}
,{ "pid":1, "tid":0, "ts":570985664966, "dur":2, "ph":"X", "name": "JoinBuildThread",  "args": { "durationMS":0, "detail":"" }}
,{ "pid":1, "tid":0, "ts":570985664974, "dur":2, "ph":"X", "name": "JoinBuildThread",  "args": { "durationMS":0, "detail":"" }}
,{ "pid":1, "tid":0, "ts":570985664982, "dur":0, "ph":"X", "name": "SharedResourceDestroy",  "args": { "durationMS":0, "detail":"" }}
,{ "pid":1, "tid":0, "ts":570985664999, "dur":987, "ph":"X", "name": "Tundra",  "args": { "durationMS":1, "detail":"Write AllBuiltNodes" }}
,{ "pid":1, "tid":1, "ts":570985639808, "dur":10, "ph":"X", "name": "CheckInputSignature",  "args": { "durationMS":0, "detail":"WriteResponseFile artifacts/rsp/17640597924486847754.rsp" }}
,{ "pid":1, "tid":1, "ts":570985639944, "dur":14020, "ph":"X", "name": "CheckInputSignature",  "args": { "durationMS":14, "detail":"Il2Cpp E:/UNITY/PiratesTopDown/Library/Il2cppBuildCache/WebGL/Native/build.bc" }}
,{ "pid":1, "tid":1, "ts":570985654054, "dur":1, "ph":"X", "name": "CheckInputSignature",  "args": { "durationMS":0, "detail":"all_tundra_nodes" }}
,{ "pid":1, "tid":1, "ts":570985654060, "dur":27, "ph":"X", "name": "WaitingForWork", "cname":"thread_state_sleeping",  "args": { "durationMS":0, "detail":"" }}
,{ "pid":1, "tid":1, "ts":570985654087, "dur":10552, "ph":"X", "name": "Exiting",  "args": { "durationMS":11, "detail":"BuildLoop" }}
,{ "pid":1, "tid":2, "ts":570985639886, "dur":14200, "ph":"X", "name": "WaitingForWork", "cname":"thread_state_sleeping",  "args": { "durationMS":14, "detail":"" }}
,{ "pid":1, "tid":2, "ts":570985654087, "dur":10549, "ph":"X", "name": "Exiting",  "args": { "durationMS":11, "detail":"BuildLoop" }}
,{ "pid":1, "tid":3, "ts":570985639871, "dur":14220, "ph":"X", "name": "WaitingForWork", "cname":"thread_state_sleeping",  "args": { "durationMS":14, "detail":"" }}
,{ "pid":1, "tid":3, "ts":570985654091, "dur":10540, "ph":"X", "name": "Exiting",  "args": { "durationMS":11, "detail":"BuildLoop" }}
,{ "pid":1, "tid":4, "ts":570985639928, "dur":14156, "ph":"X", "name": "WaitingForWork", "cname":"thread_state_sleeping",  "args": { "durationMS":14, "detail":"" }}
,{ "pid":1, "tid":4, "ts":570985654085, "dur":10577, "ph":"X", "name": "Exiting",  "args": { "durationMS":11, "detail":"BuildLoop" }}
,{ "pid":1, "tid":5, "ts":570985639986, "dur":14099, "ph":"X", "name": "WaitingForWork", "cname":"thread_state_sleeping",  "args": { "durationMS":14, "detail":"" }}
,{ "pid":1, "tid":5, "ts":570985654085, "dur":10547, "ph":"X", "name": "Exiting",  "args": { "durationMS":11, "detail":"BuildLoop" }}
,{ "pid":1, "tid":6, "ts":570985640032, "dur":14051, "ph":"X", "name": "WaitingForWork", "cname":"thread_state_sleeping",  "args": { "durationMS":14, "detail":"" }}
,{ "pid":1, "tid":6, "ts":570985654083, "dur":10560, "ph":"X", "name": "Exiting",  "args": { "durationMS":11, "detail":"BuildLoop" }}
,{ "pid":1, "tid":7, "ts":570985640073, "dur":14014, "ph":"X", "name": "WaitingForWork", "cname":"thread_state_sleeping",  "args": { "durationMS":14, "detail":"" }}
,{ "pid":1, "tid":7, "ts":570985654088, "dur":10543, "ph":"X", "name": "Exiting",  "args": { "durationMS":11, "detail":"BuildLoop" }}
,{ "pid":1, "tid":8, "ts":570985640116, "dur":13972, "ph":"X", "name": "WaitingForWork", "cname":"thread_state_sleeping",  "args": { "durationMS":14, "detail":"" }}
,{ "pid":1, "tid":8, "ts":570985654088, "dur":10546, "ph":"X", "name": "Exiting",  "args": { "durationMS":11, "detail":"BuildLoop" }}

]
}
