Library\Bee\artifacts\movedfrom\Unity.2D.Common.Runtime.ref.dll_6620787797290283002.movedfrom
Library\Bee\artifacts\movedfrom\Unity.Mathematics.ref.dll_14352618461119547135.movedfrom
Library\Bee\artifacts\movedfrom\UnityEngine.UI.ref.dll_7786851116020915807.movedfrom
Library\Bee\artifacts\movedfrom\UnityEngine.AccessibilityModule.dll_12410221030151458398.movedfrom
Library\Bee\artifacts\movedfrom\UnityEngine.AIModule.dll_3954799648563246012.movedfrom
Library\Bee\artifacts\movedfrom\UnityEngine.AndroidJNIModule.dll_10360058222287542138.movedfrom
Library\Bee\artifacts\movedfrom\UnityEngine.AnimationModule.dll_10656121800679204228.movedfrom
Library\Bee\artifacts\movedfrom\UnityEngine.AssetBundleModule.dll_9597304758894286130.movedfrom
Library\Bee\artifacts\movedfrom\UnityEngine.AudioModule.dll_6129845586085938550.movedfrom
Library\Bee\artifacts\movedfrom\UnityEngine.ClothModule.dll_13545124605022364762.movedfrom
Library\Bee\artifacts\movedfrom\UnityEngine.CoreModule.dll_5938640487150751123.movedfrom
Library\Bee\artifacts\movedfrom\UnityEngine.CrashReportingModule.dll_5302026194431695627.movedfrom
Library\Bee\artifacts\movedfrom\UnityEngine.DirectorModule.dll_4733818662052505712.movedfrom
Library\Bee\artifacts\movedfrom\UnityEngine.dll_7140309915069155218.movedfrom
Library\Bee\artifacts\movedfrom\UnityEngine.DSPGraphModule.dll_5117013210874116497.movedfrom
Library\Bee\artifacts\movedfrom\UnityEngine.GameCenterModule.dll_13408232223942985835.movedfrom
Library\Bee\artifacts\movedfrom\UnityEngine.GIModule.dll_14924522763726265302.movedfrom
Library\Bee\artifacts\movedfrom\UnityEngine.GridModule.dll_3448462077615940490.movedfrom
Library\Bee\artifacts\movedfrom\UnityEngine.HotReloadModule.dll_1525282488547197190.movedfrom
Library\Bee\artifacts\movedfrom\UnityEngine.ImageConversionModule.dll_10225422961700656465.movedfrom
Library\Bee\artifacts\movedfrom\UnityEngine.IMGUIModule.dll_10191986238758033751.movedfrom
Library\Bee\artifacts\movedfrom\UnityEngine.InputLegacyModule.dll_1618363412289489699.movedfrom
Library\Bee\artifacts\movedfrom\UnityEngine.InputModule.dll_13512872310941297178.movedfrom
Library\Bee\artifacts\movedfrom\UnityEngine.JSONSerializeModule.dll_887630799325490920.movedfrom
Library\Bee\artifacts\movedfrom\UnityEngine.LocalizationModule.dll_16539103232967559901.movedfrom
Library\Bee\artifacts\movedfrom\UnityEngine.ParticleSystemModule.dll_11287953641773491865.movedfrom
Library\Bee\artifacts\movedfrom\UnityEngine.PerformanceReportingModule.dll_14762519016064120146.movedfrom
Library\Bee\artifacts\movedfrom\UnityEngine.Physics2DModule.dll_16179206135491108121.movedfrom
Library\Bee\artifacts\movedfrom\UnityEngine.PhysicsModule.dll_4335876209759918855.movedfrom
Library\Bee\artifacts\movedfrom\UnityEngine.ProfilerModule.dll_8356464518982446973.movedfrom
Library\Bee\artifacts\movedfrom\UnityEngine.RuntimeInitializeOnLoadManagerInitializerModule.dll_16615667112030355426.movedfrom
Library\Bee\artifacts\movedfrom\UnityEngine.ScreenCaptureModule.dll_2754282156978740042.movedfrom
Library\Bee\artifacts\movedfrom\UnityEngine.SharedInternalsModule.dll_1295135462150131873.movedfrom
Library\Bee\artifacts\movedfrom\UnityEngine.SpriteMaskModule.dll_11763418423407730149.movedfrom
Library\Bee\artifacts\movedfrom\UnityEngine.SpriteShapeModule.dll_11426097550201031996.movedfrom
Library\Bee\artifacts\movedfrom\UnityEngine.StreamingModule.dll_5221663879537319106.movedfrom
Library\Bee\artifacts\movedfrom\UnityEngine.SubstanceModule.dll_2675745020218333904.movedfrom
Library\Bee\artifacts\movedfrom\UnityEngine.SubsystemsModule.dll_1003587058948163064.movedfrom
Library\Bee\artifacts\movedfrom\UnityEngine.TerrainModule.dll_6229212619078427637.movedfrom
Library\Bee\artifacts\movedfrom\UnityEngine.TerrainPhysicsModule.dll_11322479213547577638.movedfrom
Library\Bee\artifacts\movedfrom\UnityEngine.TextCoreModule.dll_15739160305630943360.movedfrom
Library\Bee\artifacts\movedfrom\UnityEngine.TextRenderingModule.dll_5726501826415663935.movedfrom
Library\Bee\artifacts\movedfrom\UnityEngine.TilemapModule.dll_17685357975348823294.movedfrom
Library\Bee\artifacts\movedfrom\UnityEngine.TLSModule.dll_8736477336993288731.movedfrom
Library\Bee\artifacts\movedfrom\UnityEngine.UIElementsModule.dll_1309375983013659119.movedfrom
Library\Bee\artifacts\movedfrom\UnityEngine.UIElementsNativeModule.dll_9305585520241233382.movedfrom
Library\Bee\artifacts\movedfrom\UnityEngine.UIModule.dll_3627055218354207080.movedfrom
Library\Bee\artifacts\movedfrom\UnityEngine.UmbraModule.dll_14980733975223120105.movedfrom
Library\Bee\artifacts\movedfrom\UnityEngine.UNETModule.dll_16505853130167976716.movedfrom
Library\Bee\artifacts\movedfrom\UnityEngine.UnityAnalyticsModule.dll_13566617589725247637.movedfrom
Library\Bee\artifacts\movedfrom\UnityEngine.UnityConnectModule.dll_1512355609025971657.movedfrom
Library\Bee\artifacts\movedfrom\UnityEngine.UnityCurlModule.dll_14339117629667252081.movedfrom
Library\Bee\artifacts\movedfrom\UnityEngine.UnityTestProtocolModule.dll_18343942480489243743.movedfrom
Library\Bee\artifacts\movedfrom\UnityEngine.UnityWebRequestAssetBundleModule.dll_7331334345466626854.movedfrom
Library\Bee\artifacts\movedfrom\UnityEngine.UnityWebRequestAudioModule.dll_4961652542202068970.movedfrom
Library\Bee\artifacts\movedfrom\UnityEngine.UnityWebRequestModule.dll_11495165008552062928.movedfrom
Library\Bee\artifacts\movedfrom\UnityEngine.UnityWebRequestTextureModule.dll_15687175122531669759.movedfrom
Library\Bee\artifacts\movedfrom\UnityEngine.UnityWebRequestWWWModule.dll_5325894774860075835.movedfrom
Library\Bee\artifacts\movedfrom\UnityEngine.VehiclesModule.dll_13363552823953520651.movedfrom
Library\Bee\artifacts\movedfrom\UnityEngine.VFXModule.dll_18022504420489149320.movedfrom
Library\Bee\artifacts\movedfrom\UnityEngine.VideoModule.dll_8798655434345423131.movedfrom
Library\Bee\artifacts\movedfrom\UnityEngine.VRModule.dll_9594930029959397088.movedfrom
Library\Bee\artifacts\movedfrom\UnityEngine.WebGLModule.dll_17617531042648561465.movedfrom
Library\Bee\artifacts\movedfrom\UnityEngine.WindModule.dll_14463632599091121148.movedfrom
Library\Bee\artifacts\movedfrom\UnityEngine.XRModule.dll_13251504401680403518.movedfrom