 [
    {   "nombre":"ARDUINO UNO",
        "Fabricante":"Arduino",
        "id":"328b",
        "Familia":"placas",
        "isActive":false,
        "Voltaje_max_V":12,
        "Voltaje_min_V":0.8,
        "imagen": "http://placehold.it/32x32",
        "Temperatura_max_Trabajo_C": 80,
        "Temperatura_min_Trabajo_C":-20,
        "procedencia":"China",
        
        "garantia":[
             {"tiene_garantia":true},
             {"periodo":"6 Meses"}
        ],
        "Tags":["openhardware","Tics","RoboticaEducativa"],
        "Descripcion":"para proyectos de entrecasa"
    },
    
    
    {
        "nombre":"ARDUINO UNO",
        "Fabricante":"Arduino",
        "id":"328a",
        "Voltaje_max_V":12,
        "Voltaje_min_V":0.8,
        "Temperatura_max_Trabajo_C": 80,
        "Temperatura_min_Trabajo_C":-20,
        "procedencia":"China",
        "isActive":false,
        "garantia":[
             {"tiene_garantia":true},
             {"periodo":"6 Meses"}
        ],
        "Tags":["openhardware","Tics","RoboticaEducativa"],
        "Descripcion":"para proyectos de entrecasa"
     
    }
]



