term	alias
GO:0000003	GO:0050876
GO:0008150	GO:0044699
GO:0007033	GO:0044086
GO:0004553	GO:0016800
GO:0000022	GO:1905121
GO:0000070	GO:0016359
GO:0007052	GO:0043148
GO:0042255	GO:0042257
GO:0030001	GO:0070838
GO:0000049	GO:0000946
GO:0003723	GO:0044822
GO:0000050	GO:0006871
GO:0033750	GO:0033753
GO:0042254	GO:0007046
GO:0000055	GO:0000057
GO:0000056	GO:0000058
GO:0000073	GO:0030475
GO:0000075	GO:0072407
GO:0035556	GO:0023034
GO:0000076	GO:0072437
GO:0031570	GO:0072401
GO:0000077	GO:0072422
GO:0006355	GO:0061019
GO:0000095	GO:0015177
GO:0015171	GO:0015359
GO:0000100	GO:0015178
GO:0006865	GO:0006866
GO:0000103	GO:0019378
GO:0000104	GO:0019739
GO:0005667	GO:0044798
GO:0016791	GO:0016302
GO:0000122	GO:0045816
GO:0006357	GO:0010551
GO:0045892	GO:0061021
GO:0000124	GO:0030914
GO:0000128	GO:0043690
GO:0098610	GO:0098741
GO:0000132	GO:0030609
GO:0040001	GO:0030610
GO:0032991	GO:0043234
GO:0030427	GO:0030483
GO:0005940	GO:0030481
GO:0000146	GO:0030898
GO:0022607	GO:0071844
GO:0030866	GO:0033109
GO:0005515	GO:0045308
GO:0000154	GO:0016548
GO:0006364	GO:0006365
GO:0009451	GO:0016547
GO:0004673	GO:0008896
GO:0000161	GO:0007233
GO:0000162	GO:0009096
GO:0009073	GO:0016089
GO:0000165	GO:0007255
GO:0000179	GO:0043790
GO:0031507	GO:1904497
GO:0071554	GO:0070882
GO:0000212	GO:0043147
GO:0007051	GO:0043146
GO:0000215	GO:0008665
GO:0003677	GO:0043566
GO:0015291	GO:0015570
GO:0000244	GO:0000355
GO:0000398	GO:0006375
GO:0000253	GO:0050576
GO:0000268	GO:0005051
GO:0005048	GO:0008249
GO:0000270	GO:0009284
GO:0005976	GO:0044263
GO:0009059	GO:0043284
GO:0016051	GO:0006093
GO:0000272	GO:0044244
GO:0009057	GO:0044266
GO:0016052	GO:0044724
GO:0005753	GO:0016470
GO:0000278	GO:0007067
GO:0030010	GO:0030468
GO:0000292	GO:0030452
GO:0006812	GO:0072512
GO:0000310	GO:0009043
GO:0005840	GO:0033279
GO:0000754	GO:0030453
GO:0031410	GO:0016023
GO:0000338	GO:0010388
GO:0000348	GO:0000371
GO:0000349	GO:0000357
GO:0000350	GO:0000359
GO:0000354	GO:0000361
GO:0000375	GO:0031202
GO:0008380	GO:0006395
GO:0006396	GO:0006394
GO:0048024	GO:0035055
GO:0000388	GO:0000397
GO:0000389	GO:0000383
GO:0000390	GO:0000392
GO:0000395	GO:0000369
GO:0000418	GO:0000420
GO:0000419	GO:0080137
GO:0006914	GO:0016238
GO:0045944	GO:0045817
GO:0000438	GO:0000443
GO:0000439	GO:0000441
GO:0000440	GO:0000442
GO:0000776	GO:0005699
GO:0000462	GO:1990041
GO:0000448	GO:0000490
GO:0019104	GO:0008578
GO:0000703	GO:0019004
GO:0007131	GO:0007145
GO:0006298	GO:0006300
GO:0051276	GO:0051277
GO:0006289	GO:0045001
GO:0006259	GO:0055132
GO:0000724	GO:0016924
GO:0000741	GO:0007335
GO:0006997	GO:0048287
GO:0022414	GO:0044702
GO:0000747	GO:0030477
GO:0000743	GO:0006946
GO:0030473	GO:0000065
GO:0007097	GO:0040023
GO:0000749	GO:0030434
GO:0000750	GO:0030454
GO:0000751	GO:0030571
GO:0000752	GO:0007334
GO:0000753	GO:0007332
GO:0000755	GO:0030462
GO:0000902	GO:0045791
GO:0000770	GO:0007325
GO:0000775	GO:0097521
GO:0000779	GO:0000780
GO:0000781	GO:0000784
GO:0000785	GO:0005717
GO:0000786	GO:0005718
GO:0000791	GO:0005719
GO:0000792	GO:0005720
GO:0000795	GO:0005716
GO:0000796	GO:0061814
GO:0008278	GO:0043222
GO:0016765	GO:0016766
GO:0016706	GO:0010302
GO:0000910	GO:0033205
GO:0000915	GO:0045573
GO:0000917	GO:1902411
GO:0090529	GO:0090530
GO:0000920	GO:2000695
GO:0009987	GO:0050875
GO:0034622	GO:0043623
GO:0000922	GO:0030615
GO:0000931	GO:0061494
GO:0000935	GO:0043187
GO:0000939	GO:0000941
GO:0000940	GO:0000942
GO:0006633	GO:0000037
GO:0000976	GO:0044212
GO:0000977	GO:0001012
GO:0000978	GO:0000980
GO:0000987	GO:0035326
GO:0001046	GO:0001047
GO:0000981	GO:0003705
GO:0003700	GO:0001204
GO:0000995	GO:0001034
GO:0001002	GO:0001030
GO:0001003	GO:0001031
GO:0001006	GO:0001032
GO:0006383	GO:0001041
GO:0006366	GO:0032569
GO:0001018	GO:0070364
GO:0001039	GO:0001037
GO:0003899	GO:0000129
GO:0006351	GO:0061022
GO:0003676	GO:0000496
GO:0044877	GO:0032403
GO:0001109	GO:0001122
GO:0001112	GO:0001127
GO:0006352	GO:0001123
GO:0043933	GO:0071822
GO:0032984	GO:0043241
GO:0006353	GO:0001125
GO:0001147	GO:0001160
GO:0001161	GO:0044213
GO:0001163	GO:0001013
GO:0001164	GO:0001187
GO:0001165	GO:0001166
GO:0001173	GO:0001176
GO:0006384	GO:0001036
GO:0001188	GO:0001189
GO:0070897	GO:0001126
GO:0006361	GO:0001180
GO:0001192	GO:0001194
GO:0006354	GO:0001124
GO:0001216	GO:0001215
GO:0001217	GO:0001220
GO:0001221	GO:0001224
GO:0001222	GO:0001226
GO:0001223	GO:0001225
GO:0001227	GO:0001214
GO:0001228	GO:0001213
GO:0006325	GO:0016568
GO:0006260	GO:0055133
GO:0007165	GO:0023045
GO:0005759	GO:0031980
GO:0098656	GO:0099133
GO:0001410	GO:0055027
GO:0032501	GO:0050874
GO:0048018	GO:0071884
GO:0099512	GO:0043205
GO:0031012	GO:0005578
GO:0004896	GO:0004907
GO:0005886	GO:0005904
GO:0005930	GO:0035086
GO:0008585	GO:0061039
GO:0040007	GO:0048590
GO:0001562	GO:0042833
GO:0051707	GO:0042828
GO:0098543	GO:0051824
GO:0038023	GO:0019041
GO:0008395	GO:0008394
GO:0004888	GO:0099600
GO:0004993	GO:0016609
GO:0001588	GO:0001590
GO:0001591	GO:0001670
GO:0004930	GO:0016526
GO:0001609	GO:0008501
GO:0001614	GO:0035586
GO:0001621	GO:0045032
GO:0001634	GO:0016522
GO:0001646	GO:0001644
GO:0001654	GO:0042460
GO:0007631	GO:0044372
GO:0042596	GO:0001663
GO:1902275	GO:1903308
GO:0001673	GO:0043081
GO:0001674	GO:0043080
GO:0006413	GO:0006454
GO:0001694	GO:0001693
GO:0001702	GO:0048276
GO:0019988	GO:0030630
GO:0048598	GO:0048828
GO:0001744	GO:0007457
GO:0001748	GO:0048049
GO:0048592	GO:0048748
GO:0048749	GO:0007456
GO:0001752	GO:0007459
GO:0046530	GO:0007467
GO:0042098	GO:0042111
GO:0030098	GO:0046650
GO:0019763	GO:0016489
GO:0001806	GO:0016069
GO:0001816	GO:0050663
GO:0001817	GO:0050707
GO:0001818	GO:0050710
GO:0001819	GO:0050715
GO:0097190	GO:0008624
GO:0001841	GO:0001679
GO:0004875	GO:0004942
GO:0045087	GO:0002226
GO:0001872	GO:0080087
GO:0030247	GO:0002506
GO:0038187	GO:0008329
GO:0009620	GO:0009621
GO:0016046	GO:0016047
GO:0012501	GO:0016244
GO:0051701	GO:0044125
GO:0002443	GO:0042087
GO:0061024	GO:0044802
GO:0001942	GO:0001943
GO:0072359	GO:0072358
GO:0009913	GO:0043355
GO:0009966	GO:0035466
GO:0009968	GO:0035467
GO:0009967	GO:0035468
GO:0042311	GO:0045909
GO:0042310	GO:0045908
GO:0009306	GO:0045731
GO:0002003	GO:0002005
GO:0097746	GO:0050880
GO:0002036	GO:1900920
GO:0002037	GO:1900921
GO:0002038	GO:1900922
GO:0002046	GO:0016030
GO:0019290	GO:0031180
GO:0007519	GO:0048637
GO:0043010	GO:0031075
GO:0061025	GO:0044801
GO:0003016	GO:0010802
GO:0048593	GO:0048595
GO:0005901	GO:0016599
GO:0006400	GO:0016549
GO:0019955	GO:0019965
GO:0007610	GO:0044709
GO:0003727	GO:0003728
GO:0052689	GO:0016789
GO:0002162	GO:0002166
GO:0034613	GO:0016249
GO:0006412	GO:0043037
GO:0006414	GO:0006455
GO:0006415	GO:0006456
GO:0002381	GO:0002380
GO:0006952	GO:0042829
GO:0009611	GO:0002245
GO:0002213	GO:0002214
GO:0002215	GO:0002216
GO:0098542	GO:0009814
GO:0002218	GO:0002219
GO:0002758	GO:0010204
GO:0002385	GO:0002422
GO:0006983	GO:0006985
GO:0009595	GO:0009596
GO:0010033	GO:1990367
GO:0009617	GO:0009680
GO:0009602	GO:0051855
GO:0030217	GO:0046652
GO:0042100	GO:0042114
GO:0030183	GO:0042115
GO:0042592	GO:0032846
GO:0002367	GO:0002375
GO:0002377	GO:0048305
GO:0002391	GO:0002535
GO:0019882	GO:0030333
GO:0019885	GO:0048004
GO:0016485	GO:0051605
GO:0002637	GO:0051023
GO:0002638	GO:0051025
GO:0002639	GO:0051024
GO:0050728	GO:0030236
GO:0050789	GO:0050791
GO:0048519	GO:0043118
GO:0048518	GO:0043119
GO:0002715	GO:0045845
GO:0002716	GO:0030102
GO:0002717	GO:0045846
GO:0002718	GO:0002742
GO:0002719	GO:0002743
GO:0002720	GO:0002744
GO:0019731	GO:0019733
GO:0019732	GO:0019734
GO:0008348	GO:0042155
GO:1900425	GO:1902478
GO:1900150	GO:2000072
GO:1900426	GO:1902479
GO:0009058	GO:0044711
GO:0002949	GO:0070526
GO:0032502	GO:0044767
GO:0007507	GO:0007511
GO:0007623	GO:0050895
GO:0006814	GO:0016974
GO:0003121	GO:0003124
GO:0003122	GO:0003126
GO:0030509	GO:0008101
GO:0009997	GO:0042687
GO:0007219	GO:0030179
GO:0060411	GO:0003280
GO:0050794	GO:0051244
GO:0050801	GO:2000021
GO:0060413	GO:0003287
GO:0016055	GO:0007222
GO:0030111	GO:0008590
GO:0030178	GO:0045810
GO:0003341	GO:0036142
GO:0003352	GO:1900172
GO:0003353	GO:1900174
GO:0003354	GO:1900173
GO:0003356	GO:0036144
GO:0048663	GO:0042055
GO:0003376	GO:0001789
GO:0007186	GO:0038042
GO:0007155	GO:0098602
GO:0010001	GO:0043360
GO:0060041	GO:0002073
GO:0003674	GO:0005554
GO:0003678	GO:0004003
GO:0004386	GO:0008026
GO:0008094	GO:0004011
GO:0003689	GO:0033170
GO:0003697	GO:0003699
GO:0003712	GO:0016455
GO:0003713	GO:0001105
GO:0003714	GO:0001106
GO:0003724	GO:0004004
GO:0008186	GO:0004010
GO:0003726	GO:0003971
GO:0003729	GO:0000499
GO:0003735	GO:0003742
GO:0003743	GO:0003745
GO:0003746	GO:0008183
GO:0003747	GO:0003749
GO:0003755	GO:0042028
GO:0003756	GO:0006467
GO:0003777	GO:1990939
GO:0003838	GO:0102101
GO:0003841	GO:0004469
GO:0003843	GO:0009981
GO:0003995	GO:0019109
GO:0003863	GO:0003826
GO:0003878	GO:0046913
GO:0003886	GO:0008326
GO:0003887	GO:0019984
GO:0003896	GO:0003898
GO:0003905	GO:0004036
GO:0003916	GO:0009387
GO:0003918	GO:0061505
GO:0016884	GO:0016003
GO:0003924	GO:0061745
GO:0003925	GO:0003927
GO:0003959	GO:0016660
GO:0003961	GO:0019282
GO:0003962	GO:0000505
GO:0003973	GO:0052854
GO:0016744	GO:0016745
GO:0003992	GO:0047318
GO:0050145	GO:0019201
GO:0004045	GO:0019851
GO:0008168	GO:0004480
GO:0004057	GO:0042172
GO:0004058	GO:0016400
GO:0018271	GO:0000106
GO:0016868	GO:0016777
GO:0004092	GO:0004094
GO:0004096	GO:0016953
GO:0004601	GO:0016693
GO:0004097	GO:0102316
GO:0008081	GO:0016792
GO:0004121	GO:0008799
GO:0004123	GO:0016225
GO:0016785	GO:0016786
GO:0009055	GO:0009054
GO:0016832	GO:0016228
GO:0016668	GO:0016654
GO:0004165	GO:0008461
GO:0004166	GO:0004101
GO:0004167	GO:0048059
GO:0004175	GO:0016809
GO:0008233	GO:0070011
GO:0004176	GO:0004280
GO:0008234	GO:0004220
GO:0004300	GO:0016510
GO:0004315	GO:0033817
GO:0016297	GO:0010281
GO:0004328	GO:0034566
GO:0004331	GO:0004330
GO:0008422	GO:0016983
GO:0004344	GO:0008708
GO:0004350	GO:0001513
GO:0047952	GO:0036439
GO:0004376	GO:0004580
GO:0004379	GO:0019106
GO:0016712	GO:0050381
GO:0010420	GO:1990886
GO:0004402	GO:0046971
GO:0004420	GO:0042282
GO:0004629	GO:0042298
GO:0004438	GO:0016315
GO:0004439	GO:0001668
GO:0004467	GO:0003996
GO:0004471	GO:0016619
GO:0004479	GO:0070128
GO:0004489	GO:0008702
GO:0004499	GO:0047076
GO:0004536	GO:0004537
GO:0004523	GO:0004524
GO:0004527	GO:0008857
GO:0004558	GO:0016982
GO:0004602	GO:0016224
GO:0004615	GO:0008971
GO:0004622	GO:0045126
GO:0004623	GO:0102568
GO:0004648	GO:0004646
GO:0004660	GO:0018223
GO:0008318	GO:0008244
GO:0004661	GO:0018224
GO:0004671	GO:0018225
GO:0004672	GO:0050222
GO:0004674	GO:0106311
GO:0004683	GO:0004688
GO:0004689	GO:0008606
GO:0004691	GO:0008602
GO:0004693	GO:0016537
GO:0004697	GO:0004701
GO:0004703	GO:0004678
GO:0030234	GO:0010576
GO:0004707	GO:0016909
GO:0004709	GO:0004710
GO:0004713	GO:0004718
GO:0004720	GO:0018056
GO:0004722	GO:0030361
GO:0004723	GO:0008596
GO:0004741	GO:0019906
GO:0004748	GO:0016961
GO:0004760	GO:0004763
GO:0004767	GO:0030231
GO:0004768	GO:0043735
GO:0004772	GO:0017066
GO:0004777	GO:0008952
GO:0004784	GO:0016954
GO:0004796	GO:0008400
GO:0004803	GO:0004804
GO:0004808	GO:0016425
GO:0016423	GO:0016424
GO:0004812	GO:0017100
GO:0004833	GO:0004426
GO:0008641	GO:0008642
GO:0004842	GO:0004841
GO:0019787	GO:0008640
GO:0004843	GO:0036459
GO:0101005	GO:1904265
GO:0004857	GO:0048551
GO:0016538	GO:0003753
GO:0004864	GO:1990681
GO:0019888	GO:0030362
GO:0004869	GO:0004870
GO:0004876	GO:0004943
GO:0004878	GO:0004944
GO:0004879	GO:0038052
GO:0004901	GO:0030525
GO:0004902	GO:0030524
GO:0004909	GO:0019967
GO:0004910	GO:0019968
GO:0004923	GO:0004899
GO:0004962	GO:0001600
GO:0004964	GO:0004976
GO:0005000	GO:0016931
GO:0005006	GO:0005023
GO:0005021	GO:0036330
GO:0005031	GO:0005033
GO:0005041	GO:0008032
GO:0005049	GO:0008262
GO:0140142	GO:0090631
GO:0005068	GO:0005069
GO:0005080	GO:0097024
GO:0005085	GO:0030676
GO:0030695	GO:0005083
GO:0005096	GO:0046582
GO:0008047	GO:0010577
GO:0005104	GO:0005162
GO:0005109	GO:0005110
GO:0005154	GO:0008185
GO:0005159	GO:0005067
GO:0005215	GO:0005478
GO:0015267	GO:0022838
GO:0015278	GO:0005218
GO:0005220	GO:0008095
GO:0005261	GO:0015338
GO:0005243	GO:0015286
GO:0005245	GO:0015270
GO:0008308	GO:0022844
GO:0005260	GO:0005224
GO:0022890	GO:0072510
GO:0015079	GO:0022817
GO:0015081	GO:0022816
GO:0005274	GO:0015206
GO:0005275	GO:0005279
GO:0022857	GO:0022892
GO:0005283	GO:0005285
GO:0015174	GO:0015326
GO:0061459	GO:0102022
GO:1901474	GO:0045118
GO:0015189	GO:0005293
GO:0005295	GO:0005282
GO:0015196	GO:0005299
GO:0005302	GO:0015508
GO:0015658	GO:1901240
GO:0015220	GO:0005306
GO:0005310	GO:0015365
GO:0015501	GO:0008027
GO:0005315	GO:0005317
GO:0005436	GO:0015321
GO:0005324	GO:0008562
GO:0005330	GO:0005329
GO:0008504	GO:0015201
GO:0005334	GO:0005333
GO:0005335	GO:0015222
GO:0005338	GO:0005339
GO:0005340	GO:0005341
GO:0005344	GO:0015033
GO:0015205	GO:0015392
GO:0005347	GO:0005348
GO:0005351	GO:0015542
GO:0005353	GO:0019192
GO:0005355	GO:0015579
GO:0005356	GO:0005361
GO:0005363	GO:0015581
GO:0005371	GO:0005370
GO:0005375	GO:0015088
GO:0005381	GO:0097689
GO:0008556	GO:0015618
GO:0015144	GO:1901476
GO:0005415	GO:0008522
GO:0015301	GO:0015384
GO:0005471	GO:0005349
GO:0005484	GO:0005486
GO:0005548	GO:0008497
GO:0005575	GO:0008372
GO:0005604	GO:0008003
GO:0016020	GO:0098805
GO:0005635	GO:0005636
GO:0005641	GO:0005653
GO:0005643	GO:0005644
GO:1990904	GO:1990903
GO:0005721	GO:0031618
GO:0005746	GO:0097249
GO:0005747	GO:0005748
GO:0045271	GO:0045279
GO:0005749	GO:0030390
GO:0005750	GO:0015008
GO:0045275	GO:0045285
GO:0005751	GO:0005752
GO:0045277	GO:0045287
GO:0045259	GO:0045255
GO:0005758	GO:0031971
GO:0005777	GO:0019818
GO:0005782	GO:0031909
GO:0071256	GO:0031206
GO:0005786	GO:0005855
GO:0005788	GO:0016022
GO:0005795	GO:0016940
GO:0005826	GO:0030480
GO:0005835	GO:0031374
GO:0005839	GO:0000503
GO:0005912	GO:0005913
GO:0005925	GO:0008357
GO:0005929	GO:0072372
GO:0019898	GO:0030396
GO:0005943	GO:0035030
GO:0005944	GO:0035031
GO:0005958	GO:0005959
GO:0005960	GO:0070015
GO:0045254	GO:0009364
GO:0005969	GO:0005970
GO:0005975	GO:0044723
GO:0043170	GO:0044259
GO:0009311	GO:0051690
GO:0044262	GO:0006092
GO:0019255	GO:0006008
GO:0046384	GO:0046388
GO:0019585	GO:0019699
GO:0006090	GO:0006087
GO:0006096	GO:0019642
GO:0051156	GO:0006010
GO:0006110	GO:0090525
GO:0006111	GO:0090526
GO:0019646	GO:0006138
GO:0006139	GO:0055134
GO:0006154	GO:0006156
GO:0006157	GO:0006159
GO:0006214	GO:0006215
GO:0046036	GO:0006243
GO:0006258	GO:0019691
GO:0044260	GO:0034960
GO:0034645	GO:0034961
GO:0006261	GO:0006263
GO:0006270	GO:0042024
GO:0006279	GO:1902968
GO:0006974	GO:0034984
GO:0044265	GO:0034962
GO:0006309	GO:0008178
GO:0006313	GO:0006318
GO:0016043	GO:0071842
GO:0006338	GO:0043044
GO:0006363	GO:0019223
GO:0006369	GO:0019224
GO:0006386	GO:0019225
GO:0051170	GO:1902593
GO:0006417	GO:0006445
GO:0006450	GO:0000029
GO:0006457	GO:0007025
GO:0031365	GO:0018409
GO:0006486	GO:0065006
GO:0006491	GO:0006492
GO:0006497	GO:0042050
GO:0018377	GO:0018319
GO:0018345	GO:0018349
GO:0006505	GO:0046472
GO:0046488	GO:0030384
GO:0006506	GO:0015998
GO:0006661	GO:0046489
GO:0019538	GO:0044268
GO:0006511	GO:0043432
GO:0030163	GO:0044254
GO:0006520	GO:0006519
GO:0006538	GO:0019459
GO:0006557	GO:0006745
GO:0006580	GO:0006645
GO:0042430	GO:0042434
GO:0006886	GO:0032779
GO:0034504	GO:0044744
GO:0006611	GO:0097349
GO:0006626	GO:0043681
GO:0006650	GO:0006652
GO:0006673	GO:0006674
GO:0016042	GO:0044240
GO:0006720	GO:0016096
GO:0006730	GO:0019754
GO:0008152	GO:0044710
GO:1901661	GO:0042375
GO:1901663	GO:0045426
GO:0006754	GO:0006759
GO:0042558	GO:0019721
GO:0006805	GO:0017144
GO:0071466	GO:0035690
GO:0006810	GO:0044765
GO:0006813	GO:0071804
GO:0006820	GO:0006822
GO:0098662	GO:0072511
GO:0006826	GO:0097286
GO:0006835	GO:0006841
GO:0015844	GO:0015873
GO:0006843	GO:1990541
GO:0015697	GO:0015845
GO:0006850	GO:1902361
GO:0042908	GO:0015893
GO:0055085	GO:0090662
GO:0008643	GO:0008644
GO:0006863	GO:0015852
GO:0006868	GO:0015815
GO:0015031	GO:0015831
GO:0046907	GO:1902582
GO:0006887	GO:0016195
GO:0016192	GO:0006899
GO:0006888	GO:0048221
GO:0006890	GO:0048220
GO:0006895	GO:0048218
GO:0006897	GO:0098701
GO:0006900	GO:1902591
GO:0006907	GO:1902536
GO:0006913	GO:0000063
GO:0006915	GO:0008632
GO:0022411	GO:0071845
GO:0050896	GO:0051869
GO:0006968	GO:0016067
GO:0030330	GO:0006976
GO:0031571	GO:1902400
GO:0006996	GO:1902589
GO:0030047	GO:0007013
GO:0097435	GO:0043206
GO:0007044	GO:0007045
GO:0045893	GO:0061020
GO:0030261	GO:0000068
GO:0007079	GO:0007082
GO:0007089	GO:0000081
GO:0007093	GO:0072474
GO:0007094	GO:1902420
GO:0071173	GO:0072486
GO:0071174	GO:0072477
GO:0007095	GO:1902506
GO:0044773	GO:1902402
GO:0007098	GO:0051297
GO:0007099	GO:0032054
GO:0007105	GO:0010687
GO:0016049	GO:0048591
GO:0045143	GO:0007061
GO:0098609	GO:0016337
GO:0048523	GO:0051243
GO:0007163	GO:0030467
GO:0023052	GO:0044700
GO:0007175	GO:0007177
GO:0007189	GO:0010580
GO:0050790	GO:0048552
GO:0051091	GO:1904169
GO:0007260	GO:0042508
GO:0007269	GO:0010554
GO:0007276	GO:0009552
GO:0007349	GO:0009796
GO:0035082	GO:0035084
GO:0048477	GO:0048157
GO:0007294	GO:0016350
GO:0007308	GO:0048110
GO:0007309	GO:0048111
GO:0007310	GO:0048123
GO:0007311	GO:0048124
GO:0007312	GO:0048128
GO:0051663	GO:0051662
GO:0007313	GO:0048125
GO:0007314	GO:0048112
GO:0007315	GO:0048113
GO:0007316	GO:0048116
GO:0007318	GO:0048115
GO:0008104	GO:0008105
GO:0017148	GO:0016478
GO:0007323	GO:0046613
GO:0045026	GO:0006947
GO:0051726	GO:0071850
GO:0007371	GO:0007373
GO:0007400	GO:0043348
GO:0007403	GO:0043361
GO:0007405	GO:0043350
GO:0007407	GO:0043352
GO:0007409	GO:0007410
GO:0007411	GO:0008040
GO:0007425	GO:0046846
GO:0010160	GO:0048862
GO:0048546	GO:0048547
GO:0007560	GO:0007452
GO:0007460	GO:0007461
GO:0007534	GO:0061500
GO:0007552	GO:0046699
GO:0007568	GO:0016280
GO:0007576	GO:0046616
GO:0007593	GO:0045452
GO:0019098	GO:0044705
GO:0045924	GO:0060181
GO:0008015	GO:0070261
GO:0008020	GO:0004975
GO:0008028	GO:0008505
GO:0008049	GO:0016542
GO:0008057	GO:0048751
GO:0019843	GO:0000944
GO:0008103	GO:0048129
GO:0016325	GO:0048130
GO:0008113	GO:0072561
GO:0008117	GO:0016001
GO:0008121	GO:0045154
GO:0008131	GO:0008122
GO:0140297	GO:0070491
GO:0032934	GO:0005498
GO:0072542	GO:0072543
GO:0008177	GO:0019737
GO:0016757	GO:0016932
GO:0008195	GO:0004606
GO:0008272	GO:0006870
GO:0008275	GO:0061495
GO:0048522	GO:0051242
GO:0016895	GO:0008858
GO:0008299	GO:0009241
GO:0008300	GO:0016097
GO:0098636	GO:1990307
GO:0008320	GO:0015463
GO:0030537	GO:0017037
GO:0008347	GO:0043359
GO:0008360	GO:0045789
GO:0008366	GO:0042553
GO:0016056	GO:0009586
GO:0008379	GO:0009031
GO:0008381	GO:0022833
GO:0008403	GO:0030344
GO:0008412	GO:0048044
GO:0008426	GO:0004863
GO:0008466	GO:0047210
GO:0008469	GO:0016276
GO:0008481	GO:0001728
GO:0008490	GO:0008491
GO:0015379	GO:0022820
GO:0008513	GO:0015354
GO:0008515	GO:0019188
GO:0090482	GO:0051183
GO:0008519	GO:0051739
GO:0008520	GO:0070890
GO:0008526	GO:0120018
GO:0008534	GO:0003907
GO:0008551	GO:0008561
GO:0008553	GO:0036442
GO:0008559	GO:0008560
GO:0042910	GO:0090484
GO:0008589	GO:0043109
GO:0042461	GO:0046531
GO:0008608	GO:0051313
GO:0008612	GO:0046515
GO:0008614	GO:0006773
GO:0008623	GO:0016588
GO:0097193	GO:0008629
GO:0008645	GO:0035428
GO:0015749	GO:1905950
GO:0008660	GO:0018806
GO:0008684	GO:0018821
GO:0008694	GO:0019167
GO:0008701	GO:0018804
GO:0008704	GO:0018843
GO:0008795	GO:0016965
GO:0008805	GO:0047767
GO:0008806	GO:0018735
GO:0008808	GO:0043788
GO:0008820	GO:0043753
GO:0008821	GO:0008844
GO:0008828	GO:0044714
GO:0008835	GO:0008485
GO:0008863	GO:0018476
GO:0008897	GO:0008958
GO:0008900	GO:0005390
GO:0008901	GO:0016951
GO:0016699	GO:0019110
GO:0008922	GO:0010300
GO:0008982	GO:0015456
GO:0009056	GO:0044712
GO:0009094	GO:0019275
GO:0009106	GO:0000273
GO:0009107	GO:0009105
GO:0009114	GO:0006150
GO:0009115	GO:0006151
GO:0009259	GO:0009121
GO:0009239	GO:0031192
GO:0019540	GO:0031190
GO:0009249	GO:0018055
GO:0009252	GO:0009285
GO:0009253	GO:0009286
GO:0009254	GO:0009287
GO:0009262	GO:0009393
GO:0009299	GO:0061023
GO:0044355	GO:0044356
GO:0009313	GO:0051689
GO:0009372	GO:0060247
GO:0009378	GO:1990163
GO:0009408	GO:0006951
GO:0009410	GO:0042493
GO:0009423	GO:0033587
GO:0009431	GO:0009430
GO:0009435	GO:0006736
GO:0051775	GO:0006980
GO:0009486	GO:0008827
GO:0009510	GO:0009572
GO:0009521	GO:0030090
GO:0009553	GO:0048230
GO:0009555	GO:0048231
GO:0009558	GO:0009797
GO:0009560	GO:0048233
GO:0016045	GO:0009681
GO:0009616	GO:0060150
GO:0009625	GO:0043019
GO:0071555	GO:0044234
GO:0009670	GO:0015122
GO:0015114	GO:1901677
GO:0042742	GO:0042830
GO:0009693	GO:0042456
GO:0097305	GO:1990335
GO:0009758	GO:0007587
GO:0009767	GO:0009776
GO:0009790	GO:0009795
GO:0044277	GO:0060871
GO:0009847	GO:0075005
GO:0009877	GO:0009878
GO:0019222	GO:0044246
GO:0009892	GO:0044252
GO:0009893	GO:0044253
GO:0009986	GO:0009929
GO:0009908	GO:0048409
GO:0009957	GO:0043356
GO:0043200	GO:0010237
GO:0009977	GO:0015557
GO:0009978	GO:0047987
GO:0009982	GO:0016439
GO:0030104	GO:0018987
GO:0048367	GO:0022621
GO:0010026	GO:0048271
GO:0010074	GO:0032503
GO:0010090	GO:0048272
GO:0010091	GO:0048274
GO:0048449	GO:0048436
GO:0048462	GO:0048431
GO:0048451	GO:0048419
GO:0048453	GO:0048423
GO:0048455	GO:0048427
GO:0019605	GO:0043437
GO:0045733	GO:0019663
GO:0042178	GO:0042738
GO:0016138	GO:0016141
GO:0016137	GO:0016140
GO:0010133	GO:0019494
GO:0019419	GO:0019421
GO:0010198	GO:0048470
GO:0048437	GO:0048433
GO:0034220	GO:0099131
GO:0010260	GO:0010261
GO:0065003	GO:0006461
GO:0010277	GO:0046407
GO:0010285	GO:0043742
GO:0010287	GO:0010502
GO:0010291	GO:0042411
GO:0010293	GO:0033725
GO:0010301	GO:0033710
GO:0010311	GO:0010386
GO:0010324	GO:1902534
GO:0044085	GO:0071843
GO:0043067	GO:0043070
GO:0044036	GO:0010382
GO:0010496	GO:1902585
GO:0010497	GO:1902587
GO:0010533	GO:0010534
GO:0010536	GO:0010537
GO:1903362	GO:2000598
GO:0010590	GO:2001041
GO:0043066	GO:0006916
GO:0010672	GO:1900401
GO:0010673	GO:1900476
GO:0010674	GO:1900475
GO:1902531	GO:0010627
GO:1902533	GO:0010740
GO:1902532	GO:0010741
GO:0070613	GO:0010953
GO:0043085	GO:0048554
GO:0010971	GO:0031662
GO:0010973	GO:1902470
GO:0032955	GO:1902468
GO:0010974	GO:1902469
GO:0010992	GO:0010993
GO:0012502	GO:0012503
GO:0043068	GO:0043071
GO:0031982	GO:0031988
GO:0012507	GO:0030664
GO:0030134	GO:0140045
GO:0030143	GO:0005807
GO:0012511	GO:0009520
GO:0014021	GO:0014026
GO:0014069	GO:0097483
GO:0016529	GO:0008221
GO:0055001	GO:0048747
GO:0015016	GO:0051910
GO:0015020	GO:0003981
GO:0015026	GO:0015028
GO:0015035	GO:0015037
GO:0015057	GO:0010655
GO:0015083	GO:0015084
GO:0015093	GO:0015639
GO:0015108	GO:0008555
GO:0015134	GO:0015163
GO:0015153	GO:0033297
GO:0015155	GO:0019189
GO:0043865	GO:1990240
GO:0015193	GO:0005296
GO:0015194	GO:1905361
GO:0015195	GO:0015512
GO:0015651	GO:0015202
GO:0015204	GO:0015287
GO:0015225	GO:1901603
GO:0015230	GO:0005472
GO:0015234	GO:0015403
GO:0015245	GO:0015246
GO:0022803	GO:0022814
GO:0015297	GO:0099516
GO:1901479	GO:0015242
GO:1901478	GO:0015241
GO:0015317	GO:0015320
GO:0035673	GO:0015198
GO:1904680	GO:0015637
GO:0015343	GO:0042927
GO:0015360	GO:0015357
GO:0015375	GO:0015656
GO:0015385	GO:0015502
GO:0015506	GO:0015536
GO:0015395	GO:0015397
GO:0015413	GO:0102016
GO:0015416	GO:0102017
GO:0015417	GO:0015595
GO:0015418	GO:0102908
GO:0015420	GO:0102023
GO:0015422	GO:0015609
GO:0015424	GO:0032520
GO:0015430	GO:0070812
GO:0015431	GO:0071997
GO:0015438	GO:0015162
GO:0015439	GO:0103115
GO:0042626	GO:0043492
GO:0015467	GO:0015273
GO:0015495	GO:0015329
GO:0015499	GO:0015659
GO:0015518	GO:0015523
GO:0015636	GO:0015635
GO:0015558	GO:0015569
GO:0071916	GO:0042936
GO:0015566	GO:0015555
GO:0015571	GO:0015590
GO:0019196	GO:0019195
GO:0015572	GO:0015580
GO:0015573	GO:0015582
GO:0015574	GO:0015584
GO:0015575	GO:0015586
GO:0015576	GO:0015587
GO:0015577	GO:0015588
GO:0015578	GO:0015589
GO:0015625	GO:0102026
GO:0015654	GO:0015118
GO:0015655	GO:0044670
GO:0015660	GO:0015509
GO:0015663	GO:0015664
GO:0035434	GO:1901473
GO:0033212	GO:0070627
GO:0033214	GO:0033213
GO:0015706	GO:0080055
GO:0015708	GO:1902067
GO:0015716	GO:0042916
GO:0090481	GO:0015781
GO:0090480	GO:0036079
GO:0015803	GO:1900755
GO:0015813	GO:0089711
GO:0015819	GO:0061461
GO:0015825	GO:0090479
GO:0032329	GO:0090478
GO:0015860	GO:0035427
GO:0031503	GO:0034629
GO:0015881	GO:1902598
GO:0015891	GO:0015892
GO:0015936	GO:0006763
GO:0015937	GO:0006764
GO:0015938	GO:0006765
GO:0015939	GO:0006770
GO:0015940	GO:0033318
GO:0015976	GO:0015978
GO:1902600	GO:0015992
GO:0019897	GO:0000157
GO:0016032	GO:0022415
GO:0016034	GO:0018841
GO:0071840	GO:0071841
GO:0016139	GO:0016142
GO:0016152	GO:0018692
GO:0036466	GO:0099090
GO:0048488	GO:0008099
GO:0016197	GO:0032439
GO:0016236	GO:0034262
GO:0097352	GO:0000046
GO:0016251	GO:0003703
GO:0016262	GO:0016253
GO:0016290	GO:0016293
GO:0047617	GO:0016292
GO:0016300	GO:0016431
GO:0016303	GO:0004429
GO:0016308	GO:0045215
GO:0016316	GO:0004440
GO:0016442	GO:0035068
GO:0016461	GO:0005860
GO:0140448	GO:0035638
GO:0016501	GO:0004959
GO:0070603	GO:0090544
GO:0016556	GO:0006381
GO:0016579	GO:0006514
GO:0016586	GO:0070604
GO:0016592	GO:0000119
GO:0016598	GO:0019130
GO:0016691	GO:0016958
GO:0016697	GO:0016698
GO:0016746	GO:0008415
GO:0016756	GO:0042143
GO:0016762	GO:0080039
GO:0016805	GO:0102008
GO:0016847	GO:0034100
GO:0016887	GO:0042623
GO:0016907	GO:0004981
GO:0016922	GO:0035258
GO:0061629	GO:0001103
GO:0016925	GO:0019951
GO:0016926	GO:0016928
GO:0019783	GO:1904455
GO:0016934	GO:0004891
GO:0016966	GO:0016968
GO:0016979	GO:0102315
GO:0016987	GO:0001053
GO:0016992	GO:0017140
GO:0016998	GO:0044039
GO:0017018	GO:0017019
GO:0017053	GO:0090569
GO:0017056	GO:0005487
GO:0017064	GO:0017073
GO:0017067	GO:0008128
GO:0017069	GO:0000945
GO:0019905	GO:0051535
GO:0017077	GO:0015302
GO:0017086	GO:0031212
GO:0017096	GO:0017097
GO:0017103	GO:0003982
GO:0017116	GO:0043142
GO:0017125	GO:0019986
GO:0017134	GO:0048607
GO:0017143	GO:0017138
GO:0018091	GO:0019127
GO:0018117	GO:0018176
GO:0018315	GO:0042041
GO:0018160	GO:0033035
GO:0019511	GO:0006472
GO:0018216	GO:0018017
GO:0018343	GO:0018347
GO:0018344	GO:0018348
GO:0018238	GO:0018239
GO:0018275	GO:0017191
GO:0018342	GO:0018346
GO:0018353	GO:0018380
GO:0018356	GO:0018382
GO:0018357	GO:0018383
GO:0018358	GO:0018381
GO:0018359	GO:0018385
GO:0018360	GO:0018384
GO:0018362	GO:0019924
GO:0018363	GO:0019925
GO:0018406	GO:0032004
GO:0018439	GO:0018440
GO:0018524	GO:0018797
GO:0018627	GO:0018605
GO:0018685	GO:0008393
GO:0018771	GO:0008680
GO:0018835	GO:0009456
GO:0043420	GO:0018869
GO:0018984	GO:0018932
GO:0018991	GO:0060403
GO:0019008	GO:0019009
GO:0019013	GO:0019014
GO:0044423	GO:0019012
GO:0019028	GO:0046728
GO:0019042	GO:0075710
GO:0019043	GO:0075601
GO:0019044	GO:0075716
GO:0019046	GO:0075717
GO:0019048	GO:0044792
GO:0044003	GO:0044055
GO:0030682	GO:0051834
GO:0019058	GO:0019067
GO:0019060	GO:0046801
GO:0030581	GO:0051708
GO:0019064	GO:0075706
GO:0019068	GO:0042963
GO:0019087	GO:0020021
GO:0019094	GO:0048120
GO:0019095	GO:0048117
GO:0019096	GO:0048118
GO:0019097	GO:0048119
GO:0019099	GO:0007544
GO:0019123	GO:0018369
GO:0019124	GO:0018370
GO:0019125	GO:0018371
GO:0019126	GO:0018372
GO:0019128	GO:0018374
GO:0019129	GO:0018375
GO:0019139	GO:0046420
GO:0019164	GO:0018696
GO:0019191	GO:0019190
GO:0019194	GO:0019193
GO:0019217	GO:0006632
GO:0019289	GO:0031194
GO:0019293	GO:0019291
GO:0019396	GO:0018918
GO:0019392	GO:0019581
GO:0019424	GO:0019425
GO:0019429	GO:0018917
GO:0019537	GO:0031196
GO:0019539	GO:0031198
GO:0019564	GO:0019565
GO:0019580	GO:0046393
GO:0019643	GO:0019644
GO:0019650	GO:0030646
GO:1902707	GO:1990282
GO:0019677	GO:0006737
GO:0046397	GO:0019587
GO:0019710	GO:0018018
GO:0019730	GO:0019735
GO:0050832	GO:0042831
GO:0019781	GO:0019944
GO:0019788	GO:0042295
GO:0019789	GO:0019949
GO:0019815	GO:0042570
GO:0019871	GO:0019868
GO:0019886	GO:0048005
GO:0019912	GO:0019913
GO:0019938	GO:0042266
GO:0045234	GO:0045235
GO:0019948	GO:0017115
GO:0060170	GO:0020017
GO:0020020	GO:0005772
GO:0020033	GO:0020034
GO:0042783	GO:0051810
GO:0020035	GO:0043706
GO:0044406	GO:0051856
GO:0021828	GO:0021857
GO:0045879	GO:0045877
GO:0022625	GO:0030872
GO:0022626	GO:0030871
GO:0022627	GO:0030873
GO:0022848	GO:0016904
GO:0022850	GO:0005232
GO:0022893	GO:0015510
GO:0030007	GO:0017079
GO:0030011	GO:0030469
GO:0051017	GO:0045011
GO:0030118	GO:0016190
GO:0030126	GO:0017167
GO:0030135	GO:0005909
GO:0030175	GO:0030028
GO:0030177	GO:0045811
GO:0030222	GO:0035856
GO:0030243	GO:0016177
GO:0030244	GO:0016178
GO:0030245	GO:0016179
GO:0030246	GO:0005529
GO:0030268	GO:0018536
GO:0030269	GO:0018709
GO:0030270	GO:0018714
GO:0030272	GO:0019006
GO:0042597	GO:0005620
GO:0030317	GO:1905419
GO:0060285	GO:0071974
GO:0050931	GO:0043358
GO:0030374	GO:0038049
GO:0030409	GO:0030407
GO:0030430	GO:0097679
GO:0030437	GO:0007151
GO:0030448	GO:0075061
GO:0030466	GO:0035389
GO:0030474	GO:0031046
GO:0051300	GO:0051426
GO:0030476	GO:0007152
GO:0030478	GO:0000143
GO:0030479	GO:0005857
GO:0030510	GO:0090097
GO:0030513	GO:0090098
GO:0030514	GO:0090099
GO:0060090	GO:0032947
GO:0030541	GO:0030542
GO:0030573	GO:0019613
GO:0030583	GO:0055084
GO:0099120	GO:0090702
GO:0055063	GO:0080174
GO:1902705	GO:1990287
GO:0052200	GO:0075145
GO:0030683	GO:0019053
GO:0030697	GO:0009021
GO:0030719	GO:0048114
GO:0030752	GO:0030764
GO:0030753	GO:0030765
GO:0030795	GO:0102078
GO:0030835	GO:0030044
GO:0030836	GO:0030045
GO:0030877	GO:0034747
GO:0030964	GO:0045280
GO:0030983	GO:0032134
GO:0032432	GO:0030482
GO:0031005	GO:0031008
GO:0031048	GO:0070924
GO:0035196	GO:0030918
GO:0031145	GO:0008054
GO:0031169	GO:0031200
GO:0031171	GO:0031186
GO:0031236	GO:0031238
GO:0031237	GO:0031239
GO:0031267	GO:0048365
GO:0043086	GO:0048553
GO:0031297	GO:0034065
GO:0051179	GO:1902578
GO:0031508	GO:1990141
GO:0031509	GO:0099114
GO:0031514	GO:0031512
GO:0031531	GO:0031888
GO:0031532	GO:0007012
GO:0031567	GO:0072471
GO:0031568	GO:0072450
GO:0031569	GO:0072453
GO:0031573	GO:0072428
GO:0031577	GO:0072416
GO:0031578	GO:0072483
GO:0031640	GO:0001908
GO:0031679	GO:0030024
GO:0031704	GO:0042569
GO:0031780	GO:0071856
GO:0031789	GO:0031794
GO:0045727	GO:0045946
GO:0043433	GO:2000824
GO:0032120	GO:0099097
GO:0032190	GO:0032192
GO:0032197	GO:0006322
GO:0032220	GO:0070872
GO:0032221	GO:0000509
GO:1901662	GO:0042378
GO:0032456	GO:1990126
GO:0032465	GO:0071775
GO:0032466	GO:0071776
GO:0032467	GO:0071777
GO:0032515	GO:0034048
GO:0043666	GO:0034047
GO:0032516	GO:0034049
GO:1901654	GO:1990369
GO:0032574	GO:0032575
GO:0032602	GO:0090195
GO:0032603	GO:0050756
GO:0032604	GO:0042253
GO:0032605	GO:0048175
GO:0032606	GO:0072641
GO:0032607	GO:0072642
GO:0032608	GO:0045350
GO:0032609	GO:0072643
GO:0032610	GO:0050719
GO:0032612	GO:0050701
GO:0032611	GO:0050720
GO:0032613	GO:0072608
GO:0032614	GO:0072609
GO:0032615	GO:0072610
GO:0032616	GO:0072611
GO:0032617	GO:0072612
GO:0032618	GO:0072613
GO:0032619	GO:0072614
GO:0032620	GO:0072615
GO:0032621	GO:0072616
GO:0032622	GO:0072617
GO:0032623	GO:0070970
GO:0032624	GO:0072618
GO:0032625	GO:0072619
GO:0032626	GO:0072620
GO:0032627	GO:0072621
GO:0032628	GO:0072622
GO:0032629	GO:0072623
GO:0032630	GO:0072624
GO:0032631	GO:0072625
GO:0032632	GO:0072601
GO:0032633	GO:0072602
GO:0032634	GO:0072603
GO:0032635	GO:0072604
GO:0032636	GO:0072605
GO:0032637	GO:0072606
GO:0032638	GO:0072607
GO:0032639	GO:0045553
GO:0032640	GO:1990774
GO:0032641	GO:0042109
GO:0032642	GO:0090196
GO:0032643	GO:0045420
GO:0032644	GO:0050752
GO:0032645	GO:0045423
GO:0032646	GO:0048176
GO:0032647	GO:1902739
GO:0032648	GO:0045357
GO:0032649	GO:1902713
GO:0032650	GO:0050721
GO:0032652	GO:0050704
GO:0032651	GO:0050722
GO:0032653	GO:2001179
GO:0032654	GO:0150169
GO:0032655	GO:2001182
GO:0032656	GO:2000665
GO:0032657	GO:0045369
GO:0032658	GO:0045372
GO:0032659	GO:0045375
GO:0032660	GO:1905076
GO:0032661	GO:0150120
GO:0032662	GO:0045384
GO:0032663	GO:1900040
GO:0032664	GO:0045387
GO:0032665	GO:0045390
GO:0032666	GO:0045393
GO:0032667	GO:0045396
GO:0032668	GO:0045528
GO:0032669	GO:0150148
GO:0032670	GO:0045530
GO:0032671	GO:0045531
GO:0032672	GO:0045399
GO:0032673	GO:0150133
GO:0032674	GO:2000662
GO:0032675	GO:0045408
GO:0032676	GO:0150112
GO:0032677	GO:2000482
GO:0032678	GO:0045417
GO:0032679	GO:0045554
GO:0032680	GO:1904467
GO:0032681	GO:0043016
GO:0032682	GO:0090198
GO:0032683	GO:0045421
GO:0032684	GO:0050753
GO:0032685	GO:0045424
GO:0032686	GO:0048178
GO:0032687	GO:1902740
GO:0032688	GO:0045358
GO:0032689	GO:1902714
GO:0032690	GO:0050723
GO:0032692	GO:0050711
GO:0032691	GO:0050724
GO:0032693	GO:2001180
GO:0032694	GO:0150170
GO:0032695	GO:2001183
GO:0032696	GO:2000666
GO:0032697	GO:0045370
GO:0032698	GO:0045373
GO:0032699	GO:0045376
GO:0032700	GO:1905077
GO:0032701	GO:0150121
GO:0032702	GO:0045385
GO:0032703	GO:1900041
GO:0032704	GO:0045388
GO:0032705	GO:0045391
GO:0032706	GO:0045394
GO:0032707	GO:0045397
GO:0032708	GO:0045532
GO:0032709	GO:0150149
GO:0032710	GO:0045534
GO:0032711	GO:0045535
GO:0032712	GO:0045400
GO:0032713	GO:0150134
GO:0032714	GO:2000663
GO:0032715	GO:1900165
GO:0032716	GO:0150113
GO:0032717	GO:2000483
GO:0032718	GO:0045418
GO:0032719	GO:0045555
GO:0032720	GO:1904468
GO:0032721	GO:0043018
GO:0032722	GO:0090197
GO:0032723	GO:0045422
GO:0032725	GO:0045425
GO:0032726	GO:0048177
GO:0032727	GO:1902741
GO:0032728	GO:0045359
GO:0032729	GO:1902715
GO:0032730	GO:0050726
GO:0032732	GO:0050716
GO:0032731	GO:0050725
GO:0032733	GO:2001181
GO:0032734	GO:0150171
GO:0032735	GO:2001184
GO:0032736	GO:2000667
GO:0032737	GO:0045371
GO:0032738	GO:0045374
GO:0032739	GO:0045377
GO:0032740	GO:1905078
GO:0032741	GO:0150122
GO:0032742	GO:0045386
GO:0032743	GO:1900042
GO:0032744	GO:0045389
GO:0032745	GO:0045392
GO:0032746	GO:0045395
GO:0032747	GO:0045398
GO:0032748	GO:0045536
GO:0032749	GO:0150150
GO:0032750	GO:0045538
GO:0032751	GO:0045539
GO:0032752	GO:0045401
GO:0032753	GO:0150135
GO:0032754	GO:2000664
GO:0032755	GO:2000778
GO:0032756	GO:0150114
GO:0032757	GO:2000484
GO:0032758	GO:0045419
GO:0032759	GO:0045556
GO:0032760	GO:1904469
GO:0032761	GO:0043017
GO:0051353	GO:0009391
GO:0032778	GO:0015632
GO:1903363	GO:2000599
GO:1903364	GO:2000600
GO:0032880	GO:1903827
GO:0071604	GO:0038044
GO:0071634	GO:2001201
GO:0071635	GO:2001202
GO:0071636	GO:2001203
GO:0032933	GO:0035104
GO:0032968	GO:0090040
GO:0034243	GO:0090039
GO:0032973	GO:0044746
GO:0033139	GO:1903261
GO:0033140	GO:1903262
GO:0033141	GO:1903263
GO:0033154	GO:0033155
GO:0033225	GO:0033224
GO:0033230	GO:0032519
GO:0033232	GO:1901243
GO:0033286	GO:0051471
GO:0033288	GO:0033287
GO:0033290	GO:0016283
GO:0033313	GO:0072411
GO:0033314	GO:0072459
GO:0044774	GO:1902403
GO:0033315	GO:0072440
GO:0033316	GO:0072465
GO:0044779	GO:1902398
GO:0033553	GO:1902377
GO:0033588	GO:0033589
GO:0140666	GO:0097617
GO:0044414	GO:0052261
GO:0052158	GO:0052297
GO:0052164	GO:0052567
GO:0033677	GO:0033680
GO:0033678	GO:0033682
GO:0033679	GO:0033681
GO:0033696	GO:0031454
GO:0033698	GO:0000508
GO:0033743	GO:0000318
GO:0033744	GO:0000317
GO:0033799	GO:0102437
GO:0033877	GO:0018728
GO:0033981	GO:0030928
GO:0034017	GO:0043832
GO:0043069	GO:0043072
GO:0052031	GO:0052255
GO:0052040	GO:0052152
GO:0052042	GO:0052400
GO:0052170	GO:0052309
GO:0034067	GO:0072600
GO:0034080	GO:0034509
GO:0051259	GO:0035786
GO:0034244	GO:0090041
GO:0034246	GO:0001144
GO:0034260	GO:1902881
GO:0043087	GO:0043088
GO:0051321	GO:0007126
GO:0043954	GO:0071956
GO:0034343	GO:0072644
GO:0061630	GO:1904822
GO:0034458	GO:0034459
GO:0042476	GO:0042477
GO:0051304	GO:0034500
GO:0034711	GO:0048187
GO:0034713	GO:0005120
GO:0034755	GO:1903874
GO:0034756	GO:1900390
GO:0034769	GO:0060881
GO:0060271	GO:0042384
GO:0035103	GO:0006992
GO:0035115	GO:0035117
GO:0035136	GO:0035140
GO:0035175	GO:0044021
GO:0035354	GO:0038125
GO:0035355	GO:0038126
GO:0035429	GO:0015725
GO:0035430	GO:0032893
GO:0035431	GO:0032894
GO:0035432	GO:0032895
GO:0035516	GO:0103053
GO:0035531	GO:0035535
GO:0035532	GO:0035536
GO:0035533	GO:0035537
GO:0035590	GO:0035587
GO:0140312	GO:0098748
GO:1904659	GO:0015758
GO:0044409	GO:0085028
GO:0048440	GO:0048429
GO:0042073	GO:0035734
GO:0043190	GO:0043192
GO:0035925	GO:0017091
GO:0035973	GO:0035972
GO:0036064	GO:0005932
GO:0046854	GO:0046837
GO:0036121	GO:0033676
GO:0036209	GO:0102609
GO:0052027	GO:0052250
GO:0036222	GO:0103024
GO:0036349	GO:0098611
GO:0036350	GO:0098612
GO:0072659	GO:0090002
GO:0036376	GO:0098667
GO:0044403	GO:0085031
GO:0036424	GO:0004647
GO:0038004	GO:0038005
GO:0052562	GO:0052561
GO:0052053	GO:0052056
GO:0052029	GO:0052493
GO:0039540	GO:0039538
GO:0039554	GO:0039539
GO:0039576	GO:0039515
GO:0039602	GO:0039601
GO:0044659	GO:0046756
GO:0039654	GO:0075517
GO:0046718	GO:0019063
GO:0075733	GO:0046796
GO:0039693	GO:0039681
GO:0039692	GO:0045090
GO:0046802	GO:0039676
GO:0046755	GO:0046744
GO:0042025	GO:0033649
GO:0040021	GO:0042005
GO:0042000	GO:0051808
GO:0044417	GO:0051836
GO:0042001	GO:0042002
GO:0042037	GO:0042260
GO:0042038	GO:0042261
GO:0042043	GO:0019963
GO:0042070	GO:0048127
GO:0042078	GO:0048131
GO:0042144	GO:0042145
GO:0042242	GO:0043775
GO:0042331	GO:0046953
GO:0042332	GO:0048062
GO:0042442	GO:0042449
GO:0042463	GO:0001749
GO:0046532	GO:0045673
GO:0046534	GO:0045675
GO:0042481	GO:0042484
GO:0042482	GO:0042485
GO:0042483	GO:0042486
GO:0042501	GO:0033136
GO:0046425	GO:2000364
GO:0042509	GO:0042528
GO:0042531	GO:0042529
GO:0042532	GO:0042530
GO:0046426	GO:2000365
GO:0042540	GO:0020029
GO:0042603	GO:0042604
GO:0042605	GO:0042607
GO:0042632	GO:2000189
GO:0042675	GO:0042674
GO:0042676	GO:0007466
GO:0042679	GO:0042678
GO:0042680	GO:0042677
GO:0042682	GO:0042681
GO:0042683	GO:0010000
GO:0042729	GO:0043926
GO:0052572	GO:0052564
GO:0042784	GO:0051811
GO:0042785	GO:0051812
GO:0042786	GO:0051813
GO:0042805	GO:0051406
GO:0042812	GO:0046614
GO:0042832	GO:0009818
GO:0042858	GO:0031184
GO:0042861	GO:0031182
GO:0042864	GO:0031188
GO:0042976	GO:0042977
GO:0046427	GO:2000366
GO:1903076	GO:1905963
GO:1903077	GO:1905964
GO:1903078	GO:1905965
GO:0043022	GO:0030376
GO:0043121	GO:0048405
GO:0043138	GO:0043140
GO:0043139	GO:0043141
GO:0043154	GO:0001719
GO:0043281	GO:0043026
GO:0043186	GO:0018994
GO:0043220	GO:0044287
GO:0043236	GO:0043239
GO:0043263	GO:1990296
GO:0043273	GO:0061748
GO:0043333	GO:0102005
GO:0043365	GO:0008862
GO:0043404	GO:0031636
GO:0043421	GO:0019259
GO:0043426	GO:0051579
GO:0051090	GO:2000823
GO:0061638	GO:1904834
GO:0043509	GO:0048181
GO:0043510	GO:0048182
GO:0043547	GO:0043089
GO:0043591	GO:0055030
GO:0043625	GO:0005659
GO:0043682	GO:0004008
GO:0044399	GO:0090608
GO:0043723	GO:0017173
GO:0043726	GO:0019173
GO:0043741	GO:0043869
GO:0043744	GO:0043868
GO:0043755	GO:0019175
GO:0043758	GO:0043762
GO:0043768	GO:0019138
GO:0043872	GO:0015497
GO:0052028	GO:0052526
GO:0043987	GO:0043986
GO:0044010	GO:0052000
GO:0052019	GO:0052186
GO:0044111	GO:0044152
GO:0044114	GO:0044124
GO:0051715	GO:0001901
GO:0044218	GO:0044279
GO:0044231	GO:0072556
GO:0044289	GO:0044285
GO:0044350	GO:1902540
GO:0044351	GO:1902538
GO:0044416	GO:0052510
GO:0044418	GO:0051837
GO:0044458	GO:1903887
GO:0051709	GO:0052459
GO:0044547	GO:0017033
GO:0044548	GO:0048155
GO:0044549	GO:0043106
GO:0046358	GO:0043439
GO:0044604	GO:0071992
GO:1901239	GO:1901549
GO:0051704	GO:0051706
GO:0051382	GO:0000069
GO:0044790	GO:1902187
GO:0044847	GO:0052099
GO:0052403	GO:0052405
GO:0044878	GO:1903820
GO:0044879	GO:1903822
GO:0045016	GO:1990614
GO:0045030	GO:0015065
GO:0045041	GO:0045044
GO:0045116	GO:0019943
GO:0046222	GO:0043391
GO:0045196	GO:0043342
GO:0045200	GO:0043343
GO:0045201	GO:0043344
GO:0045214	GO:0006938
GO:0045244	GO:0045245
GO:0045260	GO:0045256
GO:0045276	GO:0045286
GO:0045278	GO:0045288
GO:0045454	GO:0045868
GO:0045471	GO:0017036
GO:1905268	GO:1903309
GO:1905269	GO:1903310
GO:0045815	GO:0048096
GO:0045880	GO:0045878
GO:0046115	GO:0006160
GO:0046353	GO:0016991
GO:0046357	GO:0042872
GO:0046359	GO:0043440
GO:0046392	GO:0019582
GO:0046408	GO:0043787
GO:0046533	GO:0045674
GO:0046570	GO:0043809
GO:0046594	GO:0048122
GO:0046595	GO:0048121
GO:0052372	GO:0052371
GO:0075294	GO:0075295
GO:0046662	GO:0048042
GO:0046715	GO:0080138
GO:0046730	GO:0046735
GO:0046745	GO:0046770
GO:0046760	GO:0046763
GO:0046761	GO:0046767
GO:0046762	GO:0046764
GO:0046765	GO:0046749
GO:0046776	GO:0039591
GO:0046780	GO:0046781
GO:0046856	GO:0046840
GO:0046863	GO:0018236
GO:0051641	GO:1902580
GO:0046956	GO:0046954
GO:0046957	GO:0046955
GO:0047035	GO:0050327
GO:0047046	GO:0047984
GO:0047068	GO:0016947
GO:0047070	GO:0008669
GO:0047091	GO:0008739
GO:0047120	GO:0018514
GO:0047130	GO:0010010
GO:0047152	GO:1990087
GO:0047155	GO:0045447
GO:0047184	GO:0000507
GO:0047196	GO:0103095
GO:0047262	GO:0050375
GO:0047273	GO:0047226
GO:0047276	GO:0003946
GO:0047305	GO:0047314
GO:0047339	GO:0047340
GO:0047381	GO:0016294
GO:0047444	GO:0019007
GO:0047450	GO:0080063
GO:0047455	GO:0047523
GO:0047466	GO:0018840
GO:0047472	GO:0018842
GO:0047555	GO:0004116
GO:0047556	GO:0034913
GO:0047606	GO:0046991
GO:0047668	GO:0080080
GO:0047735	GO:0047737
GO:0047747	GO:0047477
GO:0047780	GO:0052632
GO:0047787	GO:0047752
GO:0047930	GO:0050443
GO:0048001	GO:0033724
GO:0048025	GO:0035056
GO:0048026	GO:0035057
GO:0048050	GO:0048051
GO:0048060	GO:0048063
GO:0048061	GO:0048064
GO:0048085	GO:0048068
GO:0048132	GO:0048141
GO:0048235	GO:0048234
GO:0048250	GO:1990925
GO:0048265	GO:0048267
GO:0048438	GO:0048413
GO:0048439	GO:0048411
GO:0048441	GO:0048417
GO:0048442	GO:0048421
GO:0048443	GO:0048425
GO:0048444	GO:0048434
GO:0048445	GO:0048430
GO:0048446	GO:0048418
GO:0048447	GO:0048422
GO:0048448	GO:0048426
GO:0048450	GO:0048435
GO:0048461	GO:0048412
GO:0048452	GO:0048420
GO:0048454	GO:0048424
GO:0048456	GO:0048428
GO:0048457	GO:0048414
GO:0048458	GO:0048415
GO:0048459	GO:0048416
GO:0048460	GO:0048410
GO:0048463	GO:0048432
GO:0048489	GO:0016181
GO:0048502	GO:0015619
GO:0048544	GO:0009857
GO:0048556	GO:0043074
GO:0048557	GO:0048558
GO:0048564	GO:0010251
GO:0048675	GO:0048676
GO:0048728	GO:0016349
GO:0048909	GO:0021734
GO:0048918	GO:0021733
GO:0050024	GO:0033733
GO:0050079	GO:0047607
GO:0050150	GO:0018790
GO:0050206	GO:0016770
GO:0050262	GO:0000816
GO:0050333	GO:0048253
GO:0050421	GO:0016666
GO:0050474	GO:0050475
GO:0050488	GO:0050489
GO:0050515	GO:0008698
GO:0050518	GO:0008699
GO:0050524	GO:0018552
GO:0050563	GO:0106287
GO:0050567	GO:0017068
GO:0050587	GO:0030065
GO:0050589	GO:0045432
GO:0050599	GO:0045441
GO:0050611	GO:0018691
GO:0050613	GO:0000251
GO:0050625	GO:0018540
GO:0050632	GO:0004770
GO:0050640	GO:0045440
GO:0050910	GO:0055128
GO:0051083	GO:0006444
GO:0051085	GO:0070389
GO:0051131	GO:0034619
GO:0051157	GO:0019591
GO:0051225	GO:0051227
GO:0051287	GO:0051288
GO:0051315	GO:0051314
GO:0051316	GO:0051317
GO:0051393	GO:0051372
GO:0051373	GO:0051376
GO:0051424	GO:0017047
GO:0051429	GO:0031742
GO:0051430	GO:0031743
GO:0051431	GO:0031744
GO:0051469	GO:0042146
GO:0051525	GO:0051530
GO:0051598	GO:0072462
GO:0051664	GO:0031081
GO:0051710	GO:0001902
GO:0051711	GO:0052490
GO:0051712	GO:0052529
GO:0051713	GO:0001903
GO:0051714	GO:0001904
GO:0051724	GO:1901368
GO:0051728	GO:0042061
GO:0051750	GO:0008416
GO:0051767	GO:0051768
GO:0051769	GO:0051772
GO:0051770	GO:0051773
GO:0051771	GO:0051774
GO:0051819	GO:0051820
GO:0051873	GO:0051852
GO:0051866	GO:0051868
GO:0098712	GO:1990123
GO:0052003	GO:0052253
GO:0052081	GO:0052445
GO:0052089	GO:0052284
GO:0052005	GO:0052268
GO:0052084	GO:0052441
GO:0052021	GO:0052449
GO:0052022	GO:0052456
GO:0052023	GO:0052469
GO:0052024	GO:0052513
GO:0052032	GO:0052256
GO:0052034	GO:0052258
GO:0052035	GO:0052259
GO:0052036	GO:0052260
GO:0052039	GO:0044054
GO:0052062	GO:0052262
GO:0052559	GO:0052558
GO:0052063	GO:0052347
GO:0052064	GO:0052369
GO:0052067	GO:0052483
GO:0052072	GO:0052270
GO:0052074	GO:0052272
GO:0052075	GO:0052273
GO:0052076	GO:0052274
GO:0052078	GO:0052275
GO:0052080	GO:0052277
GO:0052079	GO:0052276
GO:0052083	GO:0052278
GO:0052155	GO:0052294
GO:0052085	GO:0052280
GO:0052156	GO:0052295
GO:0052086	GO:0052281
GO:0052154	GO:0052293
GO:0052088	GO:0052443
GO:0052102	GO:0052287
GO:0052103	GO:0052533
GO:0052159	GO:0052298
GO:0052390	GO:0052382
GO:0052104	GO:0052537
GO:0052160	GO:0052299
GO:0052151	GO:0052030
GO:0052553	GO:0052552
GO:0052162	GO:0052301
GO:0052163	GO:0052565
GO:0052165	GO:0052566
GO:0052167	GO:0052306
GO:0052168	GO:0052307
GO:0052344	GO:0052329
GO:0052381	GO:0004811
GO:0052391	GO:0052389
GO:0052422	GO:0052428
GO:0052621	GO:0043789
GO:0052662	GO:0052663
GO:0052668	GO:0052669
GO:0052720	GO:0140079
GO:0052917	GO:0052824
GO:0052933	GO:0052932
GO:0052934	GO:0052936
GO:0055013	GO:0048739
GO:0071404	GO:0055098
GO:0071403	GO:0055099
GO:0060072	GO:0022895
GO:0060087	GO:1905659
GO:0060242	GO:0060248
GO:0060256	GO:1900455
GO:0060257	GO:1901134
GO:1905532	GO:1903128
GO:1905533	GO:1903129
GO:0060359	GO:1903717
GO:0071242	GO:1903718
GO:0060390	GO:0007184
GO:0060625	GO:0060626
GO:0060828	GO:0035412
GO:0090090	GO:0035414
GO:0061163	GO:0061167
GO:0061320	GO:0007513
GO:0061321	GO:0007514
GO:0061507	GO:0098546
GO:1902440	GO:1990975
GO:0061513	GO:0008524
GO:0061575	GO:0016535
GO:0061677	GO:0043725
GO:0061709	GO:1990766
GO:0061995	GO:0061994
GO:0062101	GO:0004597
GO:0062205	GO:0102353
GO:0070054	GO:0061012
GO:0070266	GO:0060555
GO:0070631	GO:1990944
GO:0070753	GO:0072626
GO:0070754	GO:0070750
GO:0070755	GO:0070751
GO:0070756	GO:0070752
GO:0070778	GO:0089712
GO:0070779	GO:0140016
GO:0089718	GO:1902837
GO:0070816	GO:0016245
GO:0070840	GO:0045502
GO:0070884	GO:0051532
GO:0070885	GO:0051534
GO:0070886	GO:0051533
GO:0070898	GO:0001043
GO:0071142	GO:0071143
GO:0071144	GO:0071146
GO:0071163	GO:1902316
GO:1902170	GO:1990106
GO:0071578	GO:0140160
GO:0071805	GO:0010163
GO:0071896	GO:1904696
GO:0098655	GO:0099132
GO:0071986	GO:0034449
GO:0072070	GO:0072018
GO:0072023	GO:0072026
GO:0072086	GO:0072083
GO:0072322	GO:0072323
GO:0072334	GO:0015785
GO:0090263	GO:0035413
GO:0072396	GO:0072408
GO:0072398	GO:0072419
GO:0072399	GO:0072420
GO:0072414	GO:0072473
GO:0072435	GO:0072458
GO:0072444	GO:0072447
GO:0072479	GO:0044811
GO:0072488	GO:0015696
GO:0072517	GO:0072516
GO:0072627	GO:0072628
GO:0072629	GO:0072630
GO:0072631	GO:0072632
GO:0072633	GO:0072634
GO:0072635	GO:0072636
GO:0072637	GO:0150188
GO:0072639	GO:0150126
GO:0072645	GO:0072646
GO:0072647	GO:0072648
GO:0072649	GO:0072650
GO:0072651	GO:0072652
GO:0072653	GO:0072654
GO:0072690	GO:0062178
GO:0098653	GO:0098587
GO:0075053	GO:0075057
GO:0075054	GO:0075058
GO:0075055	GO:0075059
GO:0075118	GO:0075127
GO:0075119	GO:0075128
GO:0075120	GO:0075129
GO:1904359	GO:0075006
GO:1904361	GO:0075007
GO:1904360	GO:0075008
GO:0075325	GO:0075327
GO:0075502	GO:0075518
GO:0075512	GO:0075516
GO:0075713	GO:0019047
GO:0080185	GO:0052527
GO:0085017	GO:0052370
GO:0090155	GO:0090157
GO:1901976	GO:2001047
GO:1901978	GO:2001052
GO:1901977	GO:2001048
GO:0090248	GO:0090247
GO:0090513	GO:0090457
GO:0090517	GO:0090456
GO:0090518	GO:0090458
GO:1903826	GO:1903400
GO:0090606	GO:0032022
GO:0090630	GO:0032864
GO:0090729	GO:0050827
GO:0097009	GO:2000507
GO:0097087	GO:0150154
GO:1990009	GO:0046674
GO:0097623	GO:0098668
GO:0097638	GO:1902765
GO:0097639	GO:1903410
GO:0097640	GO:1903411
GO:0097730	GO:0031513
GO:0098702	GO:0061488
GO:0098703	GO:1990035
GO:0098704	GO:0097319
GO:0098705	GO:1902861
GO:0098706	GO:0097461
GO:0098708	GO:1990821
GO:0098709	GO:0036347
GO:0098710	GO:0061489
GO:0098711	GO:0098707
GO:0098713	GO:1990122
GO:0098714	GO:0097405
GO:0098715	GO:0097406
GO:0098716	GO:0090509
GO:0098717	GO:1901688
GO:0098718	GO:0061491
GO:0098719	GO:1990118
GO:0098720	GO:0097404
GO:0098721	GO:1902431
GO:0098855	GO:1990759
GO:0098874	GO:0099603
GO:0099115	GO:1990707
GO:0099621	GO:0103019
GO:0101006	GO:0008969
GO:0102025	GO:0032146
GO:0102059	GO:0102192
GO:0102194	GO:0030387
GO:0102205	GO:0051505
GO:0103012	GO:0030385
GO:0103118	GO:0043764
GO:0106006	GO:0140362
GO:0106157	GO:0140554
GO:0106223	GO:0102260
GO:0106260	GO:0140564
GO:0120017	GO:0035620
GO:0120020	GO:0017127
GO:0120022	GO:0120024
GO:0120306	GO:1904805
GO:0140319	GO:0005040
GO:0140326	GO:0008557
GO:0140338	GO:0010175
GO:0140429	GO:1990598
GO:0140469	GO:0060733
GO:1990608	GO:0071789
GO:0140552	GO:0071151
GO:0140658	GO:0070615
GO:0150127	GO:0150130
GO:0150128	GO:0150131
GO:0150129	GO:0150132
GO:0150157	GO:0150160
GO:0150158	GO:0150161
GO:0150159	GO:0150162
GO:0150189	GO:0150192
GO:0150190	GO:0150193
GO:0150191	GO:0150194
GO:1900400	GO:1900393
GO:1900424	GO:1902477
GO:1900735	GO:1900479
GO:1901096	GO:1902452
GO:1901097	GO:1902453
GO:1901098	GO:1902454
GO:1901170	GO:0018931
GO:1901222	GO:0042348
GO:1901223	GO:0042347
GO:1901224	GO:0042346
GO:1901238	GO:1901237
GO:1901422	GO:1990336
GO:1902778	GO:1990373
GO:1901694	GO:0046675
GO:1902047	GO:1905122
GO:1902147	GO:1902149
GO:1902148	GO:1902150
GO:1902300	GO:0042871
GO:1902301	GO:0042877
GO:1902441	GO:1990954
GO:1902599	GO:0015906
GO:1902657	GO:1902658
GO:1902665	GO:1990337
GO:1902696	GO:1990293
GO:1902697	GO:1990292
GO:1902698	GO:1990288
GO:1902699	GO:1990289
GO:1902700	GO:1990290
GO:1902701	GO:1990291
GO:1902702	GO:1990283
GO:1902703	GO:1990284
GO:1902704	GO:1990285
GO:1902706	GO:1990286
GO:1902758	GO:0061600
GO:1902760	GO:0061601
GO:1902906	GO:1990237
GO:1902974	GO:0072691
GO:1902981	GO:1903458
GO:1903213	GO:1990152
GO:1903276	GO:1903273
GO:1903277	GO:1903274
GO:1903278	GO:1903275
GO:1903361	GO:0061467
GO:1990173	GO:0032066
GO:1903692	GO:0044690
GO:1903764	GO:1902302
GO:1903765	GO:1902303
GO:1903766	GO:1902304
GO:1903801	GO:0060356
GO:1903803	GO:0036229
GO:1903804	GO:0036233
GO:1903805	GO:0090468
GO:1903806	GO:0090477
GO:1903807	GO:0036231
GO:1903808	GO:0036232
GO:1903810	GO:0090466
GO:1903811	GO:0090469
GO:1903988	GO:1903414
GO:1904047	GO:0070283
GO:1904271	GO:1903809
GO:1905647	GO:1902825
GO:1904438	GO:1903989
GO:1904439	GO:1903990
GO:1904440	GO:1903991
GO:1904666	GO:1903834
GO:1904667	GO:1904190
GO:1904668	GO:1903835
GO:1904679	GO:0097357
GO:1904967	GO:0090699
GO:1905008	GO:0010805
GO:1905009	GO:0010806
GO:1905011	GO:0007037
GO:1905135	GO:1901689
GO:1905136	GO:1901690
GO:1905515	GO:0035058
GO:1905534	GO:1903130
GO:1905541	GO:1902826
GO:1905542	GO:1902827
GO:1905544	GO:1903813
GO:1905589	GO:1902828
GO:1905774	GO:1902449
GO:1905775	GO:1902450
GO:1905776	GO:1902451
GO:1990003	GO:0090450
GO:1990079	GO:1902096
GO:1990300	GO:1990301
GO:1990316	GO:0070969
GO:1990505	GO:1990510
GO:1990429	GO:1990415
GO:1990477	GO:1990345
GO:1990550	GO:1990552
GO:1990569	GO:0015788
GO:1990570	GO:0015784
GO:1990573	GO:0010107
GO:1990575	GO:0000066
GO:1990757	GO:0061636
GO:1990942	GO:1905185
GO:1990948	GO:0090645
GO:2000341	GO:1904207
GO:2000342	GO:1904208
GO:2000343	GO:1904209
