,2,3,5,6,10,20,40,50,100,200
3,0.45314527,0.35427567,0.28768453,0.2701259,0.23415202,0.20075989,0.18161385,0.17731437,0.16755463,0.1615835
5,0.37809417,0.2978121,0.24838729,0.23413356,0.1930498,0.1556295,0.13634495,0.13192883,0.121468395,0.11550511
6,0.38423827,0.3036517,0.26982224,0.25272682,0.19896209,0.15934105,0.14067918,0.13743864,0.12579435,0.119528286
7,0.3580179,0.2873075,0.25450423,0.23850684,0.20648605,0.16673593,0.14376421,0.14014699,0.13014442,0.12367011
8,0.35325614,0.28062811,0.2228644,0.22005697,0.17741635,0.14060418,0.12533978,0.11686116,0.110446736,0.101191536
9,0.33678544,0.27182955,0.22272094,0.21258761,0.1729694,0.13450927,0.120683245,0.1156741,0.10587257,0.100004084
10,0.3440198,0.25936267,0.221083,0.20204407,0.17285557,0.1355493,0.121730864,0.111754864,0.107035786,0.09810866
11,0.34967875,0.25769433,0.21466836,0.20093058,0.16976051,0.13450174,0.11448048,0.11159923,0.10078395,0.09724738
12,0.34613124,0.26122957,0.21046692,0.20084271,0.1655667,0.13385038,0.11653728,0.11166017,0.10268599,0.09570118
13,0.3388411,0.2525998,0.20922367,0.1940142,0.16287097,0.13345182,0.11480954,0.11240108,0.102440126,0.0974214
14,0.3334591,0.2530041,0.20069124,0.19643006,0.16401239,0.13284247,0.11293055,0.10589157,0.09899535,0.09612331
15,0.33485717,0.2497119,0.19895068,0.19025308,0.15921086,0.13041493,0.112656236,0.10768737,0.09731086,0.09484844
16,0.3377972,0.2469836,0.201232,0.19216283,0.16207264,0.12970786,0.11135359,0.110104226,0.09911947,0.0943792
17,0.33535022,0.2513233,0.20137864,0.1889009,0.15625861,0.13139006,0.114096306,0.10906196,0.09609998,0.090028495
18,0.33362406,0.25026357,0.20455676,0.1884771,0.16078727,0.1301026,0.11326636,0.10329876,0.097365856,0.09146515
19,0.3351162,0.24783587,0.20223075,0.18197682,0.15652499,0.12944454,0.11131957,0.102038376,0.09731905,0.09250696
20,0.3284735,0.24549638,0.19851758,0.17872375,0.15511566,0.12403751,0.10650233,0.10329135,0.09266524,0.091300935
