-------------------------------------------------------------------------------
Test set: RestAssuredTest
-------------------------------------------------------------------------------
Tests run: 2, Failures: 0, Errors: 0, Skipped: 0, Time elapsed: 4.751 sec
