{
  "appId": "com.allabroad",
  "appName": "all-abroad",
  "bundledWebRuntime": false,
  "npmClient": "npm",
  "webDir": "build",
  "plugins": {
    "SplashScreen": {
      "launchShowDuration": 0
    },
    "GoogleAuth": {
      "scopes": ["profile", "email"],
      "serverClientId": "487454157894-hn2k9cagbbirbl6pf1gbmp56111aau1c.apps.googleusercontent.com",
      "forceCodeForRefreshToken" : true
    }
  },
  "cordova": {}
}
