{
    "fields": [
        {
            "name": "TITRE",
            "type": "integer",
            "format": "default",
            "description": "Titre LPP",
            "length": "1",
            "nomenclature": "openlpp_TITRE",
            "dateCreated": "",
            "dateDeleted": "",
            "dateMissing": "",
            "observation": "",
            "regle_gestion": "",
            "type_oracle": "number"
        },
        {
            "name": "sc1",
            "type": "integer",
            "format": "default",
            "description": "Sous-Chapitre Niveau 1",
            "length": "3",
            "nomenclature": "openlpp_sc1",
            "dateCreated": "",
            "dateDeleted": "",
            "dateMissing": "",
            "observation": "",
            "regle_gestion": "",
            "type_oracle": "number"
        },
        {
            "name": "sc2",
            "type": "integer",
            "format": "default",
            "description": "Sous-Chapitre Niveau 2",
            "length": "5",
            "nomenclature": "openlpp_sc2",
            "dateCreated": "",
            "dateDeleted": "",
            "dateMissing": "",
            "observation": "",
            "regle_gestion": "",
            "type_oracle": "number"
        },
        {
            "name": "CODE_LPP",
            "type": "integer",
            "format": "default",
            "description": "Code fin LPP",
            "length": "7",
            "nomenclature": "openlpp_CODE_LPP",
            "dateCreated": "",
            "dateDeleted": "",
            "dateMissing": "",
            "observation": "",
            "regle_gestion": "",
            "type_oracle": "number"
        },
        {
            "name": "AGE",
            "type": "integer",
            "format": "default",
            "description": "Age au moment des soins",
            "length": "2",
            "nomenclature": "openlpp_AGE_BEN",
            "dateCreated": "",
            "dateDeleted": "",
            "dateMissing": "",
            "observation": "",
            "regle_gestion": "",
            "type_oracle": "number"
        },
        {
            "name": "SEXE",
            "type": "integer",
            "format": "default",
            "description": "Sexe",
            "length": "1",
            "nomenclature": "IR_SEX_V",
            "dateCreated": "",
            "dateDeleted": "",
            "dateMissing": "",
            "observation": "",
            "regle_gestion": "",
            "type_oracle": "number"
        },
        {
            "name": "BEN_REG",
            "type": "integer",
            "format": "default",
            "description": "région de résidence du bénéficiaire",
            "length": "2",
            "nomenclature": "BEN_RES_REG",
            "dateCreated": "",
            "dateDeleted": "",
            "dateMissing": "",
            "observation": "",
            "regle_gestion": "",
            "type_oracle": "number"
        },
        {
            "name": "PSP_SPE",
            "type": "integer",
            "format": "default",
            "description": "Prescripteur",
            "length": "2",
            "nomenclature": "PSP_SPE_SNDS",
            "dateCreated": "",
            "dateDeleted": "",
            "dateMissing": "",
            "observation": "",
            "regle_gestion": "",
            "type_oracle": "number"
        },
        {
            "name": "QTE",
            "type": "integer",
            "format": "default",
            "description": "Quantité Remboursée",
            "length": "7",
            "nomenclature": "-",
            "dateCreated": "",
            "dateDeleted": "",
            "dateMissing": "",
            "observation": "",
            "regle_gestion": "",
            "type_oracle": "number"
        },
        {
            "name": "REM",
            "type": "number",
            "format": "default",
            "description": "Montant Remboursé",
            "length": "8,2",
            "nomenclature": "-",
            "dateCreated": "",
            "dateDeleted": "",
            "dateMissing": "",
            "observation": "",
            "regle_gestion": "",
            "type_oracle": "number"
        },
        {
            "name": "BSE",
            "type": "number",
            "format": "default",
            "description": "Base de Remboursement",
            "length": "8,2",
            "nomenclature": "-",
            "dateCreated": "",
            "dateDeleted": "",
            "dateMissing": "",
            "observation": "",
            "regle_gestion": "",
            "type_oracle": "number"
        },
        {
            "name": "year",
            "type": "integer",
            "format": "default",
            "description": "Année de soin",
            "length": "4",
            "nomenclature": "-",
            "dateCreated": "",
            "dateDeleted": "",
            "dateMissing": "",
            "observation": "",
            "regle_gestion": "",
            "type_oracle": "number"
        }
    ],
    "missingValues": [
        ""
    ],
    "name": "OPEN_LPP",
    "title": "OPEN LPP (base complète sur les dépenses de dispositifs médicaux inscrits à la liste de produits et prestations (LPP)  interrégimes)",
    "produit": "OPENLPP",
    "history": {
        "dateCreated": "2014",
        "dateDeleted": "",
        "dateMissing": []
    },
    "champ": "",
    "observation": ""
}