<?xml version="1.0" encoding="utf-8"?>
<!-- Generator: Adobe Illustrator 16.0.0, SVG Export Plug-In . SVG Version: 6.00 Build 0)  -->
<!DOCTYPE svg PUBLIC "-//W3C//DTD SVG 1.1//EN" "http://www.w3.org/Graphics/SVG/1.1/DTD/svg11.dtd">
<svg version="1.1" id="Malette" xmlns="http://www.w3.org/2000/svg" xmlns:xlink="http://www.w3.org/1999/xlink" x="0px" y="0px"
	 width="181px" height="170px" viewBox="0 0 181 170" enable-background="new 0 0 181 170" xml:space="preserve">
<path fill="none" stroke="#727373" stroke-width="9" stroke-miterlimit="10" d="M159,142.999c0,6.075-4.925,11-11,11H33.333
	c-6.075,0-11-4.925-11-11V63c0-6.075,4.925-11,11-11H148c6.075,0,11,4.925,11,11V142.999z"/>
<path fill="none" stroke="#727373" stroke-width="9" stroke-miterlimit="10" d="M47.666,33.333c0,0,44.667-38.667,88.667,1.333"/>
<line fill="none" stroke="#727373" stroke-width="9" stroke-miterlimit="10" x1="21" y1="89.999" x2="160.333" y2="89.999"/>
<path fill="none" stroke="#727373" stroke-width="9" stroke-miterlimit="10" d="M116.666,91.298
	c0,11.436-10.896,20.705-24.333,20.705c-13.436,0-24.333-9.27-24.333-20.705c0-0.207,0.007-0.424,0.014-0.631h48.64
	C116.66,90.874,116.666,91.091,116.666,91.298z"/>
</svg>
