{
  "plugins": [
    {
      "pluginPath": "./../plugins/binary/libExample.so",
      "configPath": "./../config/example.json",
      "inputFragments": {
        "preprocessing": [],
        "cycle": [],
        "postprocessing": []
      },
      "outputFragments": {
        "preprocessing": [],
        "cycle": [],
        "postprocessing": []
      }
    },
    {
      "pluginPath": "./../plugins/binary/libBcl2FastQ.so",
      "configPath": "./../config/bcl2FastQ.json",
      "inputFragments": {
        "cycle" : [
          {
            "name": "ReadPositionFragment",
            "type" :  "POSITION"}
        ],
        "postprocessing" : [
          { "name": "ReadPositionFragment",
            "type" : "POSITION" }
        ]
      },
      "outputFragments": {}
    },
    {
      "pluginPath": "./../plugins/binary/libReadPositionParser.so",
      "configPath": "./../config/readPositionParser.json",
      "inputFragments": {},
      "outputFragments": {
        "preprocessing": [
          {
            "name": "ReadPositionFragment",
            "type": "POSITION"
          }
        ]
      }
    },
    {
      "pluginPath": "./../plugins/binary/libHiLive_BuildIndex.so",
      "configPath": "./../config/hilive_build.json",
      "inputFragments": {},
      "outputFragments": {
        "preprocessing": [
          {
            "name": "index",
            "type": "FMIndex"
          }
        ]
      }
    },
    {
      "pluginPath": "./../plugins/binary/libHilive_Alignment.so",
      "configPath": "./../config/hilive.json",
      "inputFragments": {
        "preprocessing": [
          {
            "name": "index",
            "type": "FMIndex"
          }
        ],
        "cycle": [
          {
            "name": "index",
            "type": "FMIndex"
          }
        ]
      },
      "outputFragments": {}
    }
  ],

  "ramSize": 500,
  "numThreads": 2,
  "BaseCallsDirectory": "../tutorial/BaseCalls",
  "RunInfoPath": "../tutorial/RunInfo.xml",
  "SampleSheetPath": "../tests/mockFiles/Run/SampleSheet.csv",
  "BclParserType": "BclParser",
  "SerializableFactoryPath": "../plugins/binary/libSerializableFactory.so",
  "tiles": "1101",
  "barcodeErrors": "0, 0"
}
