<svg width="8" height="13" viewBox="0 0 8 13" fill="none" xmlns="http://www.w3.org/2000/svg">
<path fill-rule="evenodd" clip-rule="evenodd" d="M1.49236 0.492425L0.18739 1.89435L4.47537 6.50369L0.18739 11.1101L1.49236 12.5133L7.08543 6.50369L1.49236 0.492425Z" fill="#BBBBBB"/>
</svg>
