[
    {
        "id": 1,
        "name": "Agumon",
        "type": [
            { "name": "Vacuna", "strongAgainst": "Bestia", "weakAgainst": "Mamífero" }
        ],
        "img": "https://i.pinimg.com/564x/b9/2f/38/b92f3877ccd0ee9749269d5e72ad6832.jpg"
    },
    {
        "id": 2,
        "name": "Gatomon",
        "type": [
            { "name": "Vacuna", "strongAgainst": "Mamífero", "weakAgainst": "Bestia" }
        ],
        "img": "https://vignette.wikia.nocookie.net/tu-digimon/images/e/e4/Gatomon.gif/revision/latest/scale-to-width-down/300?cb=20130127193244&path-prefix=es"
    },
    {
        "id": 3,
        "name": "Tailmon",
        "type": [
            { "name": "Bestia", "strongAgainst": "Vacuna", "weakAgainst": "Bestia" }
        ],
        "img": "https://static.wikia.nocookie.net/digimon/images/9/95/Tailmon.jpg/revision/latest/scale-to-width-down/200?cb=20130524103411&path-prefix=es"
    },
    {
        "id": 4,
        "name": "Elecmon",
        "type": [
            { "name": "Mamífero", "strongAgainst": "Bestia", "weakAgainst": "Vacuna" }
        ],
        "img": "https://static.wikia.nocookie.net/digimon/images/9/91/Elecmon_b.jpg/revision/latest?cb=20200514174445&path-prefix=es"
    }
]
