a.  
    1. std::cout << "Enter two numbers\n";

    2. std::cout << "Enter ";
       std::cout << "two ";
       atd::cout << "numbers\n";   
b.
    c = a * b;
c.
    1. /// Program performs a payroll calculation

    2. /* ........
          Program performs a payroll calculation
          .........
       */
d.
   int a, b, c;
   1. std::cin >> a >> b >> c;
   2. std::cin >> a;
      std::cin >> b;
      std::cin >> c;
