question of the exercise!!!: Which of the following C++ statements contain variables whose values are replaced?

a. cin >> b >> c >> d >> e >> f;
b. p = i + j + k + 7;
c. cout << "variables whose values are replaced";
d. cout << "a = 5";

answer!!!: a), b)
