a)
    if(8 == y) {
        if(5 == x) {
            std::cout << "@@@@@" << std::endl;
        } else {
            std::cout << "#####" << std::endl;
        }
        std::cout << "$$$$$" << std::endl;
        std::cout << "&&&&&" << std::endl;
    }
    
        x = 5; y = 8;
    
                 @@@@@
                 $$$$$
                 &&&&&
                 
                 
b)
    if(8 == y) {
        if(5 == x) {
            std::cout << "@@@@@" << std::endl;
        } else {
            std::cout << "#####" << std::endl;
            std::cout << "$$$$$" << std::endl;
            std::cout << "&&&&&" << std::endl;
        }
    }
      x = 5; y = 8;
                    @@@@@
                    
                    
c)
     if(8 == y) {
        if(5 == x) {
            std::cout << "@@@@@" << std::endl;
        } else {
            std::cout << "#####" << std::endl;
            std::cout << "$$$$$" << std::endl;
        }
        std::cout << "&&&&&" << std::endl;
    }
    
        x = 5; y = 8;
    
                    @@@@@
                    &&&&&
                    
       
d)
    if(8 == y) {
        if(5 == x) {
            std::cout << "@@@@@" << std::endl;
        }
    } else {
        std::cout << "#####" << std::endl;
        std::cout << "$$$$$" << std::endl;
        std::cout << "&&&&&" << std::endl;
    }
    
         x = 5; y = 7;
         
                #####
                $$$$$
                &&&&&
