<?xml version="1.0" encoding="UTF-8" standalone="no"?>
<!-- Created with Inkscape (http://www.inkscape.org/) -->

<svg
   xmlns:dc="http://purl.org/dc/elements/1.1/"
   xmlns:cc="http://creativecommons.org/ns#"
   xmlns:rdf="http://www.w3.org/1999/02/22-rdf-syntax-ns#"
   xmlns:svg="http://www.w3.org/2000/svg"
   xmlns="http://www.w3.org/2000/svg"
   xmlns:sodipodi="http://sodipodi.sourceforge.net/DTD/sodipodi-0.dtd"
   xmlns:inkscape="http://www.inkscape.org/namespaces/inkscape"
   width="21cm"
   height="29.700001cm"
   viewBox="0 0 744.09449 1052.3622"
   id="svg9096"
   version="1.1"
   inkscape:version="0.91 r13725"
   sodipodi:docname="tarjetas_componentes_rede.svg">
  <defs
     id="defs9098" />
  <sodipodi:namedview
     id="base"
     pagecolor="#ffffff"
     bordercolor="#666666"
     borderopacity="1.0"
     inkscape:pageopacity="0.0"
     inkscape:pageshadow="2"
     inkscape:zoom="0.94"
     inkscape:cx="400.79936"
     inkscape:cy="298.17206"
     inkscape:document-units="cm"
     inkscape:current-layer="layer1"
     showgrid="false"
     showguides="true"
     inkscape:guide-bbox="true"
     units="cm"
     inkscape:window-width="1215"
     inkscape:window-height="776"
     inkscape:window-x="65"
     inkscape:window-y="24"
     inkscape:window-maximized="1">
    <sodipodi:guide
       position="372.04725,984.57053"
       orientation="1,0"
       id="guide13590"
       inkscape:label=""
       inkscape:color="rgb(0,0,255)" />
    <sodipodi:guide
       position="377.96309,526.18111"
       orientation="0,1"
       id="guide13592"
       inkscape:label=""
       inkscape:color="rgb(0,0,255)" />
  </sodipodi:namedview>
  <metadata
     id="metadata9101">
    <rdf:RDF>
      <cc:Work
         rdf:about="">
        <dc:format>image/svg+xml</dc:format>
        <dc:type
           rdf:resource="http://purl.org/dc/dcmitype/StillImage" />
        <dc:title></dc:title>
      </cc:Work>
    </rdf:RDF>
  </metadata>
  <g
     inkscape:label="Capa 1"
     inkscape:groupmode="layer"
     id="layer1">
    <text
       sodipodi:linespacing="125%"
       id="text13594"
       y="81.50843"
       x="431.29517"
       style="font-style:normal;font-weight:normal;font-size:40px;line-height:125%;font-family:sans-serif;letter-spacing:0px;word-spacing:0px;fill:#000000;fill-opacity:1;stroke:none;stroke-width:1px;stroke-linecap:butt;stroke-linejoin:miter;stroke-opacity:1"
       xml:space="preserve"><tspan
         y="81.50843"
         x="431.29517"
         id="tspan13596"
         sodipodi:role="line"
         style="font-style:normal;font-variant:normal;font-weight:normal;font-stretch:normal;font-size:50px;font-family:Armata;-inkscape-font-specification:Armata">Servidora</tspan></text>
    <text
       xml:space="preserve"
       style="font-style:normal;font-weight:normal;font-size:40px;line-height:125%;font-family:sans-serif;letter-spacing:0px;word-spacing:0px;fill:#000000;fill-opacity:1;stroke:none;stroke-width:1px;stroke-linecap:butt;stroke-linejoin:miter;stroke-opacity:1"
       x="68.517647"
       y="773.42157"
       id="text13598"
       sodipodi:linespacing="125%"><tspan
         sodipodi:role="line"
         id="tspan13600"
         x="68.517647"
         y="773.42157">LAN</tspan></text>
    <text
       sodipodi:linespacing="125%"
       id="text13602"
       y="796.4436"
       x="517.44824"
       style="font-style:normal;font-weight:normal;font-size:40px;line-height:125%;font-family:sans-serif;letter-spacing:0px;word-spacing:0px;fill:#000000;fill-opacity:1;stroke:none;stroke-width:1px;stroke-linecap:butt;stroke-linejoin:miter;stroke-opacity:1"
       xml:space="preserve"><tspan
         y="796.4436"
         x="517.44824"
         id="tspan13604"
         sodipodi:role="line">ad-hoc</tspan></text>
    <text
       sodipodi:linespacing="125%"
       id="text13606"
       y="1153.2859"
       x="35.62896"
       style="font-style:normal;font-weight:normal;font-size:40px;line-height:125%;font-family:sans-serif;letter-spacing:0px;word-spacing:0px;fill:#000000;fill-opacity:1;stroke:none;stroke-width:1px;stroke-linecap:butt;stroke-linejoin:miter;stroke-opacity:1"
       xml:space="preserve"><tspan
         y="1153.2859"
         x="35.62896"
         id="tspan13608"
         sodipodi:role="line">rede autonoma</tspan></text>
    <text
       xml:space="preserve"
       style="font-style:normal;font-weight:normal;font-size:40px;line-height:125%;font-family:sans-serif;letter-spacing:0px;word-spacing:0px;fill:#000000;fill-opacity:1;stroke:none;stroke-width:1px;stroke-linecap:butt;stroke-linejoin:miter;stroke-opacity:1"
       x="477.98181"
       y="1166.4414"
       id="text13610"
       sodipodi:linespacing="125%"><tspan
         sodipodi:role="line"
         id="tspan13612"
         x="477.98181"
         y="1166.4414">red mesh</tspan></text>
    <text
       sodipodi:linespacing="125%"
       id="text13614"
       y="1154.9304"
       x="793.7132"
       style="font-style:normal;font-weight:normal;font-size:40px;line-height:125%;font-family:sans-serif;letter-spacing:0px;word-spacing:0px;fill:#000000;fill-opacity:1;stroke:none;stroke-width:1px;stroke-linecap:butt;stroke-linejoin:miter;stroke-opacity:1"
       xml:space="preserve"><tspan
         y="1154.9304"
         x="793.7132"
         id="tspan13616"
         sodipodi:role="line">hardware</tspan></text>
    <text
       xml:space="preserve"
       style="font-style:normal;font-weight:normal;font-size:40px;line-height:125%;font-family:sans-serif;letter-spacing:0px;word-spacing:0px;fill:#000000;fill-opacity:1;stroke:none;stroke-width:1px;stroke-linecap:butt;stroke-linejoin:miter;stroke-opacity:1"
       x="902.79449"
       y="1007.9625"
       id="text13618"
       sodipodi:linespacing="125%"><tspan
         sodipodi:role="line"
         id="tspan13620"
         x="902.79449"
         y="1007.9625">firmware</tspan></text>
    <text
       xml:space="preserve"
       style="font-style:normal;font-weight:normal;font-size:40px;line-height:125%;font-family:sans-serif;letter-spacing:0px;word-spacing:0px;fill:#000000;fill-opacity:1;stroke:none;stroke-width:1px;stroke-linecap:butt;stroke-linejoin:miter;stroke-opacity:1"
       x="914.30548"
       y="853.38562"
       id="text13622"
       sodipodi:linespacing="125%"><tspan
         sodipodi:role="line"
         id="tspan13624"
         x="914.30548"
         y="853.38562">Libre Mesh</tspan></text>
    <text
       xml:space="preserve"
       style="font-style:normal;font-weight:normal;font-size:40px;line-height:125%;font-family:sans-serif;letter-spacing:0px;word-spacing:0px;fill:#000000;fill-opacity:1;stroke:none;stroke-width:1px;stroke-linecap:butt;stroke-linejoin:miter;stroke-opacity:1"
       x="881.41681"
       y="636.32031"
       id="text13626"
       sodipodi:linespacing="125%"><tspan
         sodipodi:role="line"
         id="tspan13628"
         x="881.41681"
         y="636.32031">roaming</tspan></text>
    <flowRoot
       xml:space="preserve"
       id="flowRoot13634"
       style="font-style:normal;font-weight:normal;font-size:40px;line-height:125%;font-family:sans-serif;letter-spacing:0px;word-spacing:0px;fill:#000000;fill-opacity:1;stroke:none;stroke-width:1px;stroke-linecap:butt;stroke-linejoin:miter;stroke-opacity:1"
       transform="translate(7.8335501,12.359087)"><flowRegion
         id="flowRegion13636"><rect
           id="rect13638"
           width="293.32748"
           height="291.91724"
           x="401.91504"
           y="121.61154" /></flowRegion><flowPara
         id="flowPara13640"
         style="font-style:normal;font-variant:normal;font-weight:normal;font-stretch:normal;font-size:13.75px;font-family:Armata;-inkscape-font-specification:Armata;text-align:justify;text-anchor:start">A Servidora é um computador que oferece serviços para outros dispositivos: esse serviço oferecido pode ser um website, arquivos de imagem ou texto, e-mails e mapas digitais. O seu computador pessoal pode ser uma servidora, até mesmo o seu celular! Mas normalmente se utiliza uma máquina própria para isso que deve ficar ligada 24h por dia.</flowPara></flowRoot>    <flowRoot
       transform="translate(7.8335501,244.35909)"
       style="font-style:normal;font-weight:normal;font-size:40px;line-height:125%;font-family:sans-serif;letter-spacing:0px;word-spacing:0px;fill:#000000;fill-opacity:1;stroke:none;stroke-width:1px;stroke-linecap:butt;stroke-linejoin:miter;stroke-opacity:1"
       id="flowRoot13642"
       xml:space="preserve"><flowRegion
         id="flowRegion13644"><rect
           y="121.61154"
           x="401.91504"
           height="291.91724"
           width="293.32748"
           id="rect13646" /></flowRegion><flowPara
         style="font-style:normal;font-variant:normal;font-weight:normal;font-stretch:normal;font-size:13.75px;font-family:Armata;-inkscape-font-specification:Armata;text-align:justify;text-anchor:start"
         id="flowPara13648">A server is a computer that offers services for other devices: websites, archives, e-mails, digital maps... Your personal computer can be a server. Even your cellphone! But generally specific devices are used that are connected 24/7.</flowPara></flowRoot>    <text
       xml:space="preserve"
       style="font-style:normal;font-weight:normal;font-size:40px;line-height:125%;font-family:sans-serif;letter-spacing:0px;word-spacing:0px;fill:#000000;fill-opacity:1;stroke:none;stroke-width:1px;stroke-linecap:butt;stroke-linejoin:miter;stroke-opacity:1"
       x="47.295174"
       y="81.50843"
       id="text13650"
       sodipodi:linespacing="125%"><tspan
         style="font-style:normal;font-variant:normal;font-weight:normal;font-stretch:normal;font-size:50px;font-family:Armata;-inkscape-font-specification:Armata"
         sodipodi:role="line"
         id="tspan13652"
         x="47.295174"
         y="81.50843">Roteadora</tspan></text>
    <flowRoot
       transform="translate(-360.16645,-19.640913)"
       style="font-style:normal;font-weight:normal;font-size:40px;line-height:125%;font-family:sans-serif;letter-spacing:0px;word-spacing:0px;fill:#000000;fill-opacity:1;stroke:none;stroke-width:1px;stroke-linecap:butt;stroke-linejoin:miter;stroke-opacity:1"
       id="flowRoot13654"
       xml:space="preserve"><flowRegion
         id="flowRegion13656"><rect
           y="121.61154"
           x="401.91504"
           height="387.3718"
           width="300.14569"
           id="rect13658" /></flowRegion><flowPara
         style="font-style:normal;font-variant:normal;font-weight:normal;font-stretch:normal;font-size:11.25px;font-family:Armata;-inkscape-font-specification:Armata;text-align:justify;text-anchor:start"
         id="flowPara13670">Equipamento de rede que conecta dispositivos uns com os outros e com outras redes. Responsável por criar o território da rede, dar nome e id aos dispositivos conectados e cuidar para que a rede funcione. </flowPara><flowPara
         style="font-style:normal;font-variant:normal;font-weight:normal;font-stretch:normal;font-size:11.25px;font-family:Armata;-inkscape-font-specification:Armata;text-align:justify;text-anchor:start"
         id="flowPara13676" /><flowPara
         style="font-style:normal;font-variant:normal;font-weight:normal;font-stretch:normal;font-size:11.25px;font-family:Armata;-inkscape-font-specification:Armata;text-align:justify;text-anchor:start"
         id="flowPara13672">Numa rede sem fio (wireless - inalánbrico) a roteadora tem uma antena - e essa antena recebe e envia sinais. Há roteadoras caseiras com pouca capacidade de ouvir e falar (receber e enviar sinais). Outras roteadoras são muito potentes para falar, podem enviar mensagens por km de distância. Outras são muito capazes de escutar, mas falam baixo. Todas são roteadoras, mas com antenas de diferentes alcances e com diferentes utilidades.</flowPara></flowRoot>    <flowRoot
       xml:space="preserve"
       id="flowRoot13678"
       style="font-style:normal;font-weight:normal;font-size:40px;line-height:125%;font-family:sans-serif;letter-spacing:0px;word-spacing:0px;fill:#000000;fill-opacity:1;stroke:none;stroke-width:1px;stroke-linecap:butt;stroke-linejoin:miter;stroke-opacity:1"
       transform="translate(7.8335498,217.63495)"><flowRegion
         id="flowRegion13680"><rect
           id="rect13682"
           width="293.32748"
           height="291.91724"
           x="401.91504"
           y="121.61154" /></flowRegion><flowPara
         id="flowPara13684"
         style="font-style:normal;font-variant:normal;font-weight:normal;font-stretch:normal;font-size:13.75px;font-family:Armata;-inkscape-font-specification:Armata;text-align:justify;text-anchor:start">{en}</flowPara></flowRoot>    <flowRoot
       transform="translate(7.8335498,-12.36505)"
       style="font-style:normal;font-weight:normal;font-size:40px;line-height:125%;font-family:sans-serif;letter-spacing:0px;word-spacing:0px;fill:#000000;fill-opacity:1;stroke:none;stroke-width:1px;stroke-linecap:butt;stroke-linejoin:miter;stroke-opacity:1"
       id="flowRoot13686"
       xml:space="preserve"><flowRegion
         id="flowRegion13688"><rect
           y="121.61154"
           x="401.91504"
           height="291.91724"
           width="293.32748"
           id="rect13690" /></flowRegion><flowPara
         style="font-style:normal;font-variant:normal;font-weight:normal;font-stretch:normal;font-size:13.75px;font-family:Armata;-inkscape-font-specification:Armata;text-align:justify;text-anchor:start"
         id="flowPara13692">{pt}</flowPara></flowRoot>  </g>
</svg>
