{
  "Number": 23,
  "Type": "Library.Core.Entities.Book, Library.Core, Version=1.0.0.0, Culture=neutral, PublicKeyToken=null",
  "Document": {
    "ISBN": 123,
    "Authors": [
      {
        "Name": "Author1",
        "Country": "Country1"
      },
      {
        "Name": "Author2",
        "Country": "Country2"
      }
    ],
    "NumberOfPages": 210,
    "Publisher": "Publisher1",
    "Title": "Title 1",
    "DatePublished": "2022-06-17T09:03:55.7415093+03:00"
  }
}