﻿  face_detection.cpp
  kalman.cpp
  main.cpp
  motor.cpp
  network.cpp
  pci6024e_bridge.cpp
  PID.cpp
  Generating Code...
LINK : warning LNK4075: ignoring '/INCREMENTAL' due to '/OPT:ICF' specification
  OCV.vcxproj -> D:\OpenCV_whellchair\x64\Release\OCV.exe
  OCV.vcxproj -> D:\OpenCV_whellchair\x64\Release\OCV.pdb (Full PDB)
