^D:\OPENCV_WHELLCHAIR\OCV\FACE_DETECTION.CPP
/c /I"C:\PROGRAM FILES (X86)\NATIONAL INSTRUMENTS\SHARED\EXTERNALCOMPILERSUPPORT\C\INCLUDE" /I.\INCLUDE /I. /Zi /nologo /W3 /WX- /sdl /Od /Oi /Oy- /D NDEBUG /D _CONSOLE /D _UNICODE /D UNICODE /D _CRT_SECURE_NO_WARNINGS /GF /Gm- /EHsc /MT /GS /Gy /fp:precise /Zc:wchar_t /Zc:forScope /Zc:inline /Fo"X64\RELEASE\\" /Fd"X64\RELEASE\VC140.PDB" /Gd /TP D:\OPENCV_WHELLCHAIR\OCV\FACE_DETECTION.CPP
^D:\OPENCV_WHELLCHAIR\OCV\KALMAN.CPP
/c /I"C:\PROGRAM FILES (X86)\NATIONAL INSTRUMENTS\SHARED\EXTERNALCOMPILERSUPPORT\C\INCLUDE" /I.\INCLUDE /I. /Zi /nologo /W3 /WX- /sdl /Od /Oi /Oy- /D NDEBUG /D _CONSOLE /D _UNICODE /D UNICODE /D _CRT_SECURE_NO_WARNINGS /GF /Gm- /EHsc /MT /GS /Gy /fp:precise /Zc:wchar_t /Zc:forScope /Zc:inline /Fo"X64\RELEASE\\" /Fd"X64\RELEASE\VC140.PDB" /Gd /TP D:\OPENCV_WHELLCHAIR\OCV\KALMAN.CPP
^D:\OPENCV_WHELLCHAIR\OCV\MAIN.CPP
/c /I"C:\PROGRAM FILES (X86)\NATIONAL INSTRUMENTS\SHARED\EXTERNALCOMPILERSUPPORT\C\INCLUDE" /I.\INCLUDE /I. /Zi /nologo /W3 /WX- /sdl /Od /Oi /Oy- /D NDEBUG /D _CONSOLE /D _UNICODE /D UNICODE /D _CRT_SECURE_NO_WARNINGS /GF /Gm- /EHsc /MT /GS /Gy /fp:precise /Zc:wchar_t /Zc:forScope /Zc:inline /Fo"X64\RELEASE\\" /Fd"X64\RELEASE\VC140.PDB" /Gd /TP D:\OPENCV_WHELLCHAIR\OCV\MAIN.CPP
^D:\OPENCV_WHELLCHAIR\OCV\MOTOR.CPP
/c /I"C:\PROGRAM FILES (X86)\NATIONAL INSTRUMENTS\SHARED\EXTERNALCOMPILERSUPPORT\C\INCLUDE" /I.\INCLUDE /I. /Zi /nologo /W3 /WX- /sdl /Od /Oi /Oy- /D NDEBUG /D _CONSOLE /D _UNICODE /D UNICODE /D _CRT_SECURE_NO_WARNINGS /GF /Gm- /EHsc /MT /GS /Gy /fp:precise /Zc:wchar_t /Zc:forScope /Zc:inline /Fo"X64\RELEASE\\" /Fd"X64\RELEASE\VC140.PDB" /Gd /TP D:\OPENCV_WHELLCHAIR\OCV\MOTOR.CPP
^D:\OPENCV_WHELLCHAIR\OCV\NETWORK.CPP
/c /I"C:\PROGRAM FILES (X86)\NATIONAL INSTRUMENTS\SHARED\EXTERNALCOMPILERSUPPORT\C\INCLUDE" /I.\INCLUDE /I. /Zi /nologo /W3 /WX- /sdl /Od /Oi /Oy- /D NDEBUG /D _CONSOLE /D _UNICODE /D UNICODE /D _CRT_SECURE_NO_WARNINGS /GF /Gm- /EHsc /MT /GS /Gy /fp:precise /Zc:wchar_t /Zc:forScope /Zc:inline /Fo"X64\RELEASE\\" /Fd"X64\RELEASE\VC140.PDB" /Gd /TP D:\OPENCV_WHELLCHAIR\OCV\NETWORK.CPP
^D:\OPENCV_WHELLCHAIR\OCV\PCI6024E_BRIDGE.CPP
/c /I"C:\PROGRAM FILES (X86)\NATIONAL INSTRUMENTS\SHARED\EXTERNALCOMPILERSUPPORT\C\INCLUDE" /I.\INCLUDE /I. /Zi /nologo /W3 /WX- /sdl /Od /Oi /Oy- /D NDEBUG /D _CONSOLE /D _UNICODE /D UNICODE /D _CRT_SECURE_NO_WARNINGS /GF /Gm- /EHsc /MT /GS /Gy /fp:precise /Zc:wchar_t /Zc:forScope /Zc:inline /Fo"X64\RELEASE\\" /Fd"X64\RELEASE\VC140.PDB" /Gd /TP D:\OPENCV_WHELLCHAIR\OCV\PCI6024E_BRIDGE.CPP
^D:\OPENCV_WHELLCHAIR\OCV\PID.CPP
/c /I"C:\PROGRAM FILES (X86)\NATIONAL INSTRUMENTS\SHARED\EXTERNALCOMPILERSUPPORT\C\INCLUDE" /I.\INCLUDE /I. /Zi /nologo /W3 /WX- /sdl /Od /Oi /Oy- /D NDEBUG /D _CONSOLE /D _UNICODE /D UNICODE /D _CRT_SECURE_NO_WARNINGS /GF /Gm- /EHsc /MT /GS /Gy /fp:precise /Zc:wchar_t /Zc:forScope /Zc:inline /Fo"X64\RELEASE\\" /Fd"X64\RELEASE\VC140.PDB" /Gd /TP D:\OPENCV_WHELLCHAIR\OCV\PID.CPP
