{
    "name": "myname",
    "group": "mygroup",
    "dependencies": [
        ["implementation", "com.foo:foo:1.0.0"],
        ["testImplementation", "com.bar:bar:2.0.0"]
    ],
    "project_dependencies": [
        {
          "group": "othergroup",
          "project": "otherproject",
          "location": "vendor/other"
        }
    ],
    "jars": [
        {
          "name": "jar1",
          "main_class": "com.baz.main1"
        },
        {
          "name": "jar2",
          "main_class": "com.baz.main2"
        }
    ]
}
