module gitlab.com/marek2222/goProj/goSecure/mygooauth

go 1.21.1

require (
	github.com/go-oauth2/oauth2/v4 v4.5.2 // indirect
	github.com/go-session/session v3.1.2+incompatible // indirect
	github.com/golang-jwt/jwt v3.2.2+incompatible // indirect
	github.com/golang/protobuf v1.5.3 // indirect
	github.com/google/uuid v1.4.0 // indirect
	github.com/tidwall/btree v1.7.0 // indirect
	github.com/tidwall/buntdb v1.3.0 // indirect
	github.com/tidwall/gjson v1.17.0 // indirect
	github.com/tidwall/grect v0.1.4 // indirect
	github.com/tidwall/match v1.1.1 // indirect
	github.com/tidwall/pretty v1.2.1 // indirect
	github.com/tidwall/rtred v0.1.2 // indirect
	github.com/tidwall/rtree v1.10.0 // indirect
	github.com/tidwall/tinyqueue v0.1.1 // indirect
	golang.org/x/net v0.19.0 // indirect
	golang.org/x/oauth2 v0.15.0 // indirect
	google.golang.org/appengine v1.6.8 // indirect
	google.golang.org/protobuf v1.31.0 // indirect
)
