module gitlab.com/marek22222/goProj/gRCP/03_moss_my/01_uzytkownicy

go 1.19

require (
	google.golang.org/grpc v1.49.0
	google.golang.org/protobuf v1.28.1
)

require (
	github.com/golang/protobuf v1.5.2 // indirect
	golang.org/x/net v0.0.0-20220909164309-bea034e7d591 // indirect
	golang.org/x/sys v0.0.0-20220915200043-7b5979e65e41 // indirect
	golang.org/x/text v0.3.7 // indirect
	google.golang.org/genproto v0.0.0-20220916172020-2692e8806bfa // indirect
)
