{
	"info": {
		"_postman_id": "021a59bc-c4c0-42f3-b4d2-c81888a28452",
		"name": "UU Nutria BE",
		"schema": "https://schema.getpostman.com/json/collection/v2.1.0/collection.json",
		"_exporter_id": "3665525"
	},
	"item": [
		{
			"name": "Health",
			"request": {
				"method": "GET",
				"header": [],
				"url": {
					"raw": "http://localhost:8000/health",
					"protocol": "http",
					"host": [
						"localhost"
					],
					"port": "8000",
					"path": [
						"health"
					]
				}
			},
			"response": []
		},
		{
			"name": "List food items",
			"request": {
				"method": "GET",
				"header": [],
				"url": {
					"raw": "http://localhost:8000/foodItem/list",
					"protocol": "http",
					"host": [
						"localhost"
					],
					"port": "8000",
					"path": [
						"foodItem",
						"list"
					]
				}
			},
			"response": [
				{
					"name": "List food items example",
					"originalRequest": {
						"method": "GET",
						"header": [],
						"url": {
							"raw": "http://localhost:8000/foodItem/list",
							"protocol": "http",
							"host": [
								"localhost"
							],
							"port": "8000",
							"path": [
								"foodItem",
								"list"
							]
						}
					},
					"status": "OK",
					"code": 200,
					"_postman_previewlanguage": "json",
					"header": [
						{
							"key": "X-Powered-By",
							"value": "Express"
						},
						{
							"key": "Access-Control-Allow-Origin",
							"value": "*"
						},
						{
							"key": "Content-Type",
							"value": "application/json; charset=utf-8"
						},
						{
							"key": "Content-Length",
							"value": "226"
						},
						{
							"key": "ETag",
							"value": "W/\"e2-TEXOhdTdgpcqRGnOQ43ykgNNEOM\""
						},
						{
							"key": "Date",
							"value": "Sat, 01 Jun 2024 07:24:37 GMT"
						},
						{
							"key": "Connection",
							"value": "keep-alive"
						},
						{
							"key": "Keep-Alive",
							"value": "timeout=5"
						}
					],
					"cookie": [],
					"body": "[\n    {\n        \"name\": \"banana\",\n        \"energy_value\": 90,\n        \"id\": \"076a5e8873053f030f55180c31368244\"\n    },\n    {\n        \"name\": \"tuna\",\n        \"energy_value\": 100,\n        \"id\": \"2f8a5a38876f3b2c8118c31159ccbf65\"\n    },\n    {\n        \"name\": \"egg\",\n        \"energy_value\": 150,\n        \"id\": \"4de8b24b0a958a0e4b9b2e7e87385195\"\n    }\n]"
				}
			]
		},
		{
			"name": "Create food item",
			"request": {
				"method": "POST",
				"header": [],
				"body": {
					"mode": "raw",
					"raw": "{\n    \"name\": \"apple\",\n    \"energy_value\": 70\n}",
					"options": {
						"raw": {
							"language": "json"
						}
					}
				},
				"url": {
					"raw": "http://localhost:8000/foodItem/create",
					"protocol": "http",
					"host": [
						"localhost"
					],
					"port": "8000",
					"path": [
						"foodItem",
						"create"
					]
				}
			},
			"response": [
				{
					"name": "Create food item example",
					"originalRequest": {
						"method": "POST",
						"header": [],
						"body": {
							"mode": "raw",
							"raw": "{\n    \"name\": \"apple\",\n    \"energy_value\": 70\n}",
							"options": {
								"raw": {
									"language": "json"
								}
							}
						},
						"url": {
							"raw": "http://localhost:8000/foodItem/create",
							"protocol": "http",
							"host": [
								"localhost"
							],
							"port": "8000",
							"path": [
								"foodItem",
								"create"
							]
						}
					},
					"status": "OK",
					"code": 200,
					"_postman_previewlanguage": "json",
					"header": [
						{
							"key": "X-Powered-By",
							"value": "Express"
						},
						{
							"key": "Access-Control-Allow-Origin",
							"value": "*"
						},
						{
							"key": "Content-Type",
							"value": "application/json; charset=utf-8"
						},
						{
							"key": "Content-Length",
							"value": "74"
						},
						{
							"key": "ETag",
							"value": "W/\"4a-eX+LBI0Yy7+GlfKkOFXow851KOc\""
						},
						{
							"key": "Date",
							"value": "Sat, 01 Jun 2024 07:45:56 GMT"
						},
						{
							"key": "Connection",
							"value": "keep-alive"
						},
						{
							"key": "Keep-Alive",
							"value": "timeout=5"
						}
					],
					"cookie": [],
					"body": "{\n    \"name\": \"apple\",\n    \"energy_value\": 70,\n    \"id\": \"bde28ac235e58ef632a5a1b1d747e2bd\"\n}"
				}
			]
		},
		{
			"name": "Create meal plan",
			"request": {
				"method": "POST",
				"header": [],
				"body": {
					"mode": "raw",
					"raw": "{\n    \"date\": \"2024-05-02\",\n    \"calorie_goal\": 2200\n}",
					"options": {
						"raw": {
							"language": "json"
						}
					}
				},
				"url": {
					"raw": "http://localhost:8000/mealPlan/create",
					"protocol": "http",
					"host": [
						"localhost"
					],
					"port": "8000",
					"path": [
						"mealPlan",
						"create"
					]
				}
			},
			"response": [
				{
					"name": "Create meal plan example",
					"originalRequest": {
						"method": "POST",
						"header": [],
						"body": {
							"mode": "raw",
							"raw": "{\n    \"date\": \"2024-05-02\",\n    \"calorie_goal\": 2200\n}",
							"options": {
								"raw": {
									"language": "json"
								}
							}
						},
						"url": {
							"raw": "http://localhost:8000/mealPlan/create",
							"protocol": "http",
							"host": [
								"localhost"
							],
							"port": "8000",
							"path": [
								"mealPlan",
								"create"
							]
						}
					},
					"status": "OK",
					"code": 200,
					"_postman_previewlanguage": "json",
					"header": [
						{
							"key": "X-Powered-By",
							"value": "Express"
						},
						{
							"key": "Access-Control-Allow-Origin",
							"value": "*"
						},
						{
							"key": "Content-Type",
							"value": "application/json; charset=utf-8"
						},
						{
							"key": "Content-Length",
							"value": "81"
						},
						{
							"key": "ETag",
							"value": "W/\"51-nIU+bXO863g5oda1VZFZWPN0B/k\""
						},
						{
							"key": "Date",
							"value": "Sat, 01 Jun 2024 08:01:19 GMT"
						},
						{
							"key": "Connection",
							"value": "keep-alive"
						},
						{
							"key": "Keep-Alive",
							"value": "timeout=5"
						}
					],
					"cookie": [],
					"body": "{\n    \"date\": \"2024-05-02\",\n    \"calorie_goal\": 2200,\n    \"id\": \"4cf2e8ec8ed608e9f0558935e0cfe9f7\"\n}"
				}
			]
		},
		{
			"name": "List meal plans",
			"request": {
				"method": "GET",
				"header": [],
				"url": {
					"raw": "http://localhost:8000/mealPlan/list",
					"protocol": "http",
					"host": [
						"localhost"
					],
					"port": "8000",
					"path": [
						"mealPlan",
						"list"
					]
				}
			},
			"response": [
				{
					"name": "List meal plans example",
					"originalRequest": {
						"method": "GET",
						"header": [],
						"url": {
							"raw": "http://localhost:8000/mealPlan/list",
							"protocol": "http",
							"host": [
								"localhost"
							],
							"port": "8000",
							"path": [
								"mealPlan",
								"list"
							]
						}
					},
					"status": "OK",
					"code": 200,
					"_postman_previewlanguage": "json",
					"header": [
						{
							"key": "X-Powered-By",
							"value": "Express"
						},
						{
							"key": "Access-Control-Allow-Origin",
							"value": "*"
						},
						{
							"key": "Content-Type",
							"value": "application/json; charset=utf-8"
						},
						{
							"key": "Content-Length",
							"value": "365"
						},
						{
							"key": "ETag",
							"value": "W/\"16d-HiLdt2urDjJw8HHIy88pot6f3JA\""
						},
						{
							"key": "Date",
							"value": "Sat, 01 Jun 2024 08:47:48 GMT"
						},
						{
							"key": "Connection",
							"value": "keep-alive"
						},
						{
							"key": "Keep-Alive",
							"value": "timeout=5"
						}
					],
					"cookie": [],
					"body": "[\n    {\n        \"date\": \"2024-05-02\",\n        \"calorie_goal\": 2200,\n        \"id\": \"4cf2e8ec8ed608e9f0558935e0cfe9f7\",\n        \"meal_plan_records\": [\n            {\n                \"meal_plan_id\": \"4cf2e8ec8ed608e9f0558935e0cfe9f7\",\n                \"food_item_id\": \"076a5e8873053f030f55180c31368244\",\n                \"weight\": 200,\n                \"id\": \"3544759ed311b10a4c4fa834dc43455f\"\n            }\n        ]\n    },\n    {\n        \"date\": \"2024-05-01\",\n        \"calorie_goal\": 2000,\n        \"id\": \"831963dbccde859e7f7882561c6dfb13\",\n        \"meal_plan_records\": []\n    }\n]"
				}
			]
		},
		{
			"name": "Create meal plan record",
			"request": {
				"method": "POST",
				"header": [],
				"body": {
					"mode": "raw",
					"raw": "{\n    \"meal_plan_id\": \"4cf2e8ec8ed608e9f0558935e0cfe9f7\",\n    \"food_item_id\": \"076a5e8873053f030f55180c31368244\",\n    \"weight\": 200\n}",
					"options": {
						"raw": {
							"language": "json"
						}
					}
				},
				"url": {
					"raw": "http://localhost:8000/mealPlanRecord/create",
					"protocol": "http",
					"host": [
						"localhost"
					],
					"port": "8000",
					"path": [
						"mealPlanRecord",
						"create"
					]
				}
			},
			"response": [
				{
					"name": "Create meal plan record",
					"originalRequest": {
						"method": "POST",
						"header": [],
						"body": {
							"mode": "raw",
							"raw": "{\n    \"date\": \"2024-05-02\",\n    \"calorie_goal\": 2200\n}",
							"options": {
								"raw": {
									"language": "json"
								}
							}
						},
						"url": {
							"raw": "http://localhost:8000/mealPlan/create",
							"protocol": "http",
							"host": [
								"localhost"
							],
							"port": "8000",
							"path": [
								"mealPlan",
								"create"
							]
						}
					},
					"status": "OK",
					"code": 200,
					"_postman_previewlanguage": "json",
					"header": [
						{
							"key": "X-Powered-By",
							"value": "Express"
						},
						{
							"key": "Access-Control-Allow-Origin",
							"value": "*"
						},
						{
							"key": "Content-Type",
							"value": "application/json; charset=utf-8"
						},
						{
							"key": "Content-Length",
							"value": "81"
						},
						{
							"key": "ETag",
							"value": "W/\"51-nIU+bXO863g5oda1VZFZWPN0B/k\""
						},
						{
							"key": "Date",
							"value": "Sat, 01 Jun 2024 08:01:19 GMT"
						},
						{
							"key": "Connection",
							"value": "keep-alive"
						},
						{
							"key": "Keep-Alive",
							"value": "timeout=5"
						}
					],
					"cookie": [],
					"body": "{\n    \"date\": \"2024-05-02\",\n    \"calorie_goal\": 2200,\n    \"id\": \"4cf2e8ec8ed608e9f0558935e0cfe9f7\"\n}"
				}
			]
		}
	]
}