<?xml version="1.0" encoding="utf-8"?>
<!DOCTYPE eagle SYSTEM "eagle.dtd">
<eagle version="6.0">
<drawing>
<settings>
<setting alwaysvectorfont="no"/>
<setting verticaltext="up"/>
</settings>
<grid distance="0.05" unitdist="inch" unit="mm" style="lines" multiple="1" display="no" altdistance="0.025" altunitdist="inch" altunit="mm"/>
<layers>
<layer number="1" name="Top" color="4" fill="1" visible="yes" active="yes"/>
<layer number="2" name="Route2" color="1" fill="3" visible="no" active="no"/>
<layer number="3" name="Route3" color="4" fill="3" visible="no" active="no"/>
<layer number="4" name="Route4" color="1" fill="4" visible="no" active="no"/>
<layer number="5" name="Route5" color="4" fill="4" visible="no" active="no"/>
<layer number="6" name="Route6" color="1" fill="8" visible="no" active="no"/>
<layer number="7" name="Route7" color="4" fill="8" visible="no" active="no"/>
<layer number="8" name="Route8" color="1" fill="2" visible="no" active="no"/>
<layer number="9" name="Route9" color="4" fill="2" visible="no" active="no"/>
<layer number="10" name="Route10" color="1" fill="7" visible="no" active="no"/>
<layer number="11" name="Route11" color="4" fill="7" visible="no" active="no"/>
<layer number="12" name="Route12" color="1" fill="5" visible="no" active="no"/>
<layer number="13" name="Route13" color="4" fill="5" visible="no" active="no"/>
<layer number="14" name="Route14" color="1" fill="6" visible="no" active="no"/>
<layer number="15" name="Route15" color="4" fill="6" visible="no" active="no"/>
<layer number="16" name="Bottom" color="1" fill="1" visible="yes" active="yes"/>
<layer number="17" name="Pads" color="2" fill="1" visible="yes" active="yes"/>
<layer number="18" name="Vias" color="2" fill="1" visible="yes" active="yes"/>
<layer number="19" name="Unrouted" color="6" fill="1" visible="yes" active="yes"/>
<layer number="20" name="Dimension" color="15" fill="1" visible="yes" active="yes"/>
<layer number="21" name="tPlace" color="7" fill="1" visible="yes" active="yes"/>
<layer number="22" name="bPlace" color="7" fill="1" visible="yes" active="yes"/>
<layer number="23" name="tOrigins" color="15" fill="1" visible="yes" active="yes"/>
<layer number="24" name="bOrigins" color="15" fill="1" visible="yes" active="yes"/>
<layer number="25" name="tNames" color="7" fill="1" visible="yes" active="yes"/>
<layer number="26" name="bNames" color="7" fill="1" visible="yes" active="yes"/>
<layer number="27" name="tValues" color="7" fill="1" visible="yes" active="yes"/>
<layer number="28" name="bValues" color="7" fill="1" visible="yes" active="yes"/>
<layer number="29" name="tStop" color="7" fill="3" visible="no" active="yes"/>
<layer number="30" name="bStop" color="7" fill="6" visible="no" active="yes"/>
<layer number="31" name="tCream" color="7" fill="4" visible="no" active="yes"/>
<layer number="32" name="bCream" color="7" fill="5" visible="no" active="yes"/>
<layer number="33" name="tFinish" color="6" fill="3" visible="no" active="yes"/>
<layer number="34" name="bFinish" color="6" fill="6" visible="no" active="yes"/>
<layer number="35" name="tGlue" color="7" fill="4" visible="no" active="yes"/>
<layer number="36" name="bGlue" color="7" fill="5" visible="no" active="yes"/>
<layer number="37" name="tTest" color="7" fill="1" visible="no" active="yes"/>
<layer number="38" name="bTest" color="7" fill="1" visible="no" active="yes"/>
<layer number="39" name="tKeepout" color="4" fill="11" visible="no" active="yes"/>
<layer number="40" name="bKeepout" color="1" fill="11" visible="no" active="yes"/>
<layer number="41" name="tRestrict" color="4" fill="10" visible="no" active="yes"/>
<layer number="42" name="bRestrict" color="1" fill="10" visible="no" active="yes"/>
<layer number="43" name="vRestrict" color="2" fill="10" visible="no" active="yes"/>
<layer number="44" name="Drills" color="7" fill="1" visible="no" active="yes"/>
<layer number="45" name="Holes" color="7" fill="1" visible="no" active="yes"/>
<layer number="46" name="Milling" color="3" fill="1" visible="no" active="yes"/>
<layer number="47" name="Measures" color="7" fill="1" visible="no" active="yes"/>
<layer number="48" name="Document" color="7" fill="1" visible="no" active="yes"/>
<layer number="49" name="Reference" color="7" fill="1" visible="no" active="yes"/>
<layer number="50" name="dxf" color="7" fill="1" visible="yes" active="yes"/>
<layer number="51" name="tDocu" color="7" fill="1" visible="no" active="yes"/>
<layer number="52" name="bDocu" color="7" fill="1" visible="no" active="yes"/>
<layer number="53" name="tGND_GNDA" color="7" fill="1" visible="no" active="no"/>
<layer number="54" name="bGND_GNDA" color="7" fill="1" visible="no" active="no"/>
<layer number="56" name="wert" color="7" fill="1" visible="no" active="no"/>
<layer number="91" name="Nets" color="2" fill="1" visible="no" active="no"/>
<layer number="92" name="Busses" color="1" fill="1" visible="no" active="no"/>
<layer number="93" name="Pins" color="2" fill="1" visible="no" active="no"/>
<layer number="94" name="Symbols" color="4" fill="1" visible="no" active="no"/>
<layer number="95" name="Names" color="7" fill="1" visible="no" active="no"/>
<layer number="96" name="Values" color="7" fill="1" visible="no" active="no"/>
<layer number="97" name="Info" color="7" fill="1" visible="no" active="no"/>
<layer number="98" name="Guide" color="6" fill="1" visible="no" active="no"/>
<layer number="100" name="PaJa" color="12" fill="7" visible="yes" active="yes"/>
<layer number="101" name="Doplnky" color="5" fill="1" visible="yes" active="yes"/>
<layer number="102" name="Kola" color="11" fill="7" visible="yes" active="yes"/>
<layer number="103" name="Popisy" color="7" fill="1" visible="yes" active="yes"/>
<layer number="104" name="Zapojeni" color="7" fill="1" visible="yes" active="yes"/>
<layer number="151" name="HeatSink" color="7" fill="1" visible="no" active="no"/>
<layer number="200" name="200bmp" color="7" fill="1" visible="no" active="no"/>
<layer number="250" name="Descript" color="7" fill="1" visible="no" active="no"/>
<layer number="251" name="SMDround" color="7" fill="1" visible="no" active="no"/>
<layer number="254" name="OrgLBR" color="7" fill="1" visible="no" active="no"/>
</layers>
<board>
<plain>
<wire x1="0" y1="0" x2="0" y2="52.07" width="0" layer="20"/>
<wire x1="0" y1="52.07" x2="82.55" y2="52.07" width="0" layer="20"/>
<wire x1="82.55" y1="52.07" x2="82.55" y2="0" width="0" layer="20"/>
<wire x1="82.55" y1="0" x2="0" y2="0" width="0" layer="20"/>
<hole x="2.54" y="2.54" drill="0.6"/>
<hole x="80.01" y="2.54" drill="0.6"/>
<hole x="80.01" y="49.53" drill="0.6"/>
<hole x="2.54" y="49.53" drill="0.6"/>
<text x="30.48" y="2.54" size="1.778" layer="16" rot="MR0">Marek Bielik 2013</text>
<text x="73.66" y="2.54" size="1.778" layer="16" rot="MR0">Mikrospájkovačka</text>
</plain>
<libraries>
<library name="#Svorkovnice">
<packages>
<package name="AK500/2">
<description>&lt;b&gt;CONNECTOR&lt;/b&gt;</description>
<wire x1="-5.08" y1="-3.556" x2="-5.08" y2="-2.159" width="0.1524" layer="21"/>
<wire x1="5.08" y1="3.937" x2="-5.08" y2="3.937" width="0.1524" layer="21"/>
<wire x1="5.08" y1="3.937" x2="5.08" y2="2.159" width="0.1524" layer="21"/>
<wire x1="-5.08" y1="-3.556" x2="5.08" y2="-3.556" width="0.1524" layer="21"/>
<wire x1="-5.08" y1="3.048" x2="-5.588" y2="3.175" width="0.1524" layer="21"/>
<wire x1="-5.08" y1="3.048" x2="-5.08" y2="3.937" width="0.1524" layer="21"/>
<wire x1="-5.588" y1="3.175" x2="-5.588" y2="2.032" width="0.1524" layer="21"/>
<wire x1="-5.588" y1="2.032" x2="-5.08" y2="2.159" width="0.1524" layer="21"/>
<wire x1="-5.08" y1="2.159" x2="-5.08" y2="3.048" width="0.1524" layer="21"/>
<wire x1="-5.08" y1="2.159" x2="5.08" y2="2.159" width="0.1524" layer="21"/>
<wire x1="5.08" y1="2.159" x2="5.08" y2="-2.159" width="0.1524" layer="21"/>
<wire x1="-5.08" y1="-2.159" x2="5.08" y2="-2.159" width="0.1524" layer="21"/>
<wire x1="-5.08" y1="-2.159" x2="-5.08" y2="2.159" width="0.1524" layer="21"/>
<wire x1="5.08" y1="-2.159" x2="5.08" y2="-3.556" width="0.1524" layer="21"/>
<wire x1="1.4986" y1="-1.397" x2="3.9116" y2="1.016" width="0.1524" layer="51"/>
<wire x1="1.1176" y1="-1.016" x2="3.5306" y2="1.397" width="0.1524" layer="51"/>
<wire x1="-3.9116" y1="-1.016" x2="-1.4986" y2="1.397" width="0.1524" layer="51"/>
<wire x1="-3.5306" y1="-1.397" x2="-1.1176" y2="1.016" width="0.1524" layer="51"/>
<wire x1="1.4986" y1="-1.016" x2="3.5306" y2="1.016" width="0.6096" layer="51"/>
<wire x1="-3.5306" y1="-1.016" x2="-1.4986" y2="1.016" width="0.6096" layer="51"/>
<wire x1="1.1176" y1="-1.016" x2="1.4986" y2="-1.397" width="0.1524" layer="51"/>
<wire x1="3.5306" y1="1.397" x2="3.9116" y2="1.016" width="0.1524" layer="51"/>
<wire x1="-3.9116" y1="-1.016" x2="-3.5306" y2="-1.397" width="0.1524" layer="51"/>
<wire x1="-1.4986" y1="1.397" x2="-1.1176" y2="1.016" width="0.1524" layer="51"/>
<circle x="2.5146" y="3.048" radius="0.508" width="0.1524" layer="21"/>
<circle x="-2.5146" y="3.048" radius="0.508" width="0.1524" layer="21"/>
<circle x="2.5146" y="0" radius="1.778" width="0.1524" layer="51"/>
<circle x="-2.5146" y="0" radius="1.778" width="0.1524" layer="51"/>
<pad name="1" x="-2.5146" y="0" drill="1.3208" shape="long" rot="R90"/>
<pad name="2" x="2.5146" y="0" drill="1.3208" shape="long" rot="R90"/>
<text x="-5.08" y="4.445" size="1.778" layer="25" ratio="10">&gt;NAME</text>
<text x="-5.08" y="-5.715" size="1.778" layer="27" ratio="10">&gt;VALUE</text>
<text x="-4.445" y="2.54" size="0.9906" layer="21" ratio="12">1</text>
<text x="0.635" y="2.54" size="0.9906" layer="21" ratio="12">2</text>
<rectangle x1="-0.381" y1="-1.905" x2="0.381" y2="1.905" layer="21"/>
</package>
</packages>
</library>
<library name="rcl">
<packages>
<package name="0207/10">
<description>&lt;b&gt;RESISTOR&lt;/b&gt;&lt;p&gt;
type 0207, grid 10 mm</description>
<wire x1="5.08" y1="0" x2="4.064" y2="0" width="0.6096" layer="51"/>
<wire x1="-5.08" y1="0" x2="-4.064" y2="0" width="0.6096" layer="51"/>
<wire x1="-3.175" y1="0.889" x2="-2.921" y2="1.143" width="0.1524" layer="21" curve="-90"/>
<wire x1="-3.175" y1="-0.889" x2="-2.921" y2="-1.143" width="0.1524" layer="21" curve="90"/>
<wire x1="2.921" y1="-1.143" x2="3.175" y2="-0.889" width="0.1524" layer="21" curve="90"/>
<wire x1="2.921" y1="1.143" x2="3.175" y2="0.889" width="0.1524" layer="21" curve="-90"/>
<wire x1="-3.175" y1="-0.889" x2="-3.175" y2="0.889" width="0.1524" layer="21"/>
<wire x1="-2.921" y1="1.143" x2="-2.54" y2="1.143" width="0.1524" layer="21"/>
<wire x1="-2.413" y1="1.016" x2="-2.54" y2="1.143" width="0.1524" layer="21"/>
<wire x1="-2.921" y1="-1.143" x2="-2.54" y2="-1.143" width="0.1524" layer="21"/>
<wire x1="-2.413" y1="-1.016" x2="-2.54" y2="-1.143" width="0.1524" layer="21"/>
<wire x1="2.413" y1="1.016" x2="2.54" y2="1.143" width="0.1524" layer="21"/>
<wire x1="2.413" y1="1.016" x2="-2.413" y2="1.016" width="0.1524" layer="21"/>
<wire x1="2.413" y1="-1.016" x2="2.54" y2="-1.143" width="0.1524" layer="21"/>
<wire x1="2.413" y1="-1.016" x2="-2.413" y2="-1.016" width="0.1524" layer="21"/>
<wire x1="2.921" y1="1.143" x2="2.54" y2="1.143" width="0.1524" layer="21"/>
<wire x1="2.921" y1="-1.143" x2="2.54" y2="-1.143" width="0.1524" layer="21"/>
<wire x1="3.175" y1="-0.889" x2="3.175" y2="0.889" width="0.1524" layer="21"/>
<pad name="1" x="-5.08" y="0" drill="0.8128" shape="octagon"/>
<pad name="2" x="5.08" y="0" drill="0.8128" shape="octagon"/>
<text x="-3.048" y="1.524" size="1.27" layer="25" ratio="10">&gt;NAME</text>
<text x="-2.2606" y="-0.635" size="1.27" layer="27" ratio="10">&gt;VALUE</text>
<rectangle x1="3.175" y1="-0.3048" x2="4.0386" y2="0.3048" layer="21"/>
<rectangle x1="-4.0386" y1="-0.3048" x2="-3.175" y2="0.3048" layer="21"/>
</package>
<package name="PT-10S">
<description>&lt;b&gt;Trimm Potentiometer&lt;/b&gt;</description>
<wire x1="-1.905" y1="-1.27" x2="-1.27" y2="-1.905" width="0.127" layer="51"/>
<wire x1="-1.27" y1="-1.905" x2="1.27" y2="-1.905" width="0.127" layer="21"/>
<wire x1="1.27" y1="-1.905" x2="1.905" y2="-1.27" width="0.127" layer="51"/>
<wire x1="-4.445" y1="-1.27" x2="4.445" y2="-1.27" width="0.127" layer="51"/>
<wire x1="-0.635" y1="3.175" x2="-0.635" y2="2.54" width="0.127" layer="21"/>
<wire x1="0.635" y1="2.54" x2="0.635" y2="3.175" width="0.127" layer="21"/>
<wire x1="-4.445" y1="3.175" x2="4.445" y2="3.175" width="0.127" layer="21"/>
<wire x1="5.08" y1="2.54" x2="4.445" y2="3.175" width="0.127" layer="21"/>
<wire x1="5.08" y1="2.54" x2="5.08" y2="-0.635" width="0.127" layer="21"/>
<wire x1="-4.445" y1="-1.27" x2="-5.08" y2="-0.635" width="0.127" layer="21"/>
<wire x1="-4.445" y1="3.175" x2="-5.08" y2="2.54" width="0.127" layer="21"/>
<wire x1="-5.08" y1="2.54" x2="5.08" y2="2.54" width="0.127" layer="21"/>
<wire x1="-5.08" y1="-0.635" x2="5.08" y2="-0.635" width="0.127" layer="51"/>
<wire x1="-5.08" y1="-0.635" x2="-5.08" y2="2.54" width="0.127" layer="21"/>
<wire x1="5.08" y1="-0.635" x2="4.445" y2="-1.27" width="0.127" layer="21"/>
<pad name="1" x="-2.54" y="-1.27" drill="1.016" diameter="1.778" shape="octagon"/>
<pad name="2" x="2.54" y="-1.27" drill="1.016" diameter="1.778" shape="octagon"/>
<pad name="3" x="0" y="1.27" drill="1.016" diameter="1.778" shape="octagon"/>
<text x="-2.54" y="3.7846" size="1.27" layer="25" ratio="10">&gt;NAME</text>
<text x="-2.54" y="-4.2164" size="1.27" layer="27" ratio="10">&gt;VALUE</text>
</package>
<package name="RTRIM3339P">
<description>&lt;b&gt;Trimm resistor&lt;/b&gt; BOURNS&lt;p&gt;
Cermet MIL-R-22097</description>
<circle x="0" y="0" radius="3.81" width="0.1524" layer="21"/>
<circle x="0" y="0" radius="1.4199" width="0.1524" layer="21"/>
<pad name="1" x="-2.54" y="0" drill="0.6096"/>
<pad name="2" x="0" y="-2.54" drill="0.6096"/>
<pad name="3" x="2.54" y="0" drill="0.6096"/>
<text x="-2.515" y="4.205" size="1.27" layer="25">&gt;NAME</text>
<text x="-2.515" y="-5.605" size="1.27" layer="27">&gt;VALUE</text>
<rectangle x1="-1.016" y1="-0.254" x2="1.016" y2="0.254" layer="21"/>
<rectangle x1="-0.254" y1="-1.016" x2="0.254" y2="1.016" layer="21"/>
</package>
</packages>
</library>
<library name="transistor-power">
<packages>
<package name="TO220AH">
<description>&lt;b&gt;Molded Package&lt;/b&gt;&lt;p&gt;
grid 2.54 mm</description>
<wire x1="-5.207" y1="-1.27" x2="5.207" y2="-1.27" width="0.1524" layer="21"/>
<wire x1="5.207" y1="14.605" x2="-5.207" y2="14.605" width="0.1524" layer="21"/>
<wire x1="5.207" y1="-1.27" x2="5.207" y2="11.176" width="0.1524" layer="21"/>
<wire x1="5.207" y1="11.176" x2="4.318" y2="11.176" width="0.1524" layer="21"/>
<wire x1="4.318" y1="11.176" x2="4.318" y2="12.7" width="0.1524" layer="21"/>
<wire x1="4.318" y1="12.7" x2="5.207" y2="12.7" width="0.1524" layer="21"/>
<wire x1="5.207" y1="12.7" x2="5.207" y2="14.605" width="0.1524" layer="21"/>
<wire x1="-5.207" y1="-1.27" x2="-5.207" y2="11.176" width="0.1524" layer="21"/>
<wire x1="-5.207" y1="11.176" x2="-4.318" y2="11.176" width="0.1524" layer="21"/>
<wire x1="-4.318" y1="11.176" x2="-4.318" y2="12.7" width="0.1524" layer="21"/>
<wire x1="-4.318" y1="12.7" x2="-5.207" y2="12.7" width="0.1524" layer="21"/>
<wire x1="-5.207" y1="12.7" x2="-5.207" y2="14.605" width="0.1524" layer="21"/>
<wire x1="-4.572" y1="-0.635" x2="4.572" y2="-0.635" width="0.0508" layer="21"/>
<wire x1="4.572" y1="7.62" x2="4.572" y2="-0.635" width="0.0508" layer="21"/>
<wire x1="4.572" y1="7.62" x2="-4.572" y2="7.62" width="0.0508" layer="21"/>
<wire x1="-4.572" y1="-0.635" x2="-4.572" y2="7.62" width="0.0508" layer="21"/>
<circle x="0" y="11.176" radius="1.8034" width="0.1524" layer="21"/>
<circle x="0" y="11.176" radius="4.191" width="0" layer="42"/>
<circle x="0" y="11.176" radius="4.191" width="0" layer="43"/>
<pad name="B" x="-2.54" y="-6.35" drill="1.1176" shape="long" rot="R90"/>
<pad name="C" x="0" y="-6.35" drill="1.1176" shape="long" rot="R90"/>
<pad name="E" x="2.54" y="-6.35" drill="1.1176" shape="long" rot="R90"/>
<text x="-3.81" y="5.207" size="1.778" layer="25" ratio="10">&gt;NAME</text>
<text x="-3.937" y="2.54" size="1.778" layer="27" ratio="10">&gt;VALUE</text>
<text x="-4.445" y="7.874" size="1.016" layer="21" ratio="10">A17,5mm</text>
<rectangle x1="2.159" y1="-4.699" x2="2.921" y2="-4.064" layer="21"/>
<rectangle x1="-0.381" y1="-4.699" x2="0.381" y2="-4.064" layer="21"/>
<rectangle x1="-2.921" y1="-4.699" x2="-2.159" y2="-4.064" layer="21"/>
<rectangle x1="-3.175" y1="-4.064" x2="-1.905" y2="-1.27" layer="21"/>
<rectangle x1="-0.635" y1="-4.064" x2="0.635" y2="-1.27" layer="21"/>
<rectangle x1="1.905" y1="-4.064" x2="3.175" y2="-1.27" layer="21"/>
<rectangle x1="-2.921" y1="-6.604" x2="-2.159" y2="-4.699" layer="51"/>
<rectangle x1="-0.381" y1="-6.604" x2="0.381" y2="-4.699" layer="51"/>
<rectangle x1="2.159" y1="-6.604" x2="2.921" y2="-4.699" layer="51"/>
<hole x="0" y="11.176" drill="3.302"/>
</package>
</packages>
</library>
<library name="led">
<packages>
<package name="LED5MM">
<description>&lt;B&gt;LED&lt;/B&gt;&lt;p&gt;
5 mm, round</description>
<wire x1="2.54" y1="-1.905" x2="2.54" y2="1.905" width="0.2032" layer="21"/>
<wire x1="2.54" y1="-1.905" x2="2.54" y2="1.905" width="0.254" layer="21" curve="-286.260205"/>
<wire x1="-1.143" y1="0" x2="0" y2="1.143" width="0.1524" layer="51" curve="-90"/>
<wire x1="0" y1="-1.143" x2="1.143" y2="0" width="0.1524" layer="51" curve="90"/>
<wire x1="-1.651" y1="0" x2="0" y2="1.651" width="0.1524" layer="51" curve="-90"/>
<wire x1="0" y1="-1.651" x2="1.651" y2="0" width="0.1524" layer="51" curve="90"/>
<wire x1="-2.159" y1="0" x2="0" y2="2.159" width="0.1524" layer="51" curve="-90"/>
<wire x1="0" y1="-2.159" x2="2.159" y2="0" width="0.1524" layer="51" curve="90"/>
<circle x="0" y="0" radius="2.54" width="0.1524" layer="21"/>
<pad name="A" x="-1.27" y="0" drill="0.8128" shape="octagon"/>
<pad name="K" x="1.27" y="0" drill="0.8128" shape="octagon"/>
<text x="3.175" y="0.5334" size="1.27" layer="25" ratio="10">&gt;NAME</text>
<text x="3.2004" y="-1.8034" size="1.27" layer="27" ratio="10">&gt;VALUE</text>
</package>
</packages>
</library>
<library name="analog-devices">
<packages>
<package name="DIL08">
<description>&lt;b&gt;Dual In Line Package&lt;/b&gt;</description>
<wire x1="5.08" y1="2.921" x2="-5.08" y2="2.921" width="0.1524" layer="21"/>
<wire x1="-5.08" y1="-2.921" x2="5.08" y2="-2.921" width="0.1524" layer="21"/>
<wire x1="5.08" y1="2.921" x2="5.08" y2="-2.921" width="0.1524" layer="21"/>
<wire x1="-5.08" y1="2.921" x2="-5.08" y2="1.016" width="0.1524" layer="21"/>
<wire x1="-5.08" y1="-2.921" x2="-5.08" y2="-1.016" width="0.1524" layer="21"/>
<wire x1="-5.08" y1="1.016" x2="-5.08" y2="-1.016" width="0.1524" layer="21" curve="-180"/>
<pad name="1" x="-3.81" y="-3.81" drill="0.8128" shape="long" rot="R90"/>
<pad name="2" x="-1.27" y="-3.81" drill="0.8128" shape="long" rot="R90"/>
<pad name="7" x="-1.27" y="3.81" drill="0.8128" shape="long" rot="R90"/>
<pad name="8" x="-3.81" y="3.81" drill="0.8128" shape="long" rot="R90"/>
<pad name="3" x="1.27" y="-3.81" drill="0.8128" shape="long" rot="R90"/>
<pad name="4" x="3.81" y="-3.81" drill="0.8128" shape="long" rot="R90"/>
<pad name="6" x="1.27" y="3.81" drill="0.8128" shape="long" rot="R90"/>
<pad name="5" x="3.81" y="3.81" drill="0.8128" shape="long" rot="R90"/>
<text x="-5.334" y="-2.921" size="1.27" layer="25" ratio="10" rot="R90">&gt;NAME</text>
<text x="-3.556" y="-0.635" size="1.27" layer="27" ratio="10">&gt;VALUE</text>
</package>
</packages>
</library>
<library name="diode">
<packages>
<package name="DO41Z10">
<description>&lt;B&gt;DIODE&lt;/B&gt;&lt;p&gt;
diameter 2.54 mm, horizontal, grid 10.16 mm</description>
<wire x1="2.032" y1="-1.27" x2="-2.032" y2="-1.27" width="0.1524" layer="21"/>
<wire x1="2.032" y1="-1.27" x2="2.032" y2="1.27" width="0.1524" layer="21"/>
<wire x1="-2.032" y1="1.27" x2="2.032" y2="1.27" width="0.1524" layer="21"/>
<wire x1="-2.032" y1="1.27" x2="-2.032" y2="-1.27" width="0.1524" layer="21"/>
<wire x1="5.08" y1="0" x2="3.937" y2="0" width="0.762" layer="51"/>
<wire x1="-5.08" y1="0" x2="-4.064" y2="0" width="0.762" layer="51"/>
<wire x1="-0.635" y1="0" x2="0" y2="0" width="0.1524" layer="21"/>
<wire x1="1.016" y1="0.635" x2="1.016" y2="-0.635" width="0.1524" layer="21"/>
<wire x1="1.016" y1="-0.635" x2="0" y2="0" width="0.1524" layer="21"/>
<wire x1="0" y1="0" x2="1.524" y2="0" width="0.1524" layer="21"/>
<wire x1="0" y1="0" x2="1.016" y2="0.635" width="0.1524" layer="21"/>
<wire x1="0" y1="0" x2="0" y2="-0.635" width="0.1524" layer="21"/>
<wire x1="0.254" y1="0.635" x2="0" y2="0.635" width="0.1524" layer="21"/>
<wire x1="0" y1="0.635" x2="0" y2="0" width="0.1524" layer="21"/>
<pad name="C" x="-5.08" y="0" drill="1.1176"/>
<pad name="A" x="5.08" y="0" drill="1.1176"/>
<text x="-1.905" y="1.651" size="1.27" layer="25" ratio="10">&gt;NAME</text>
<text x="-1.905" y="-2.794" size="1.27" layer="27" ratio="10">&gt;VALUE</text>
<rectangle x1="-1.651" y1="-1.27" x2="-1.143" y2="1.27" layer="21"/>
<rectangle x1="2.032" y1="-0.381" x2="3.937" y2="0.381" layer="21"/>
<rectangle x1="-3.937" y1="-0.381" x2="-2.032" y2="0.381" layer="21"/>
</package>
</packages>
</library>
<library name="rectifier">
<packages>
<package name="FBU4">
<description>&lt;b&gt;FAGOR RECTIFIER&lt;/b&gt;&lt;p&gt;
grid 3 x 5 mm</description>
<wire x1="-11.43" y1="-3.445" x2="-11.43" y2="3.54" width="0.1524" layer="21"/>
<wire x1="11.43" y1="3.54" x2="11.43" y2="-3.445" width="0.1524" layer="21"/>
<wire x1="-11.43" y1="3.54" x2="6.35" y2="3.54" width="0.1524" layer="21"/>
<wire x1="6.35" y1="3.54" x2="11.43" y2="3.54" width="0.1524" layer="21"/>
<wire x1="11.43" y1="-3.445" x2="6.35" y2="-3.445" width="0.1524" layer="21"/>
<wire x1="6.35" y1="-3.445" x2="-11.43" y2="-3.445" width="0.1524" layer="21"/>
<wire x1="7.62" y1="2.27" x2="7.62" y2="1" width="0.1524" layer="21"/>
<wire x1="6.985" y1="1.635" x2="8.255" y2="1.635" width="0.1524" layer="21"/>
<wire x1="-8.255" y1="1.635" x2="-6.985" y2="1.635" width="0.1524" layer="21"/>
<wire x1="-2.5146" y1="1.635" x2="-1.8542" y2="1.635" width="0.1524" layer="21" curve="180"/>
<wire x1="-3.175" y1="1.635" x2="-2.5146" y2="1.635" width="0.1524" layer="21" curve="-180"/>
<wire x1="2.5654" y1="1.635" x2="3.2258" y2="1.635" width="0.1524" layer="21" curve="180"/>
<wire x1="1.905" y1="1.635" x2="2.5654" y2="1.635" width="0.1524" layer="21" curve="-180"/>
<wire x1="6.35" y1="-3.445" x2="6.35" y2="-2.81" width="0.1524" layer="21"/>
<wire x1="6.35" y1="-0.27" x2="6.35" y2="-2.81" width="0.1524" layer="51"/>
<wire x1="6.35" y1="-0.27" x2="6.35" y2="3.54" width="0.1524" layer="21"/>
<pad name="-" x="-7.62" y="-1.54" drill="1.4986" shape="long" rot="R90"/>
<pad name="AC2" x="-2.54" y="-1.54" drill="1.4986" shape="long" rot="R90"/>
<pad name="AC1" x="2.54" y="-1.54" drill="1.4986" shape="long" rot="R90"/>
<pad name="+" x="7.62" y="-1.54" drill="1.4986" shape="long" rot="R90"/>
<text x="-11.43" y="4.048" size="1.778" layer="25" ratio="10">&gt;NAME</text>
<text x="-2.54" y="4.048" size="1.778" layer="27" ratio="10">&gt;VALUE</text>
<rectangle x1="-11.5" y1="-3.5" x2="11" y2="3.5" layer="43"/>
</package>
</packages>
</library>
<library name="holes">
<description>&lt;b&gt;Mounting Holes and Pads&lt;/b&gt;&lt;p&gt;
&lt;author&gt;Created by librarian@cadsoft.de&lt;/author&gt;</description>
<packages>
<package name="3,0">
<description>&lt;b&gt;MOUNTING HOLE&lt;/b&gt; 3.0 mm with drill center</description>
<wire x1="-2.159" y1="0" x2="0" y2="-2.159" width="2.4892" layer="51" curve="90" cap="flat"/>
<wire x1="0" y1="2.159" x2="2.159" y2="0" width="2.4892" layer="51" curve="-90" cap="flat"/>
<circle x="0" y="0" radius="3.429" width="0.1524" layer="21"/>
<circle x="0" y="0" radius="0.762" width="0.4572" layer="51"/>
<circle x="0" y="0" radius="3.048" width="2.032" layer="39"/>
<circle x="0" y="0" radius="3.048" width="2.032" layer="43"/>
<circle x="0" y="0" radius="3.048" width="2.032" layer="40"/>
<circle x="0" y="0" radius="3.048" width="2.032" layer="41"/>
<circle x="0" y="0" radius="3.048" width="2.032" layer="42"/>
<circle x="0" y="0" radius="1.6" width="0.2032" layer="21"/>
<text x="-1.27" y="-3.81" size="1.27" layer="48">3,0</text>
<hole x="0" y="0" drill="3"/>
</package>
</packages>
</library>
<library name="#PaJa_30">
<description>&lt;B&gt;PaJa 30&lt;/B&gt; - knihovna   &amp;nbsp; &amp;nbsp; &amp;nbsp; &amp;nbsp; &amp;nbsp; &amp;nbsp; 
&lt;I&gt;(vytvoreno 1.6.2011)&lt;/I&gt;&lt;BR&gt;
Univerzální knihovna soucastek do Eagle &lt;I&gt;(od verze 5.6)&lt;/I&gt;&lt;BR&gt;
&lt;BR&gt;
Knihovna obsahuje: 196 soucastek na DPS, 298 do SCHematu&lt;BR&gt;
&lt;BR&gt;
&lt;Author&gt;Copyright (C) PaJa 2001-2011&lt;BR&gt;
http://www.paja-trb.unas.cz&lt;BR&gt;
paja-trb@seznam.cz
&lt;/author&gt;</description>
<packages>
<package name="PAD_1">
<circle x="0" y="0" radius="0.5732" width="0.127" layer="102"/>
<pad name="1" x="0" y="0" drill="1.016" diameter="2.1844" shape="octagon"/>
<text x="-2.226" y="1.272" size="1.27" layer="25" font="vector">&gt;Name</text>
<text x="-2.067" y="-2.544" size="1.27" layer="27" font="vector">&gt;Value</text>
<text x="-1.272" y="-0.477" size="0.254" layer="100" font="vector" rot="R90">PaJa</text>
</package>
</packages>
</library>
<library name="wirepad">
<description>&lt;b&gt;Single Pads&lt;/b&gt;&lt;p&gt;
&lt;author&gt;Created by librarian@cadsoft.de&lt;/author&gt;</description>
<packages>
<package name="1,6/0,8">
<description>&lt;b&gt;THROUGH-HOLE PAD&lt;/b&gt;</description>
<wire x1="-0.762" y1="0.762" x2="-0.508" y2="0.762" width="0.1524" layer="21"/>
<wire x1="-0.762" y1="0.762" x2="-0.762" y2="0.508" width="0.1524" layer="21"/>
<wire x1="0.762" y1="0.762" x2="0.762" y2="0.508" width="0.1524" layer="21"/>
<wire x1="0.762" y1="0.762" x2="0.508" y2="0.762" width="0.1524" layer="21"/>
<wire x1="0.762" y1="-0.508" x2="0.762" y2="-0.762" width="0.1524" layer="21"/>
<wire x1="0.762" y1="-0.762" x2="0.508" y2="-0.762" width="0.1524" layer="21"/>
<wire x1="-0.508" y1="-0.762" x2="-0.762" y2="-0.762" width="0.1524" layer="21"/>
<wire x1="-0.762" y1="-0.762" x2="-0.762" y2="-0.508" width="0.1524" layer="21"/>
<circle x="0" y="0" radius="0.635" width="0.1524" layer="51"/>
<pad name="1" x="0" y="0" drill="0.8128" diameter="1.6002" shape="octagon"/>
<text x="-0.762" y="1.016" size="1.27" layer="25" ratio="10">&gt;NAME</text>
<text x="0" y="0.6" size="0.0254" layer="27">&gt;VALUE</text>
</package>
</packages>
</library>
</libraries>
<attributes>
</attributes>
<variantdefs>
</variantdefs>
<classes>
<class number="0" name="default" width="0" drill="0">
</class>
</classes>
<designrules>
<description language="de">&lt;b&gt;EAGLE Design Rules&lt;/b&gt;
&lt;p&gt;
Die Standard-Design-Rules sind so gewählt, dass sie für 
die meisten Anwendungen passen. Sollte ihre Platine 
besondere Anforderungen haben, treffen Sie die erforderlichen
Einstellungen hier und speichern die Design Rules unter 
einem neuen Namen ab.</description>
<description language="en">&lt;b&gt;EAGLE Design Rules&lt;/b&gt;
&lt;p&gt;
The default Design Rules have been set to cover
a wide range of applications. Your particular design
may have different requirements, so please make the
necessary adjustments and save your customized
design rules under a new name.</description>
<param name="layerSetup" value="(1*16)"/>
<param name="mtCopper" value="0.035mm 0.035mm 0.035mm 0.035mm 0.035mm 0.035mm 0.035mm 0.035mm 0.035mm 0.035mm 0.035mm 0.035mm 0.035mm 0.035mm 0.035mm 0.035mm"/>
<param name="mtIsolate" value="1.5mm 0.15mm 0.2mm 0.15mm 0.2mm 0.15mm 0.2mm 0.15mm 0.2mm 0.15mm 0.2mm 0.15mm 0.2mm 0.15mm 0.2mm"/>
<param name="mdWireWire" value="8mil"/>
<param name="mdWirePad" value="8mil"/>
<param name="mdWireVia" value="8mil"/>
<param name="mdPadPad" value="8mil"/>
<param name="mdPadVia" value="8mil"/>
<param name="mdViaVia" value="8mil"/>
<param name="mdSmdPad" value="8mil"/>
<param name="mdSmdVia" value="8mil"/>
<param name="mdSmdSmd" value="8mil"/>
<param name="mdViaViaSameLayer" value="8mil"/>
<param name="mnLayersViaInSmd" value="2"/>
<param name="mdCopperDimension" value="40mil"/>
<param name="mdDrill" value="8mil"/>
<param name="mdSmdStop" value="0mil"/>
<param name="msWidth" value="10mil"/>
<param name="msDrill" value="24mil"/>
<param name="msMicroVia" value="9.99mm"/>
<param name="msBlindViaRatio" value="0.5"/>
<param name="rvPadTop" value="0.25"/>
<param name="rvPadInner" value="0.25"/>
<param name="rvPadBottom" value="0.25"/>
<param name="rvViaOuter" value="0.25"/>
<param name="rvViaInner" value="0.25"/>
<param name="rvMicroViaOuter" value="0.25"/>
<param name="rvMicroViaInner" value="0.25"/>
<param name="rlMinPadTop" value="10mil"/>
<param name="rlMaxPadTop" value="20mil"/>
<param name="rlMinPadInner" value="10mil"/>
<param name="rlMaxPadInner" value="20mil"/>
<param name="rlMinPadBottom" value="10mil"/>
<param name="rlMaxPadBottom" value="20mil"/>
<param name="rlMinViaOuter" value="8mil"/>
<param name="rlMaxViaOuter" value="20mil"/>
<param name="rlMinViaInner" value="8mil"/>
<param name="rlMaxViaInner" value="20mil"/>
<param name="rlMinMicroViaOuter" value="4mil"/>
<param name="rlMaxMicroViaOuter" value="20mil"/>
<param name="rlMinMicroViaInner" value="4mil"/>
<param name="rlMaxMicroViaInner" value="20mil"/>
<param name="psTop" value="-1"/>
<param name="psBottom" value="-1"/>
<param name="psFirst" value="-1"/>
<param name="psElongationLong" value="100"/>
<param name="psElongationOffset" value="100"/>
<param name="mvStopFrame" value="1"/>
<param name="mvCreamFrame" value="0"/>
<param name="mlMinStopFrame" value="4mil"/>
<param name="mlMaxStopFrame" value="4mil"/>
<param name="mlMinCreamFrame" value="0mil"/>
<param name="mlMaxCreamFrame" value="0mil"/>
<param name="mlViaStopLimit" value="0mil"/>
<param name="srRoundness" value="0"/>
<param name="srMinRoundness" value="0mil"/>
<param name="srMaxRoundness" value="0mil"/>
<param name="slThermalIsolate" value="10mil"/>
<param name="slThermalsForVias" value="0"/>
<param name="dpMaxLengthDifference" value="10mm"/>
<param name="dpGapFactor" value="2.5"/>
<param name="checkGrid" value="0"/>
<param name="checkAngle" value="0"/>
<param name="checkFont" value="1"/>
<param name="checkRestrict" value="1"/>
<param name="useDiameter" value="13"/>
<param name="maxErrors" value="50"/>
</designrules>
<autorouter>
<pass name="Default">
<param name="RoutingGrid" value="50mil"/>
<param name="tpViaShape" value="round"/>
<param name="PrefDir.1" value="|"/>
<param name="PrefDir.2" value="0"/>
<param name="PrefDir.3" value="0"/>
<param name="PrefDir.4" value="0"/>
<param name="PrefDir.5" value="0"/>
<param name="PrefDir.6" value="0"/>
<param name="PrefDir.7" value="0"/>
<param name="PrefDir.8" value="0"/>
<param name="PrefDir.9" value="0"/>
<param name="PrefDir.10" value="0"/>
<param name="PrefDir.11" value="0"/>
<param name="PrefDir.12" value="0"/>
<param name="PrefDir.13" value="0"/>
<param name="PrefDir.14" value="0"/>
<param name="PrefDir.15" value="0"/>
<param name="PrefDir.16" value="-"/>
<param name="cfVia" value="8"/>
<param name="cfNonPref" value="5"/>
<param name="cfChangeDir" value="2"/>
<param name="cfOrthStep" value="2"/>
<param name="cfDiagStep" value="3"/>
<param name="cfExtdStep" value="0"/>
<param name="cfBonusStep" value="1"/>
<param name="cfMalusStep" value="1"/>
<param name="cfPadImpact" value="4"/>
<param name="cfSmdImpact" value="4"/>
<param name="cfBusImpact" value="0"/>
<param name="cfHugging" value="3"/>
<param name="cfAvoid" value="4"/>
<param name="cfPolygon" value="10"/>
<param name="cfBase.1" value="0"/>
<param name="cfBase.2" value="1"/>
<param name="cfBase.3" value="1"/>
<param name="cfBase.4" value="1"/>
<param name="cfBase.5" value="1"/>
<param name="cfBase.6" value="1"/>
<param name="cfBase.7" value="1"/>
<param name="cfBase.8" value="1"/>
<param name="cfBase.9" value="1"/>
<param name="cfBase.10" value="1"/>
<param name="cfBase.11" value="1"/>
<param name="cfBase.12" value="1"/>
<param name="cfBase.13" value="1"/>
<param name="cfBase.14" value="1"/>
<param name="cfBase.15" value="1"/>
<param name="cfBase.16" value="0"/>
<param name="mnVias" value="20"/>
<param name="mnSegments" value="9999"/>
<param name="mnExtdSteps" value="9999"/>
<param name="mnRipupLevel" value="10"/>
<param name="mnRipupSteps" value="100"/>
<param name="mnRipupTotal" value="100"/>
</pass>
<pass name="Follow-me" refer="Default" active="yes">
</pass>
<pass name="Busses" refer="Default" active="yes">
<param name="cfNonPref" value="4"/>
<param name="cfBusImpact" value="4"/>
<param name="cfHugging" value="0"/>
<param name="mnVias" value="0"/>
</pass>
<pass name="Route" refer="Default" active="yes">
</pass>
</autorouter>
<elements>
<element name="SEKUNDAR" library="#Svorkovnice" package="AK500/2" value="" x="7.62" y="33.02" rot="R90"/>
<element name="R1" library="rcl" package="0207/10" value="1K" x="29.21" y="41.91" rot="R90"/>
<element name="R2" library="rcl" package="0207/10" value="180R" x="29.21" y="30.48" smashed="yes" rot="R90">
<attribute name="NAME" x="32.766" y="28.702" size="1.27" layer="25" ratio="10" rot="R90"/>
<attribute name="VALUE" x="29.845" y="28.2194" size="1.27" layer="27" ratio="10" rot="R90"/>
</element>
<element name="R4" library="rcl" package="0207/10" value="1K5" x="68.58" y="40.64" smashed="yes" rot="R180">
<attribute name="NAME" x="71.628" y="39.116" size="1.27" layer="25" ratio="10" rot="R180"/>
<attribute name="VALUE" x="70.8406" y="41.275" size="1.27" layer="27" ratio="10" rot="R180"/>
</element>
<element name="R5" library="rcl" package="0207/10" value="10K" x="66.04" y="30.48" smashed="yes">
<attribute name="NAME" x="56.642" y="29.464" size="1.27" layer="25" ratio="10"/>
<attribute name="VALUE" x="63.7794" y="29.845" size="1.27" layer="27" ratio="10"/>
</element>
<element name="R6" library="rcl" package="0207/10" value="1K5" x="66.04" y="33.02" smashed="yes">
<attribute name="NAME" x="56.642" y="33.274" size="1.27" layer="25" ratio="10"/>
<attribute name="VALUE" x="56.1594" y="31.115" size="1.27" layer="27" ratio="10"/>
</element>
<element name="TERMO" library="#Svorkovnice" package="AK500/2" value="Typ K" x="36.83" y="41.91" rot="R180"/>
<element name="R7" library="rcl" package="PT-10S" value="10K" x="24.13" y="31.75" smashed="yes" rot="R90">
<attribute name="NAME" x="22.86" y="43.2054" size="1.27" layer="25" ratio="10" rot="R180"/>
<attribute name="VALUE" x="22.86" y="41.0464" size="1.27" layer="27" ratio="10" rot="R180"/>
</element>
<element name="R8" library="rcl" package="RTRIM3339P" value="1M" x="25.4" y="21.59" smashed="yes">
<attribute name="NAME" x="17.805" y="20.715" size="1.27" layer="25"/>
<attribute name="VALUE" x="17.805" y="18.525" size="1.27" layer="27"/>
</element>
<element name="R9" library="rcl" package="RTRIM3339P" value="500R" x="36.83" y="21.59" smashed="yes">
<attribute name="NAME" x="30.505" y="20.715" size="1.27" layer="25"/>
<attribute name="VALUE" x="29.235" y="18.525" size="1.27" layer="27"/>
</element>
<element name="R10" library="rcl" package="RTRIM3339P" value="10K" x="48.26" y="21.59" smashed="yes">
<attribute name="NAME" x="40.665" y="20.715" size="1.27" layer="25"/>
<attribute name="VALUE" x="40.665" y="18.525" size="1.27" layer="27"/>
</element>
<element name="Q1" library="transistor-power" package="TO220AH" value="IRF 530" x="68.58" y="22.86" rot="R90"/>
<element name="LED1" library="led" package="LED5MM" value="" x="62.23" y="45.72"/>
<element name="LED2" library="led" package="LED5MM" value="" x="71.12" y="45.72" rot="R180"/>
<element name="IC1" library="analog-devices" package="DIL08" value="TL071" x="53.34" y="40.64" rot="R270"/>
<element name="D1" library="diode" package="DO41Z10" value="6V2" x="66.04" y="35.56" smashed="yes">
<attribute name="NAME" x="64.135" y="37.211" size="1.27" layer="25" ratio="10"/>
<attribute name="VALUE" x="73.025" y="35.306" size="1.27" layer="27" ratio="10"/>
</element>
<element name="R11" library="rcl" package="0207/10" value="1M" x="44.45" y="41.91" smashed="yes" rot="R90">
<attribute name="NAME" x="48.006" y="36.322" size="1.27" layer="25" ratio="10" rot="R90"/>
<attribute name="VALUE" x="47.625" y="40.9194" size="1.27" layer="27" ratio="10" rot="R90"/>
</element>
<element name="B1" library="rectifier" package="FBU4" value="" x="15.24" y="34.29" rot="R90"/>
<element name="HROT" library="#Svorkovnice" package="AK500/2" value="Pajka" x="7.648" y="21.75" smashed="yes" rot="R90">
<attribute name="NAME" x="3.203" y="16.67" size="1.778" layer="25" ratio="10" rot="R90"/>
<attribute name="VALUE" x="10" y="15.903" size="1.778" layer="27" ratio="10" rot="R180"/>
</element>
<element name="H1" library="holes" package="3,0" value="MOUNT-HOLE3.0" x="3.81" y="3.81"/>
<element name="H2" library="holes" package="3,0" value="MOUNT-HOLE3.0" x="3.81" y="48.26"/>
<element name="H3" library="holes" package="3,0" value="MOUNT-HOLE3.0" x="78.74" y="48.26"/>
<element name="H4" library="holes" package="3,0" value="MOUNT-HOLE3.0" x="78.74" y="3.81"/>
<element name="PAD1" library="#PaJa_30" package="PAD_1" value="PAD_1" x="15.24" y="8.89"/>
<element name="PAD2" library="#PaJa_30" package="PAD_1" value="PAD_1" x="66.04" y="7.62"/>
<element name="PAD3" library="wirepad" package="1,6/0,8" value="" x="39.37" y="36.83"/>
<element name="PAD5" library="wirepad" package="1,6/0,8" value="" x="39.37" y="26.67"/>
<element name="PAD4" library="wirepad" package="1,6/0,8" value="" x="33.02" y="36.83"/>
<element name="PAD6" library="wirepad" package="1,6/0,8" value="" x="33.02" y="26.67"/>
</elements>
<signals>
<signal name="N$1">
<contactref element="IC1" pad="6"/>
<contactref element="D1" pad="C"/>
<wire x1="60.96" y1="36.83" x2="60.96" y2="35.56" width="1.27" layer="16"/>
<wire x1="58.42" y1="39.37" x2="60.96" y2="36.83" width="1.27" layer="16"/>
<wire x1="57.15" y1="39.37" x2="58.42" y2="39.37" width="1.27" layer="16"/>
</signal>
<signal name="N$2">
<contactref element="D1" pad="A"/>
<contactref element="Q1" pad="B"/>
<contactref element="R5" pad="2"/>
<wire x1="66.04" y1="20.32" x2="74.93" y2="20.32" width="1.27" layer="16"/>
<wire x1="66.04" y1="20.32" x2="66.04" y2="30.48" width="1.27" layer="16"/>
<wire x1="66.04" y1="30.48" x2="71.12" y2="30.48" width="1.27" layer="16"/>
<wire x1="73.66" y1="35.56" x2="71.12" y2="35.56" width="1.27" layer="16"/>
<wire x1="73.66" y1="30.48" x2="73.66" y2="35.56" width="1.27" layer="16"/>
<wire x1="71.12" y1="30.48" x2="73.66" y2="30.48" width="1.27" layer="16"/>
</signal>
<signal name="N$3">
<contactref element="IC1" pad="1"/>
<contactref element="R10" pad="1"/>
<wire x1="52.07" y1="44.45" x2="49.53" y2="44.45" width="1.27" layer="16"/>
<wire x1="52.07" y1="34.29" x2="52.07" y2="44.45" width="1.27" layer="16"/>
<wire x1="45.72" y1="21.59" x2="48.26" y2="21.59" width="1.27" layer="16"/>
<wire x1="48.26" y1="21.59" x2="48.26" y2="30.48" width="1.27" layer="16"/>
<wire x1="48.26" y1="30.48" x2="52.07" y2="34.29" width="1.27" layer="16"/>
</signal>
<signal name="N$4">
<contactref element="IC1" pad="5"/>
<contactref element="R10" pad="3"/>
<wire x1="50.8" y1="21.59" x2="50.8" y2="29.21" width="1.27" layer="16"/>
<wire x1="50.8" y1="29.21" x2="55.88" y2="34.29" width="1.27" layer="16"/>
<wire x1="55.88" y1="34.29" x2="55.88" y2="36.83" width="1.27" layer="16"/>
<wire x1="55.88" y1="36.83" x2="57.15" y2="36.83" width="1.27" layer="16"/>
</signal>
<signal name="N$8">
<contactref element="Q1" pad="C"/>
<contactref element="R4" pad="1"/>
<contactref element="LED2" pad="A"/>
<contactref element="HROT" pad="2"/>
<wire x1="74.93" y1="22.86" x2="69.85" y2="22.86" width="1.27" layer="16"/>
<wire x1="69.85" y1="22.86" x2="69.85" y2="27.94" width="1.27" layer="16"/>
<wire x1="69.85" y1="27.94" x2="76.2" y2="27.94" width="1.27" layer="16"/>
<wire x1="76.2" y1="27.94" x2="76.2" y2="38.1" width="1.27" layer="16"/>
<wire x1="73.66" y1="45.72" x2="72.39" y2="45.72" width="1.27" layer="16"/>
<wire x1="73.66" y1="40.64" x2="73.66" y2="45.72" width="1.27" layer="16"/>
<wire x1="76.2" y1="38.1" x2="73.66" y2="40.64" width="1.27" layer="16"/>
<wire x1="19.1694" y1="24.2646" x2="7.648" y2="24.2646" width="1.27" layer="16"/>
<wire x1="19.304" y1="22.86" x2="19.1694" y2="24.2646" width="1.27" layer="16"/>
<wire x1="19.304" y1="13.208" x2="19.304" y2="22.86" width="1.27" layer="16"/>
<wire x1="19.304" y1="13.208" x2="79.248" y2="13.208" width="1.27" layer="16"/>
<wire x1="79.248" y1="13.208" x2="79.248" y2="22.606" width="1.27" layer="16"/>
<wire x1="79.248" y1="22.606" x2="78.994" y2="22.86" width="1.27" layer="16"/>
<wire x1="78.994" y1="22.86" x2="74.93" y2="22.86" width="1.27" layer="16"/>
</signal>
<signal name="N$9">
<contactref element="LED1" pad="K"/>
<contactref element="R4" pad="2"/>
<wire x1="63.5" y1="40.64" x2="63.5" y2="45.72" width="1.27" layer="16"/>
</signal>
<signal name="N$10">
<contactref element="LED1" pad="A"/>
<contactref element="IC1" pad="7"/>
<contactref element="R11" pad="2"/>
<contactref element="R1" pad="2"/>
<contactref element="R7" pad="2"/>
<contactref element="B1" pad="+"/>
<contactref element="HROT" pad="1"/>
<wire x1="29.21" y1="46.99" x2="44.45" y2="46.99" width="1.27" layer="16"/>
<wire x1="54.61" y1="41.91" x2="57.15" y2="41.91" width="1.27" layer="16"/>
<wire x1="54.61" y1="46.99" x2="54.61" y2="41.91" width="1.27" layer="16"/>
<wire x1="44.45" y1="46.99" x2="54.61" y2="46.99" width="1.27" layer="16"/>
<wire x1="60.96" y1="46.99" x2="60.96" y2="45.72" width="1.27" layer="16"/>
<wire x1="54.61" y1="46.99" x2="60.96" y2="46.99" width="1.27" layer="16"/>
<wire x1="2.54" y1="40.64" x2="3.81" y2="41.91" width="1.27" layer="16"/>
<wire x1="3.81" y1="41.91" x2="16.78" y2="41.91" width="1.27" layer="16"/>
<wire x1="17.78" y1="46.99" x2="25.4" y2="46.99" width="1.27" layer="16"/>
<wire x1="25.4" y1="46.99" x2="29.21" y2="46.99" width="1.27" layer="16"/>
<wire x1="16.51" y1="45.72" x2="17.78" y2="46.99" width="1.27" layer="16"/>
<wire x1="16.51" y1="42.18" x2="16.51" y2="45.72" width="1.27" layer="16"/>
<wire x1="16.78" y1="41.91" x2="16.51" y2="42.18" width="1.27" layer="16"/>
<wire x1="25.4" y1="46.99" x2="25.4" y2="34.29" width="1.27" layer="16"/>
<wire x1="2.54" y1="12.7" x2="2.54" y2="19.304" width="1.27" layer="16"/>
<wire x1="2.54" y1="19.304" x2="2.54" y2="40.64" width="1.27" layer="16"/>
<wire x1="15.24" y1="12.7" x2="2.54" y2="12.7" width="1.27" layer="16"/>
<wire x1="15.24" y1="8.89" x2="15.24" y2="12.7" width="1.27" layer="16"/>
<wire x1="2.6086" y1="19.2354" x2="7.648" y2="19.2354" width="1.27" layer="16"/>
<wire x1="2.54" y1="19.304" x2="2.6086" y2="19.2354" width="1.27" layer="16"/>
<contactref element="PAD1" pad="1"/>
</signal>
<signal name="N$12">
<contactref element="LED2" pad="K"/>
<contactref element="R6" pad="2"/>
<wire x1="67.31" y1="33.02" x2="71.12" y2="33.02" width="1.27" layer="16"/>
<wire x1="67.31" y1="33.02" x2="67.31" y2="45.72" width="1.27" layer="16"/>
<wire x1="67.31" y1="45.72" x2="69.85" y2="45.72" width="1.27" layer="16"/>
</signal>
<signal name="N$15">
<contactref element="IC1" pad="2"/>
<contactref element="TERMO" pad="1"/>
<wire x1="36.83" y1="41.91" x2="36.8046" y2="36.83" width="1.27" layer="16"/>
<wire x1="39.3446" y1="41.91" x2="49.53" y2="41.91" width="1.27" layer="16"/>
<wire x1="39.3446" y1="41.9354" x2="39.3446" y2="41.91" width="1.27" layer="16"/>
<wire x1="36.83" y1="41.91" x2="39.3446" y2="41.9354" width="1.27" layer="16"/>
<contactref element="PAD4" pad="1"/>
<wire x1="36.8046" y1="36.83" x2="33.02" y2="36.83" width="1.27" layer="16"/>
</signal>
<signal name="N$16">
<contactref element="R9" pad="2"/>
<contactref element="R9" pad="1"/>
<contactref element="R1" pad="1"/>
<contactref element="TERMO" pad="2"/>
<contactref element="R2" pad="2"/>
<contactref element="R7" pad="1"/>
<wire x1="29.21" y1="35.56" x2="29.21" y2="36.83" width="1.27" layer="16"/>
<wire x1="29.21" y1="41.91" x2="34.3154" y2="41.91" width="1.27" layer="16"/>
<wire x1="29.21" y1="36.83" x2="29.21" y2="41.91" width="1.27" layer="16"/>
<wire x1="29.21" y1="29.21" x2="25.4" y2="29.21" width="1.27" layer="16"/>
<wire x1="29.21" y1="29.21" x2="29.21" y2="35.56" width="1.27" layer="16"/>
<wire x1="34.29" y1="19.05" x2="36.83" y2="19.05" width="1.27" layer="16"/>
<wire x1="34.29" y1="19.05" x2="34.29" y2="21.59" width="1.27" layer="16"/>
<contactref element="PAD5" pad="1"/>
<wire x1="39.37" y1="29.21" x2="33.02" y2="29.21" width="1.27" layer="16"/>
<wire x1="33.02" y1="29.21" x2="29.21" y2="29.21" width="1.27" layer="16"/>
<wire x1="39.37" y1="26.67" x2="39.37" y2="29.21" width="1.27" layer="16"/>
<contactref element="PAD6" pad="1"/>
<wire x1="33.02" y1="26.67" x2="34.29" y2="26.67" width="1.27" layer="16"/>
<wire x1="34.29" y1="26.67" x2="34.29" y2="21.59" width="1.27" layer="16"/>
<wire x1="33.02" y1="26.67" x2="33.02" y2="29.21" width="1.27" layer="16"/>
</signal>
<signal name="N$6">
<contactref element="R8" pad="3"/>
<contactref element="R8" pad="2"/>
<contactref element="R9" pad="3"/>
<contactref element="R11" pad="1"/>
<contactref element="IC1" pad="3"/>
<wire x1="25.4" y1="19.05" x2="27.94" y2="19.05" width="1.27" layer="16"/>
<wire x1="44.45" y1="39.37" x2="49.53" y2="39.37" width="1.27" layer="16"/>
<wire x1="44.45" y1="36.83" x2="44.45" y2="39.37" width="1.27" layer="16"/>
<wire x1="41.91" y1="21.59" x2="39.37" y2="21.59" width="1.27" layer="16"/>
<wire x1="27.94" y1="19.05" x2="27.94" y2="16.51" width="1.27" layer="16"/>
<wire x1="27.94" y1="16.51" x2="41.91" y2="16.51" width="1.27" layer="16"/>
<wire x1="41.91" y1="16.51" x2="41.91" y2="21.59" width="1.27" layer="16"/>
<wire x1="27.94" y1="19.05" x2="27.94" y2="21.59" width="1.27" layer="16"/>
<contactref element="PAD3" pad="1"/>
<wire x1="41.91" y1="21.59" x2="41.91" y2="36.83" width="1.27" layer="16"/>
<wire x1="39.37" y1="36.83" x2="41.91" y2="36.83" width="1.27" layer="16"/>
<wire x1="41.91" y1="36.83" x2="44.45" y2="36.83" width="1.27" layer="16"/>
</signal>
<signal name="N$7">
<contactref element="R7" pad="3"/>
<contactref element="R8" pad="1"/>
<wire x1="22.86" y1="21.59" x2="22.86" y2="31.75" width="1.27" layer="16"/>
<wire x1="22.86" y1="31.75" x2="25.4" y2="31.75" width="1.27" layer="16"/>
</signal>
<signal name="GND">
<contactref element="IC1" pad="4"/>
<contactref element="R10" pad="2"/>
<contactref element="Q1" pad="E"/>
<contactref element="R6" pad="1"/>
<contactref element="R2" pad="1"/>
<contactref element="B1" pad="-"/>
<polygon width="0.4064" layer="16" isolate="0.8128">
<vertex x="0" y="52.07"/>
<vertex x="0" y="0"/>
<vertex x="82.55" y="0"/>
<vertex x="82.55" y="52.07"/>
</polygon>
<contactref element="R5" pad="1"/>
<contactref element="PAD2" pad="1"/>
</signal>
<signal name="N$5">
<contactref element="SEKUNDAR" pad="1"/>
<contactref element="B1" pad="AC2"/>
<wire x1="16.78" y1="30.75" x2="16.78" y2="31.75" width="1.27" layer="16"/>
<wire x1="16.51" y1="30.48" x2="16.78" y2="30.75" width="1.27" layer="16"/>
<wire x1="7.6454" y1="30.48" x2="16.51" y2="30.48" width="1.27" layer="16"/>
<wire x1="7.62" y1="30.5054" x2="7.6454" y2="30.48" width="1.27" layer="16"/>
</signal>
<signal name="N$11">
<contactref element="B1" pad="AC1"/>
<contactref element="SEKUNDAR" pad="2"/>
<wire x1="7.62" y1="36.83" x2="16.78" y2="36.83" width="1.27" layer="16"/>
<wire x1="7.62" y1="35.5346" x2="7.62" y2="36.83" width="1.27" layer="16"/>
</signal>
</signals>
</board>
</drawing>
</eagle>
