<?xml version="1.0" encoding="UTF-8" standalone="no"?>
<svg
   xmlns:dc="http://purl.org/dc/elements/1.1/"
   xmlns:cc="http://creativecommons.org/ns#"
   xmlns:rdf="http://www.w3.org/1999/02/22-rdf-syntax-ns#"
   xmlns:svg="http://www.w3.org/2000/svg"
   xmlns="http://www.w3.org/2000/svg"
   xmlns:sodipodi="http://sodipodi.sourceforge.net/DTD/sodipodi-0.dtd"
   xmlns:inkscape="http://www.inkscape.org/namespaces/inkscape"
   xml:space="preserve"
   width="354.3307px"
   height="354.3307px"
   version="1.1"
   style="shape-rendering:geometricPrecision; text-rendering:geometricPrecision; image-rendering:optimizeQuality; fill-rule:evenodd; clip-rule:evenodd"
   viewBox="0.0 0.0 75.63 75.63"
   id="svg11"
   sodipodi:docname="next.svg"
   inkscape:version="1.0.1 (3bc2e813f5, 2020-09-07)"><metadata
   id="metadata15"><rdf:RDF><cc:Work
       rdf:about=""><dc:format>image/svg+xml</dc:format><dc:type
         rdf:resource="http://purl.org/dc/dcmitype/StillImage" /><dc:title /></cc:Work></rdf:RDF></metadata><sodipodi:namedview
   pagecolor="#ffffff"
   bordercolor="#666666"
   borderopacity="1"
   objecttolerance="10"
   gridtolerance="10"
   guidetolerance="10"
   inkscape:pageopacity="0"
   inkscape:pageshadow="2"
   inkscape:window-width="1920"
   inkscape:window-height="979"
   id="namedview13"
   showgrid="false"
   inkscape:pagecheckerboard="true"
   inkscape:zoom="23.19584"
   inkscape:cx="16.827053"
   inkscape:cy="18.460573"
   inkscape:window-x="0"
   inkscape:window-y="96"
   inkscape:window-maximized="1"
   inkscape:current-layer="svg11"
   inkscape:document-rotation="0" />
 <defs
   id="defs4">
  <style
   type="text/css"
   id="style2">
   
    .fil1 {fill:white}
    .fil0 {fill:white;fill-rule:nonzero}
   
  </style>
 
  
  
  
 </defs>
 <g
   id="g862"
   transform="matrix(-1,0,0,1,75.630902,0)"><path
     class="fil0"
     d="m 37.830902,75.630902 c -33.57,0 -50.49,-40.78 -26.73,-64.53 23.76,-23.76 64.53,-6.84 64.53,26.73 0,20.88 -16.93,37.8 -37.8,37.8 z m -21.38,-16.42 c 19,19 51.63,5.47 51.63,-21.38 0,-26.86 -32.63,-40.38 -51.63,-21.38 -11.81,11.81 -11.81,30.96 0,42.77 z"
     id="path7" /><polygon
     id="iconmonstr-arrow-66.svg"
     class="fil1"
     points="55,37.79 32,60.48 26.65,55.14 44.3,37.79 26.65,20.47 32,15.12 "
     transform="rotate(180,37.815451,37.815451)"
     style="fill:#ed6b21;fill-opacity:1" /></g>
</svg>
