<?xml version="1.0" encoding="UTF-8" standalone="no"?>
<svg
   xmlns:dc="http://purl.org/dc/elements/1.1/"
   xmlns:cc="http://creativecommons.org/ns#"
   xmlns:rdf="http://www.w3.org/1999/02/22-rdf-syntax-ns#"
   xmlns:svg="http://www.w3.org/2000/svg"
   xmlns="http://www.w3.org/2000/svg"
   xmlns:sodipodi="http://sodipodi.sourceforge.net/DTD/sodipodi-0.dtd"
   xmlns:inkscape="http://www.inkscape.org/namespaces/inkscape"
   xml:space="preserve"
   width="354.3307px"
   height="354.3307px"
   version="1.1"
   style="shape-rendering:geometricPrecision; text-rendering:geometricPrecision; image-rendering:optimizeQuality; fill-rule:evenodd; clip-rule:evenodd"
   viewBox="0.0 0.0 8.92 8.92"
   id="svg2"
   inkscape:version="0.91 r13725"
   sodipodi:docname="cancel_color.svg"><metadata
     id="metadata16"><rdf:RDF><cc:Work
         rdf:about=""><dc:format>image/svg+xml</dc:format><dc:type
           rdf:resource="http://purl.org/dc/dcmitype/StillImage" /><dc:title /></cc:Work></rdf:RDF></metadata><sodipodi:namedview
     pagecolor="#ffffff"
     bordercolor="#666666"
     borderopacity="1"
     objecttolerance="10"
     gridtolerance="10"
     guidetolerance="10"
     inkscape:pageopacity="0"
     inkscape:pageshadow="2"
     inkscape:window-width="1274"
     inkscape:window-height="891"
     id="namedview14"
     showgrid="false"
     inkscape:zoom="17.009153"
     inkscape:cx="5.0405622"
     inkscape:cy="6.9374409"
     inkscape:window-x="0"
     inkscape:window-y="0"
     inkscape:window-maximized="0"
     inkscape:current-layer="svg2"
     inkscape:document-rotation="0" /><defs
     id="defs4"><style
       type="text/css"
       id="style6">
    .fil0 {fill:black}
    .fil1 {fill:white}
   </style></defs><rect
     class="fil0"
     x="-43.37"
     y="-443.8"
     width="478.33"
     height="676.49"
     id="rect8"
     style="opacity:0" /><polygon
     style="fill:#ed6b21;fill-opacity:1"
     points="6.6,2.9 5.95,2.32 4.46,3.88 2.9,2.32 2.32,2.97 3.88,4.46 2.32,6.02 2.97,6.6 4.46,5.04 6.02,6.6 6.6,5.95 5.04,4.46 "
     class="fil1"
     id="iconmonstr-x-mark-11.svg" /><path
     style="fill:#ffffff"
     inkscape:connector-curvature="0"
     d="M 4.46,0 C 1.98,0 0,1.98 0,4.46 0,6.94 1.98,8.92 4.46,8.92 6.94,8.92 8.92,6.94 8.92,4.46 8.92,1.98 6.94,0 4.46,0 Z m 0,0.73 c 2.03,0 3.73,1.69 3.73,3.73 C 8.19,6.49 6.5,8.19 4.46,8.19 2.43,8.19 0.73,6.5 0.73,4.46 0.73,2.43 2.42,0.73 4.46,0.73 Z"
     class="fil1"
     id="iconmonstr-x-mark-11.svg_0" /></svg>
