<?xml version="1.0" encoding="UTF-8" standalone="no"?>
<svg
   xmlns:dc="http://purl.org/dc/elements/1.1/"
   xmlns:cc="http://creativecommons.org/ns#"
   xmlns:rdf="http://www.w3.org/1999/02/22-rdf-syntax-ns#"
   xmlns:svg="http://www.w3.org/2000/svg"
   xmlns="http://www.w3.org/2000/svg"
   xmlns:sodipodi="http://sodipodi.sourceforge.net/DTD/sodipodi-0.dtd"
   xmlns:inkscape="http://www.inkscape.org/namespaces/inkscape"
   width="354.3307px"
   height="354.3307px"
   fill-rule="evenodd"
   clip-rule="evenodd"
   image-rendering="optimizeQuality"
   shape-rendering="geometricPrecision"
   text-rendering="geometricPrecision"
   viewBox="-86.15320000000001 -86.15320000000004 393.8432 393.8432000000001"
   version="1.1"
   id="svg8"
   sodipodi:docname="language-icon.svg"
   inkscape:version="1.0.1 (3bc2e813f5, 2020-09-07)">
  <metadata
     id="metadata14">
    <rdf:RDF>
      <cc:Work
         rdf:about="">
        <dc:format>image/svg+xml</dc:format>
        <dc:type
           rdf:resource="http://purl.org/dc/dcmitype/StillImage" />
      </cc:Work>
    </rdf:RDF>
  </metadata>
  <defs
     id="defs12" />
  <sodipodi:namedview
     pagecolor="#ffffff"
     bordercolor="#666666"
     borderopacity="1"
     objecttolerance="10"
     gridtolerance="10"
     guidetolerance="10"
     inkscape:pageopacity="0"
     inkscape:pageshadow="2"
     inkscape:window-width="1920"
     inkscape:window-height="979"
     id="namedview10"
     inkscape:document-rotation="0"
     showgrid="false"
     inkscape:zoom="2.373489"
     inkscape:cx="149.35818"
     inkscape:cy="177.16534"
     inkscape:window-x="0"
     inkscape:window-y="36"
     inkscape:window-maximized="1"
     inkscape:current-layer="svg8" />
  <path
     fill="#ffffff"
     d="m 110.85,-16.07 c -73.15,0 -138.46,48.74 -138.46,115.43 0,23.66 8.52,46.86 23.6,64.92 0.63,21.09 -11.83,51.43 -22.97,73.49 30,-5.43 72.69,-17.37 92.06,-29.26 16.34,4 32,5.83 46.8,5.83 81.72,0 137.44,-55.83 137.44,-114.92 0,-67.03 -65.77,-115.44 -138.46,-115.44 v 0 -0.05 z m 0,23.09 c 63.6,0 115.38,41.43 115.38,92.4 0,56.75 -59.37,91.83 -114.35,91.83 -22.34,0 -39.03,-4.57 -50.69,-7.43 -11.54,7.08 -18.4,11.94 -49.26,20.97 6.17,-15.83 8.34,-31.72 6.92,-49.2 C 9.19,144.05 -4.52,127.87 -4.52,99.36 -4.52,48.44 47.26,6.96 110.86,6.96 v 0 0.06 z"
     id="path2" />
  <path
     fill="#5ea796"
     d="m 175.08,88.5 c 0.74,-2.8 1.14,-4.91 1.54,-6.97 l -12.69,-2.46 -1.26,5.77 c -4.29,-0.63 -8.86,-0.69 -13.43,-0.23 0.11,-3.08 0.28,-6.12 0.57,-9.03 h 14.17 v -12 h -12.46 c 0.63,-3.03 1.14,-4.91 1.66,-6.63 l -12.4,-3.71 c -0.91,3.03 -1.66,6 -2.46,10.34 h -14.17 v 12 h 12.57 c -0.34,3.89 -0.51,7.89 -0.57,12 -13.94,5.09 -19.83,14.86 -19.83,23.72 0,10.46 8.23,19.6 21.26,18.46 16.17,-1.48 26.97,-13.66 33.26,-28.69 6.51,3.77 9.31,10.12 6.8,16 -2.28,5.43 -8.97,10.63 -21.83,10.34 v 12.92 c 14.23,0.23 28.23,-5.2 33.77,-18.29 5.37,-12.8 -0.74,-26.74 -14.57,-33.43 l 0.06,-0.11 z M 64.22,58.9 h 15.03 l 28.52,74.98 H 92.23 L 86,116.56 H 57.89 l -6.17,17.32 H 35.66 L 64.23,58.9 Z M 81.71,104.61 71.83,76.32 62,104.61 Z m 54.86,-3.08 c 0.34,5.43 0.97,10.51 1.83,14.97 -11.48,2.12 -11.94,-9.26 -1.83,-14.97 z m 21.83,-4.17 c -2,4.46 -4.69,8.92 -8.06,12.4 -0.52,-3.71 -0.86,-7.83 -1.09,-12.17 3.09,-0.4 6.17,-0.46 9.09,-0.23 v 0 h 0.05 z"
     id="path4"
     style="fill:#5ea796;fill-opacity:1" />
</svg>
