<?xml version="1.0" encoding="UTF-8" standalone="no"?>
<svg
   xmlns:dc="http://purl.org/dc/elements/1.1/"
   xmlns:cc="http://creativecommons.org/ns#"
   xmlns:rdf="http://www.w3.org/1999/02/22-rdf-syntax-ns#"
   xmlns:svg="http://www.w3.org/2000/svg"
   xmlns="http://www.w3.org/2000/svg"
   xmlns:sodipodi="http://sodipodi.sourceforge.net/DTD/sodipodi-0.dtd"
   xmlns:inkscape="http://www.inkscape.org/namespaces/inkscape"
   width="354.3307px"
   height="354.3307px"
   fill-rule="evenodd"
   clip-rule="evenodd"
   image-rendering="optimizeQuality"
   shape-rendering="geometricPrecision"
   text-rendering="geometricPrecision"
   viewBox="0.0 0.0 4000.0 4000.0"
   version="1.1"
   id="svg6"
   sodipodi:docname="touchscreen-icon.svg">
  <metadata
     id="metadata12">
    <rdf:RDF>
      <cc:Work
         rdf:about="">
        <dc:format>image/svg+xml</dc:format>
        <dc:type
           rdf:resource="http://purl.org/dc/dcmitype/StillImage" />
      </cc:Work>
    </rdf:RDF>
  </metadata>
  <defs
     id="defs10" />
  <sodipodi:namedview
     pagecolor="#ffffff"
     bordercolor="#666666"
     borderopacity="1"
     objecttolerance="10"
     gridtolerance="10"
     guidetolerance="10"
     inkscape:pageopacity="0"
     inkscape:pageshadow="2"
     inkscape:window-width="640"
     inkscape:window-height="480"
     id="namedview8" />
  <path
     fill="#ffffff"
     d="M1956.04 3007.1c134.66,45.32 551.34,160.62 1034.1,520.22l894.28 -637.94c-231.84,-325.22 -168.12,-552.72 -398.52,-876.02 -116.24,-162.86 -195.66,-207.22 -295.44,-207.22 -35.22,0 -73.06,5.64 -115.96,13.44l81.16 113.72c49.02,68.5 -54.48,142.34 -103.44,73.66l-72.38 -101.5c-23.84,-33.64 -57.18,-44.96 -95.44,-44.96 -55.24,0 -120.54,23.72 -182.7,37.94l98.46 138.04c48.66,68.52 -54.46,142.34 -103.42,73.66l-85.34 -119.58c-23.72,-33.3 -56.52,-44.86 -93.8,-44.86 -57.5,0 -126,27.24 -189.92,43.4l104.1 146.04c49.02,68.68 -54.96,142.04 -103.42,73.64l-422.44 -591.34c-130.84,-183.78 -418.24,11.2 -282.62,201.6l623.72 874.44c-66.94,-24.62 -184.46,-47.26 -261.32,-47.26 -237.12,0.48 -328.44,260.66 -29.6,360.94l-0.06 -0.06z"
     id="path2" />
  <path
     fill="#fa6831"
     fill-rule="nonzero"
     d="M128.12 558.48l3201.16 0c70.76,0 128.12,57.38 128.12,128.12l0 1133.64c-23.24,-22.56 -45.94,-41.2 -68.56,-56.4 -62.82,-42.18 -122.44,-58.46 -187.68,-60.04l0 -889.08 -2944.92 0 0 1877.86 1442.6 0c-15.08,25.72 -25.36,53.5 -30.32,82.3 -1.7,9.86 -2.8,19.92 -3.22,29.9l5.38 61.84c3.82,17.38 9.7,34.68 17.56,51.76 4.78,10.28 10.28,20.44 16.64,30.44l-1576.76 0c-70.76,0 -128.12,-57.38 -128.12,-128.12l0 -2134.1c0,-70.74 57.36,-128.12 128.12,-128.12z"
     id="path4" />
</svg>
