<?xml version="1.0" encoding="UTF-8" standalone="no"?>
<svg
   xmlns:dc="http://purl.org/dc/elements/1.1/"
   xmlns:cc="http://creativecommons.org/ns#"
   xmlns:rdf="http://www.w3.org/1999/02/22-rdf-syntax-ns#"
   xmlns:svg="http://www.w3.org/2000/svg"
   xmlns="http://www.w3.org/2000/svg"
   xmlns:sodipodi="http://sodipodi.sourceforge.net/DTD/sodipodi-0.dtd"
   xmlns:inkscape="http://www.inkscape.org/namespaces/inkscape"
   xml:space="preserve"
   width="354.3307px"
   height="354.3307px"
   version="1.1"
   style="shape-rendering:geometricPrecision; text-rendering:geometricPrecision; image-rendering:optimizeQuality; fill-rule:evenodd; clip-rule:evenodd"
   viewBox="-4.4350000000000005 0.0 17.21 17.21"
   id="svg23"
   sodipodi:docname="drag_handler_color.svg"><metadata
   id="metadata27"><rdf:RDF><cc:Work
       rdf:about=""><dc:format>image/svg+xml</dc:format><dc:type
         rdf:resource="http://purl.org/dc/dcmitype/StillImage" /></cc:Work></rdf:RDF></metadata><sodipodi:namedview
   pagecolor="#ffffff"
   bordercolor="#666666"
   borderopacity="1"
   objecttolerance="10"
   gridtolerance="10"
   guidetolerance="10"
   inkscape:pageopacity="0"
   inkscape:pageshadow="2"
   inkscape:window-width="640"
   inkscape:window-height="480"
   id="namedview25" />
 <defs
   id="defs4">
  <style
   type="text/css"
   id="style2">
   
    .fil1 {fill:#666666}
    .fil0 {fill:#B3B3B3}
   
  </style>
 </defs>
 <g
   id="Layer_x0020_1">
  <metadata
   id="CorelCorpID_0Corel-Layer" />
  <path
   class="fil0"
   d="M1.97 0l2.2 0 2.2 0 1.97 0 0 1.97 0 13.27 0 1.97 -1.97 0 -2.2 0 -2.2 0c-1.08,0 -1.97,-0.89 -1.97,-1.97l0 -13.27c0,-1.08 0.89,-1.97 1.97,-1.97z"
   id="path7" />
  <g
   id="_2118011829040">
   <circle
   class="fil1"
   cx="2.52"
   cy="5.32"
   r="0.65"
   id="circle9" />
   <circle
   class="fil1"
   cx="2.52"
   cy="8.6"
   r="0.65"
   id="circle11" />
   <circle
   class="fil1"
   cx="2.52"
   cy="11.88"
   r="0.65"
   id="circle13" />
   <circle
   class="fil1"
   cx="5.8"
   cy="5.32"
   r="0.65"
   id="circle15" />
   <circle
   class="fil1"
   cx="5.8"
   cy="8.6"
   r="0.65"
   id="circle17" />
   <circle
   class="fil1"
   cx="5.8"
   cy="11.88"
   r="0.65"
   id="circle19" />
  </g>
 </g>
</svg>
