<?xml version="1.0" encoding="UTF-8" standalone="no"?>
<svg
   xmlns:dc="http://purl.org/dc/elements/1.1/"
   xmlns:cc="http://creativecommons.org/ns#"
   xmlns:rdf="http://www.w3.org/1999/02/22-rdf-syntax-ns#"
   xmlns:svg="http://www.w3.org/2000/svg"
   xmlns="http://www.w3.org/2000/svg"
   xmlns:sodipodi="http://sodipodi.sourceforge.net/DTD/sodipodi-0.dtd"
   xmlns:inkscape="http://www.inkscape.org/namespaces/inkscape"
   width="354.3307px"
   height="354.3307px"
   fill-rule="evenodd"
   clip-rule="evenodd"
   image-rendering="optimizeQuality"
   shape-rendering="geometricPrecision"
   text-rendering="geometricPrecision"
   viewBox="0.0 0.0 571.43 571.43"
   version="1.1"
   id="svg6"
   sodipodi:docname="firmware-icon_black.svg">
  <metadata
     id="metadata12">
    <rdf:RDF>
      <cc:Work
         rdf:about="">
        <dc:format>image/svg+xml</dc:format>
        <dc:type
           rdf:resource="http://purl.org/dc/dcmitype/StillImage" />
      </cc:Work>
    </rdf:RDF>
  </metadata>
  <defs
     id="defs10" />
  <sodipodi:namedview
     pagecolor="#ffffff"
     bordercolor="#666666"
     borderopacity="1"
     objecttolerance="10"
     gridtolerance="10"
     guidetolerance="10"
     inkscape:pageopacity="0"
     inkscape:pageshadow="2"
     inkscape:window-width="640"
     inkscape:window-height="480"
     id="namedview8" />
  <path
     fill="#313131"
     d="M454.66 196.28l59.62 0 0 19.88 -59.62 0 0 -19.88zm-237.32 97.56l32.99 0 0 -11.45 -32.99 0 0 -25.56 35.32 0 0 -11.67 -50.17 0 0 81.14 14.85 0 0 -32.46zm81.03 32.46l13.9 -51.12c2.23,-8.06 2.65,-12.73 2.65,-12.73l0.21 0c0,0 0.42,4.67 2.65,12.83l14.11 51.02 14.96 0 22.06 -81.14 -13.79 0 -12.73 50.27c-2.02,8.06 -2.55,13.26 -2.55,13.26l-0.21 0c0,0 -0.85,-5.2 -3.07,-13.37l-13.79 -50.17 -14.32 0 -13.68 50.27c-2.23,8.06 -2.76,13.26 -2.76,13.26l-0.21 0c0,0 -0.43,-5.2 -2.55,-13.37l-12.94 -50.17 -15.17 0 22.06 81.14 15.17 0zm76.78 128.36l0 59.63 -19.87 -0.01 0 -59.63 19.87 0.01zm-159 0l0 59.63 -19.88 -0.01 0 -59.63 19.88 0.01zm79.5 0l0 59.63 -19.87 -0.01 0 -59.63 19.87 0.01zm39.76 0l0 59.63 -19.88 -0.01 0 -59.63 19.88 0.01zm-79.51 0l0 59.63 -19.88 -0.01 0 -59.63 19.88 0.01zm-198.75 -258.38l59.62 0 0 19.88 -59.62 0 0 -19.88zm0 159l59.62 0 0 19.88 -59.62 -0.01 0 -19.88 0 0.01zm0 -79.5l59.62 0 0 19.87 -59.62 0 0 -19.87zm0 -39.75l59.62 0 0 19.88 -59.62 0 0 -19.88zm0 79.51l59.62 0 0 19.88 -59.62 0 0 -19.88zm318.01 -258.38l0 59.63 -19.87 -0.01 0 -59.63 19.87 0.01zm-159 0l0 59.63 -19.88 -0.01 0 -59.63 19.88 0.01zm79.5 0l0 59.63 -19.87 -0.01 0 -59.63 19.87 0.01zm39.76 0l0 59.63 -19.88 -0.01 0 -59.63 19.88 0.01zm-79.51 0l0 59.63 -19.88 -0.01 0 -59.63 19.88 0.01zm198.77 298.13l59.62 0 0 19.88 -59.62 -0.01 0 -19.88 0 0.01zm0 -79.5l59.62 0 0 19.87 -59.62 0 0 -19.87zm0 -39.75l59.62 0 0 19.88 -59.62 0 0 -19.88zm0 79.51l59.62 0 0 19.88 -59.62 0 0 -19.88z"
     id="path2" />
  <path
     fill="#fa6831"
     d="M434.79 176.4c0,-21.94 -17.81,-39.75 -39.75,-39.75l-218.63 0c-21.94,0 -39.75,17.81 -39.75,39.75l0 218.63c0,21.94 17.81,39.75 39.75,39.75l218.63 0c21.94,0 39.75,-17.81 39.75,-39.75l0 -218.63zm-54.66 0c8.23,0 14.91,6.68 14.91,14.91l0 188.81c0,8.23 -6.68,14.9 -14.91,14.9l-188.82 0.01c-8.23,0 -14.91,-6.68 -14.91,-14.91l0 -188.81c0,-8.23 6.68,-14.9 14.91,-14.9l188.82 -0.01z"
     id="path4" />
</svg>
