<?xml version="1.0" encoding="UTF-8" standalone="no"?>
<svg
   xmlns:dc="http://purl.org/dc/elements/1.1/"
   xmlns:cc="http://creativecommons.org/ns#"
   xmlns:rdf="http://www.w3.org/1999/02/22-rdf-syntax-ns#"
   xmlns:svg="http://www.w3.org/2000/svg"
   xmlns="http://www.w3.org/2000/svg"
   xmlns:sodipodi="http://sodipodi.sourceforge.net/DTD/sodipodi-0.dtd"
   xmlns:inkscape="http://www.inkscape.org/namespaces/inkscape"
   xml:space="preserve"
   width="354.3307px"
   height="354.3307px"
   version="1.1"
   style="clip-rule:evenodd;fill-rule:evenodd;image-rendering:optimizeQuality;shape-rendering:geometricPrecision;text-rendering:geometricPrecision"
   viewBox="0.0 -118.47194999999999 917.18 917.18"
   id="svg2"
   inkscape:version="1.0.1 (3bc2e813f5, 2020-09-07)"
   sodipodi:docname="key_color.svg"><metadata
     id="metadata14"><rdf:RDF><cc:Work
         rdf:about=""><dc:format>image/svg+xml</dc:format><dc:type
           rdf:resource="http://purl.org/dc/dcmitype/StillImage" /><dc:title /></cc:Work></rdf:RDF></metadata><sodipodi:namedview
     pagecolor="#ffffff"
     bordercolor="#666666"
     borderopacity="1"
     objecttolerance="10"
     gridtolerance="10"
     guidetolerance="10"
     inkscape:pageopacity="0"
     inkscape:pageshadow="2"
     inkscape:window-width="1920"
     inkscape:window-height="979"
     id="namedview12"
     showgrid="false"
     inkscape:zoom="1"
     inkscape:cx="-49.092964"
     inkscape:cy="9.596339"
     inkscape:window-x="0"
     inkscape:window-y="36"
     inkscape:window-maximized="1"
     inkscape:current-layer="svg2"
     inkscape:document-rotation="0" /><defs
     id="defs4"><style
       type="text/css"
       id="style6">
    .fil0 {fill:#FF6600}
    .fil1 {fill:white}
   </style></defs><path
     id="iconmonstr-key-13.svg"
     class="fil0"
     d="m 191.07,369.74603 c -31.64,0 -57.32,25.68 -57.32,57.32 0,31.65 25.68,57.33 57.32,57.33 31.65,0 57.33,-25.68 57.33,-57.33 0,-31.64 -25.68,-57.32 -57.33,-57.32 z"
     inkscape:connector-curvature="0"
     style="fill:#5ea796;fill-opacity:1" /><path
     id="iconmonstr-key-13.svg_0"
     class="fil1"
     d="m 0,431.83603 c 0,138.06 112.78,248.4 247.45,248.4 82.31,0 156.72,-46.4 203.98,-114.66 l 110.14,0.02 39.98,-38.71 49.76,38.94 52.05,-41.08 53.77,41.31 160.05,-131.76 -127.86,-136.2 H 451.43 c -43.75,-64.32 -118.63,-114.66 -204.03,-114.66 -133.63,0 -247.4,109.53 -247.4,248.4 z m 408.56,57.32 c -37.45,63.85 -87.02,114.66 -161.14,114.66 -92.19,0 -170.97,-75.91 -170.97,-171.96 0,-95.46 78.11,-171.96 171.17,-171.96 78.53,0 125.8,54.76 160.96,114.65 l 347.62,-0.03 49.41,52.58 -50.13,41.31 -52.73,-40.54 -51.64,40.73 -54.91,-42.91 -65.55,63.48 H 408.56 Z"
     inkscape:connector-curvature="0"
     style="fill:#ffffff" /><path
     style="fill:#ffffff;fill-rule:evenodd;stroke:#000000;stroke-width:25.88486862px;stroke-linecap:butt;stroke-linejoin:miter;stroke-opacity:0"
     d="m 212.03613,39.195901 c 14.79323,0 29.58645,0 44.37968,0 3.28741,0 6.57478,0 9.86216,0 0.82185,0 1.65974,0.16049 2.46554,0 3.32276,-0.66447 6.53939,-1.80107 9.86216,-2.46553 4.01024,-0.80218 8.29294,1.00873 12.32769,0 12.18667,-3.04668 -5.15968,-2.46554 4.93107,-2.46554"
     id="path4142"
     inkscape:connector-curvature="0" /></svg>
