<?xml version="1.0" encoding="UTF-8" standalone="no"?>
<svg
   xmlns:dc="http://purl.org/dc/elements/1.1/"
   xmlns:cc="http://creativecommons.org/ns#"
   xmlns:rdf="http://www.w3.org/1999/02/22-rdf-syntax-ns#"
   xmlns:svg="http://www.w3.org/2000/svg"
   xmlns="http://www.w3.org/2000/svg"
   xmlns:sodipodi="http://sodipodi.sourceforge.net/DTD/sodipodi-0.dtd"
   xmlns:inkscape="http://www.inkscape.org/namespaces/inkscape"
   xml:space="preserve"
   width="354.3307px"
   height="354.3307px"
   version="1.1"
   style="shape-rendering:geometricPrecision; text-rendering:geometricPrecision; image-rendering:optimizeQuality; fill-rule:evenodd; clip-rule:evenodd"
   viewBox="0.0 0.0 51.21 51.21"
   id="svg2"
   inkscape:version="0.91 r13725"
   sodipodi:docname="videos_small_white.svg"><metadata
     id="metadata15"><rdf:RDF><cc:Work
         rdf:about=""><dc:format>image/svg+xml</dc:format><dc:type
           rdf:resource="http://purl.org/dc/dcmitype/StillImage" /><dc:title /></cc:Work></rdf:RDF></metadata><sodipodi:namedview
     pagecolor="#ffffff"
     bordercolor="#666666"
     borderopacity="1"
     objecttolerance="10"
     gridtolerance="10"
     guidetolerance="10"
     inkscape:pageopacity="0"
     inkscape:pageshadow="2"
     inkscape:window-width="725"
     inkscape:window-height="480"
     id="namedview13"
     showgrid="false"
     inkscape:zoom="7.0733891"
     inkscape:cx="16.682421"
     inkscape:cy="16.682244"
     inkscape:window-x="0"
     inkscape:window-y="0"
     inkscape:window-maximized="0"
     inkscape:current-layer="svg2"
     inkscape:document-rotation="0" /><defs
     id="defs4"><style
       type="text/css"
       id="style6">
    .fil1 {fill:#FF6600}
    .fil0 {fill:white}
   </style></defs><path
     id="iconmonstr-video-9.svg"
     class="fil0"
     d="M 51.21,9.34 51.19,9.25 49.04,0 3.87,8.95 C 1.62,9.4 0,11.37 0,13.66 l 0,31.15 c 0,3.54 2.87,6.4 6.4,6.4 l 38.41,0 c 3.53,0 6.4,-2.87 6.4,-6.4 l 0,-29.88 -27.17,0 27.17,-5.6 z m -4.27,16.27 0,18.67 c 0,1.47 -1.2,2.67 -2.67,2.67 l -37.34,0 c -1.47,0 -2.67,-1.19 -2.67,-2.67 l 0,-18.67 42.68,0 z M 42.91,3.75 48.02,7.17 41.63,8.44 36.51,5.01 42.9,3.74 l 0,0 z m -12.58,2.49 5.12,3.43 -6.39,1.27 -5.13,-3.43 6.39,-1.27 0,0 z m -12.6,2.5 5.13,3.43 -6.39,1.27 L 11.34,10 17.73,8.73 Z m 5.42,8.33 -4.35,4.27 -6.52,0 4.35,-4.27 6.52,0 z m 19.16,0 6.52,0 -4.35,4.27 -6.52,0 4.35,-4.27 0,0 z m -12.83,0 6.51,0 -4.35,4.27 -6.51,0 4.35,-4.27 0,0 z"
     inkscape:connector-curvature="0"
     style="fill:#ffffff" /><polygon
     id="iconmonstr-video-9.svg_0"
     class="fil1"
     points="21.34,42.68 21.34,29.87 32.01,36.28 21.34,42.68 "
     style="fill:#ffffff" /></svg>
