<?xml version="1.0" encoding="UTF-8" standalone="no"?>
<svg
   xmlns:dc="http://purl.org/dc/elements/1.1/"
   xmlns:cc="http://creativecommons.org/ns#"
   xmlns:rdf="http://www.w3.org/1999/02/22-rdf-syntax-ns#"
   xmlns:svg="http://www.w3.org/2000/svg"
   xmlns="http://www.w3.org/2000/svg"
   xmlns:sodipodi="http://sodipodi.sourceforge.net/DTD/sodipodi-0.dtd"
   xmlns:inkscape="http://www.inkscape.org/namespaces/inkscape"
   xml:space="preserve"
   width="354.3307px"
   height="354.3307px"
   version="1.1"
   style="shape-rendering:geometricPrecision; text-rendering:geometricPrecision; image-rendering:optimizeQuality; fill-rule:evenodd; clip-rule:evenodd"
   viewBox="0.0 1.7763568394002505e-15 28.59 28.589999999999996"
   id="svg10"
   sodipodi:docname="edit_white.svg"
   inkscape:version="1.0.1 (3bc2e813f5, 2020-09-07)"><metadata
   id="metadata14"><rdf:RDF><cc:Work
       rdf:about=""><dc:format>image/svg+xml</dc:format><dc:type
         rdf:resource="http://purl.org/dc/dcmitype/StillImage" /><dc:title /></cc:Work></rdf:RDF></metadata><sodipodi:namedview
   pagecolor="#ffffff"
   bordercolor="#666666"
   borderopacity="1"
   objecttolerance="10"
   gridtolerance="10"
   guidetolerance="10"
   inkscape:pageopacity="0"
   inkscape:pageshadow="2"
   inkscape:window-width="1127"
   inkscape:window-height="775"
   id="namedview12"
   showgrid="false"
   inkscape:zoom="0.83915509"
   inkscape:cx="-134.13359"
   inkscape:cy="235.74178"
   inkscape:window-x="0"
   inkscape:window-y="0"
   inkscape:window-maximized="0"
   inkscape:current-layer="svg10"
   inkscape:document-rotation="0" />
 <defs
   id="defs4">
  <style
   type="text/css"
   id="style2">
   
    .fil0 {fill:#FEFEFE}
   
  </style>
 </defs>
 <g
   id="Layer_x0020_1"
   style="fill:#ffffff">
  <metadata
   id="CorelCorpID_0Corel-Layer" />
  <polygon
   id="iconmonstr-pencil-6.svg"
   class="fil0"
   points="25.24,10.14 28.59,6.78 21.81,0 18.46,3.36 "
   style="fill:#ffffff" />
  <path
   id="iconmonstr-pencil-6.svg_0"
   class="fil0"
   d="M16.77 5.04l-15.06 15.06 -1.71 8.49 8.49 -1.71 15.06 -15.06 -6.78 -6.78 -0 0zm0 3.37l3.41 3.41 -12.87 12.87 -4.27 0.86 0.86 -4.27 12.87 -12.87 -0 0z"
   style="fill:#ffffff" />
 </g>
</svg>
