<?xml version="1.0" encoding="UTF-8" standalone="no"?>
<svg
   xmlns:dc="http://purl.org/dc/elements/1.1/"
   xmlns:cc="http://creativecommons.org/ns#"
   xmlns:rdf="http://www.w3.org/1999/02/22-rdf-syntax-ns#"
   xmlns:svg="http://www.w3.org/2000/svg"
   xmlns="http://www.w3.org/2000/svg"
   xmlns:sodipodi="http://sodipodi.sourceforge.net/DTD/sodipodi-0.dtd"
   xmlns:inkscape="http://www.inkscape.org/namespaces/inkscape"
   xml:space="preserve"
   width="354.3307px"
   height="354.3307px"
   version="1.1"
   style="shape-rendering:geometricPrecision; text-rendering:geometricPrecision; image-rendering:optimizeQuality; fill-rule:evenodd; clip-rule:evenodd"
   viewBox="0.0 -5.045000000000002 90.83 90.83"
   id="svg2"
   inkscape:version="1.0.1 (3bc2e813f5, 2020-09-07)"
   sodipodi:docname="fast-backward_color.svg"><metadata
     id="metadata16"><rdf:RDF><cc:Work
         rdf:about=""><dc:format>image/svg+xml</dc:format><dc:type
           rdf:resource="http://purl.org/dc/dcmitype/StillImage" /><dc:title /></cc:Work></rdf:RDF></metadata><sodipodi:namedview
     pagecolor="#ffffff"
     bordercolor="#666666"
     borderopacity="1"
     objecttolerance="10"
     gridtolerance="10"
     guidetolerance="10"
     inkscape:pageopacity="0"
     inkscape:pageshadow="2"
     inkscape:window-width="1920"
     inkscape:window-height="979"
     id="namedview14"
     showgrid="false"
     inkscape:zoom="1"
     inkscape:cx="236.92104"
     inkscape:cy="158.03193"
     inkscape:window-x="0"
     inkscape:window-y="36"
     inkscape:window-maximized="1"
     inkscape:current-layer="svg2"
     inkscape:document-rotation="0"
     showguides="false" /><defs
     id="defs4"><style
       type="text/css"
       id="style6">
    .fil2 {fill:#EC691F}
    .fil0 {fill:black}
    .fil1 {fill:white}
   </style></defs><rect
     class="fil0"
     x="-1075.45"
     y="-1636.6001"
     width="2825.8899"
     height="3996.6101"
     id="rect8"
     style="opacity:0"
     transform="scale(-1)" /><polygon
     id="iconmonstr-arrow-66.svg"
     class="fil1"
     points="9.52,0 50.46,40.36 9.52,80.74 0,71.22 31.42,40.36 0,9.52 "
     transform="rotate(180,45.415,40.37)" /><polygon
     id="iconmonstr-arrow-66.svg_0"
     class="fil2"
     points="49.89,0 90.83,40.36 49.89,80.74 40.37,71.22 71.79,40.36 40.37,9.52 "
     transform="rotate(180,45.415,40.37)"
     style="fill:#5ea796;fill-opacity:1" /></svg>
