<?xml version="1.0" encoding="UTF-8" standalone="no"?>
<svg
   xmlns:dc="http://purl.org/dc/elements/1.1/"
   xmlns:cc="http://creativecommons.org/ns#"
   xmlns:rdf="http://www.w3.org/1999/02/22-rdf-syntax-ns#"
   xmlns:svg="http://www.w3.org/2000/svg"
   xmlns="http://www.w3.org/2000/svg"
   xmlns:sodipodi="http://sodipodi.sourceforge.net/DTD/sodipodi-0.dtd"
   xmlns:inkscape="http://www.inkscape.org/namespaces/inkscape"
   xml:space="preserve"
   width="216px"
   height="196px"
   version="1.1"
   style="shape-rendering:geometricPrecision; text-rendering:geometricPrecision; image-rendering:optimizeQuality; fill-rule:evenodd; clip-rule:evenodd"
   viewBox="0 0 276.53 250.96"
   id="svg13"
   sodipodi:docname="clean_tank3.svg"
   inkscape:version="1.0.1 (3bc2e813f5, 2020-09-07)"><metadata
   id="metadata17"><rdf:RDF><cc:Work
       rdf:about=""><dc:format>image/svg+xml</dc:format><dc:type
         rdf:resource="http://purl.org/dc/dcmitype/StillImage" /><dc:title></dc:title></cc:Work></rdf:RDF></metadata><sodipodi:namedview
   pagecolor="#ffffff"
   bordercolor="#666666"
   borderopacity="1"
   objecttolerance="10"
   gridtolerance="10"
   guidetolerance="10"
   inkscape:pageopacity="0"
   inkscape:pageshadow="2"
   inkscape:window-width="1920"
   inkscape:window-height="1171"
   id="namedview15"
   showgrid="false"
   inkscape:zoom="4.2908163"
   inkscape:cx="92.618312"
   inkscape:cy="98"
   inkscape:window-x="1"
   inkscape:window-y="0"
   inkscape:window-maximized="1"
   inkscape:current-layer="svg13" />
 <defs
   id="defs4">
  <style
   type="text/css"
   id="style2">
   <![CDATA[
    .fil0 {fill:black;fill-rule:nonzero}
    .fil1 {fill:#FA6831;fill-rule:nonzero}
   ]]>
  </style>






  </defs>
 <path
   class="fil0"
   d="m 275.35,116.18 c 4.82,7.41 -6.41,14.72 -11.23,7.29 C 240.36,86.82 239.49,79.09 222.72,39.54 213.93,18.79 168.73,11.58 143.37,14.54 107.49,18.73 80.69,38.89 75.8,41.36 61.13,48.79 56.4,55.09 48.15,58.91 55.55,43.32 55.32,37.86 73.86,26.74 103.1,9.21 138.16,-4.17 170.24,1.2 c 23.48,3.92 54.64,9.14 64.82,33.14 16.37,38.6 17.08,46.03 40.29,81.84 z M 141.7,48.11 c 0.71,-0.92 1.41,-1.79 2.13,-2.61 l -8.04,-0.23 c 2.02,0.93 3.99,1.88 5.91,2.84 z m 17.32,-6.19 -0.83,0.61 1.19,-0.51 z m 3.25,-6.41 c 15.79,4.29 19.75,13.87 20.19,29.23 9.03,0.95 18.26,-3.03 19.31,5.69 1.64,13.68 -28.5,6.5 -33.2,5.03 -16.98,-5.32 -61.51,-34.87 -75.17,-22.74 -5.95,5.29 3.83,16.51 15.96,21.5 14.75,6.06 37.5,15.99 49.03,25.7 13.67,11.51 38.13,61.34 46.24,67.45 8.49,6.4 19.35,16.01 27.26,26.88 5.18,7.12 -5.62,15.02 -10.82,7.87 -8.88,-12.2 -20.39,-20.83 -24.96,-24.37 -6.64,-5.15 -20.89,-29.93 -29.02,-43.45 -12.8,10.44 -31.37,4.74 -28.6,-10.31 -3.31,3.72 -6.43,4.6 -10.79,6.23 l -3.61,-12.78 c 7.74,-3.4 7.13,-6.49 12.63,-15.61 l -7.75,-4.1 -6.98,13.2 -6.75,-16.04 1.58,-2.94 C 101.73,85.38 86.58,80.52 80.19,65.43 72.9,48.24 86.34,34.42 109.23,37.04 c 0.96,0.11 1.96,0.25 2.99,0.43 4.77,-0.45 20.28,-10.92 50.05,-1.96 z m -1.54,13.62 -6.88,5.25 c 5.02,2.61 10.02,5.12 15.03,7.02 -0.58,-7.55 -2.18,-10.08 -8.15,-12.27 z m -5.1,67.84 -3.78,9.1 c 2.87,0.8 5.93,-1.21 7.95,-3.21 z"
   id="path7"
   style="fill:#ffffff" /><path
   class="fil1"
   d="m 14.86,199.37 c -2.02,12.39 -2.57,23.68 0.07,30.34 3.5,-1.5 7.29,-2.44 10.91,-3.35 6.42,-1.6 12.18,-3.03 12.18,-6.99 0,-2.34 -4.27,-4.43 -8.75,-6.63 -6.57,-3.22 -13.46,-6.61 -14.41,-13.37 z M 57.6,45.24 c 9.76,-9.54 13.6,-13.3 25.59,-10.01 1.91,0.53 3.62,1.27 5.17,2.17 0.86,0.51 1.66,1.06 2.41,1.65 -4.92,2 -8.59,5.2 -10.65,9.2 -2.48,-0.86 -5.17,-0.7 -7.9,0.18 C 61.13,55.36 55.02,69.18 48.06,95.28 35.47,141.11 35,144.79 30.49,180.51 l -0.16,1.28 c 9.91,-2.87 12.75,-3.59 26.78,-2.56 14.04,1.03 28.02,3.87 37.32,8.2 l 0.34,-5.68 c 1.78,-30.09 4.19,-70.59 -0.01,-100.17 6.57,4.08 14.33,7 22.06,10.37 l 6.15,2.93 c 3.71,8.38 6.91,16.86 9.52,25.99 3.52,12.3 5.99,25.78 7.25,41.77 0.37,1.79 0.29,3.55 -0.18,5.27 -0.47,1.73 -1.32,3.38 -2.48,4.95 -0.69,0.93 -1.5,1.84 -2.4,2.72 l -0.97,0.91 c 1.17,3.92 1.87,7.88 1.97,11.88 0.11,4.89 -0.66,9.79 -2.54,14.71 -2.33,6.08 -4.66,7.84 -6.36,9.13 -0.42,0.31 -0.71,0.53 -0.76,1.47 -0.25,4.1 1.46,8.03 3.14,11.89 2.06,4.74 4.1,9.41 3.52,15.09 l -1.04,10.3 -6.14,-3.53 c -3.83,-2.21 -4.34,-2.51 -10.2,-4.65 l -2.36,-0.89 c -0.77,-0.29 -1.44,-0.57 -1.99,-0.85 -2.24,-1.13 -5.07,-2.02 -7.87,-2.9 -2.22,-0.7 -4.43,-1.39 -6.56,-2.27 -7.73,-3.19 -12.89,-7.95 -8.27,-19.14 0.48,-1.15 1.14,-2.27 1.9,-3.54 1.41,-2.36 3.2,-5.39 3.58,-8.51 v -2.43 c 0,-0.04 -0.78,-0.53 -2.08,-1.31 -2.36,-1.42 -5.84,-2.79 -9.81,-3.96 -6.11,-1.81 -13.3,-3.1 -20.64,-3.89 -7.88,-0.84 -4.44,-1.14 -11.41,-0.81 -6.55,0.32 -12.39,1.09 -16.58,2.34 -2.86,0.86 -4.68,1.72 -4.92,2.53 -0.08,0.28 0.4,-0.16 0.84,0.18 1.38,1.03 3.57,2.12 5.83,3.24 3.7,1.83 7.54,3.74 10.65,6.46 3.48,3.06 5.85,6.93 5.85,12.34 0,14.55 -11.28,17.29 -22.15,19.94 -4.78,1.16 -9.48,2.3 -12.2,4.5 l -4.49,3.63 -4.25,-3.91 C -1.54,234.4 -1.59,214 2.76,190.82 6.65,170.07 39.51,61.08 57.6,45.24 Z m 51.71,52.42 c 0.41,5.96 0.67,12.09 0.8,18.27 0.21,10.02 0.1,20.14 -0.18,29.78 2.71,-0.32 5.58,-0.28 8.41,0.11 2.08,0.28 4.15,0.76 6.12,1.41 -1.71,-11.06 -4.18,-20.85 -7.31,-30.07 -2.28,-6.7 -4.91,-13.11 -7.84,-19.5 z m -0.79,78.76 -0.23,3.73 c -0.52,8.39 -1.12,17.89 -1.12,22.1 v 3.54 h -0.11 c -0.57,6.32 -3.26,10.72 -5.17,13.84 -0.57,0.93 -1.06,1.72 -1.25,2.19 -0.37,0.91 0.26,1.41 1.24,1.81 0.89,0.37 2.13,0.75 3.39,1.12 l 1.3,0.41 c 1.72,0.52 3.49,1.08 5.05,1.63 1.41,0.52 2.83,1.08 4.21,1.72 -0.37,-0.87 -0.71,-1.72 -1.01,-2.52 -1.23,-3.36 -2.67,-9.01 -2.09,-14.13 0.45,-4.01 2.09,-7.73 5.78,-10.09 0.83,-0.53 1.58,-1.99 2.2,-3.74 1.05,-2.99 1.51,-6.48 1.51,-8.43 0,-5.17 -5.22,-8.21 -10.58,-11.33 -1.04,-0.61 -2.09,-1.22 -3.12,-1.85 z m 4.17,-17.49 c -0.55,0.03 -1.11,0.08 -1.64,0.16 -0.43,0.06 -0.84,0.13 -1.22,0.22 0.7,1.94 2.53,3.58 4.79,5.12 -0.71,-1.84 -1.38,-3.67 -1.93,-5.5 z"
   id="path9"
   style="fill:#5ea796;fill-opacity:1" />
</svg>
