<?xml version="1.0" encoding="UTF-8" standalone="no"?>
<svg
   xmlns:dc="http://purl.org/dc/elements/1.1/"
   xmlns:cc="http://creativecommons.org/ns#"
   xmlns:rdf="http://www.w3.org/1999/02/22-rdf-syntax-ns#"
   xmlns:svg="http://www.w3.org/2000/svg"
   xmlns="http://www.w3.org/2000/svg"
   xmlns:sodipodi="http://sodipodi.sourceforge.net/DTD/sodipodi-0.dtd"
   xmlns:inkscape="http://www.inkscape.org/namespaces/inkscape"
   xml:space="preserve"
   width="354.3307px"
   height="354.3307px"
   version="1.1"
   style="shape-rendering:geometricPrecision; text-rendering:geometricPrecision; image-rendering:optimizeQuality; fill-rule:evenodd; clip-rule:evenodd"
   viewBox="-4.635000000000005 0.0 75.54 75.54"
   id="svg14"
   sodipodi:docname="tower_sensitivity_color.svg"><metadata
   id="metadata18"><rdf:RDF><cc:Work
       rdf:about=""><dc:format>image/svg+xml</dc:format><dc:type
         rdf:resource="http://purl.org/dc/dcmitype/StillImage" /></cc:Work></rdf:RDF></metadata><sodipodi:namedview
   pagecolor="#ffffff"
   bordercolor="#666666"
   borderopacity="1"
   objecttolerance="10"
   gridtolerance="10"
   guidetolerance="10"
   inkscape:pageopacity="0"
   inkscape:pageshadow="2"
   inkscape:window-width="640"
   inkscape:window-height="480"
   id="namedview16" />
 <defs
   id="defs4">
  <style
   type="text/css"
   id="style2">
   
    .fil0 {fill:#FF6600}
    .fil2 {fill:white}
    .fil1 {fill:white;fill-rule:nonzero}
   
  </style>
 </defs>
 <g
   id="Značky_x0020_a_x0020_spadávky">
  <metadata
   id="CorelCorpID_0Corel-Layer" />
  <polygon
   class="fil0"
   points="-0,24.76 22.85,24.76 22.85,0 43.42,0 43.42,24.76 66.27,24.76 66.27,35.81 -0,35.81 "
   id="polygon7" />
  <polygon
   class="fil1"
   points="15.39,75.54 15.39,62.29 2.2,62.29 2.2,56.74 15.39,56.74 15.39,43.56 21.01,43.56 21.01,56.74 34.19,56.74 34.19,62.29 21.01,62.29 21.01,75.54 "
   id="polygon9" />
  <rect
   class="fil2"
   x="41.88"
   y="56.74"
   width="22.19"
   height="5.55"
   id="rect11" />
 </g>
</svg>
