<?xml version="1.0" encoding="UTF-8" standalone="no"?>
<svg
   xmlns:dc="http://purl.org/dc/elements/1.1/"
   xmlns:cc="http://creativecommons.org/ns#"
   xmlns:rdf="http://www.w3.org/1999/02/22-rdf-syntax-ns#"
   xmlns:svg="http://www.w3.org/2000/svg"
   xmlns="http://www.w3.org/2000/svg"
   xmlns:sodipodi="http://sodipodi.sourceforge.net/DTD/sodipodi-0.dtd"
   xmlns:inkscape="http://www.inkscape.org/namespaces/inkscape"
   xml:space="preserve"
   width="354.3307px"
   height="354.3307px"
   version="1.1"
   style="shape-rendering:geometricPrecision; text-rendering:geometricPrecision; image-rendering:optimizeQuality; fill-rule:evenodd; clip-rule:evenodd"
   viewBox="0.0 0.0 112.08 112.08"
   id="svg2"
   inkscape:version="0.91 r13725"
   sodipodi:docname="support_small_white.svg"><metadata
     id="metadata21"><rdf:RDF><cc:Work
         rdf:about=""><dc:format>image/svg+xml</dc:format><dc:type
           rdf:resource="http://purl.org/dc/dcmitype/StillImage" /><dc:title /></cc:Work></rdf:RDF></metadata><sodipodi:namedview
     pagecolor="#ffffff"
     bordercolor="#666666"
     borderopacity="1"
     objecttolerance="10"
     gridtolerance="10"
     guidetolerance="10"
     inkscape:pageopacity="0"
     inkscape:pageshadow="2"
     inkscape:window-width="1418"
     inkscape:window-height="963"
     id="namedview19"
     showgrid="false"
     inkscape:zoom="6.6603111"
     inkscape:cx="-18.842963"
     inkscape:cy="17.71689"
     inkscape:window-x="0"
     inkscape:window-y="0"
     inkscape:window-maximized="0"
     inkscape:current-layer="svg2"
     inkscape:document-rotation="0" /><defs
     id="defs4"><style
       type="text/css"
       id="style6">
    .fil0 {fill:black}
    .fil2 {fill:#FF6600}
    .fil1 {fill:white}
   </style></defs><rect
     class="fil0"
     x="-1676.88"
     y="-2844.68"
     width="2353.74"
     height="3328.86"
     id="rect8"
     style="fill:#000000;fill-opacity:0" /><path
     style="fill:#ffffff"
     inkscape:connector-curvature="0"
     id="path12"
     d="m 79.14,79.14 c -12.76,12.75 -33.43,12.75 -46.19,0 -12.75,-12.76 -12.75,-33.43 0,-46.19 12.76,-12.75 33.43,-12.75 46.19,0 12.75,12.76 12.75,33.43 0,46.19 z m 0.26,-23.1 c 0,12.88 -10.48,23.35 -23.35,23.35 -12.87,0 -23.35,-10.48 -23.35,-23.35 0,-12.87 10.48,-23.35 23.35,-23.35 12.87,0 23.35,10.48 23.35,23.35 z"
     class="fil1" /><path
     style="fill:#ffffff"
     inkscape:connector-curvature="0"
     d="m 0,56.04 c 0,30.95 25.09,56.04 56.04,56.04 30.95,0 56.04,-25.09 56.04,-56.04 C 112.08,25.09 86.99,0 56.04,0 25.09,0 0,25.09 0,56.04 Z m 89.01,32.97 c 18.21,-18.21 18.21,-47.73 0,-65.93 -18.21,-18.21 -47.73,-18.21 -65.93,0 -18.21,18.21 -18.21,47.73 0,65.93 18.21,18.21 47.73,18.21 65.93,0 z"
     class="fil1"
     id="iconmonstr-lifebuoy-3.svg" /><path
     style="fill:#ffffff"
     inkscape:connector-curvature="0"
     d="M 97.92,35.51 85.74,42.44 C 82.46,35.31 76.71,29.56 69.57,26.31 L 76.5,14.13 c 9.29,4.56 16.84,12.09 21.41,21.38 z"
     class="fil2"
     id="iconmonstr-lifebuoy-3.svg_0" /><path
     style="fill:#ffffff"
     inkscape:connector-curvature="0"
     d="M 35.57,14.13 42.5,26.3 c -7.14,3.25 -12.9,9 -16.17,16.14 L 14.15,35.51 C 18.72,26.23 26.27,18.69 35.56,14.13 Z"
     class="fil2"
     id="iconmonstr-lifebuoy-3.svg_1" /><path
     style="fill:#ffffff"
     inkscape:connector-curvature="0"
     d="M 76.51,97.96 69.58,85.78 c 7.14,-3.25 12.9,-9 16.17,-16.13 l 12.18,6.94 C 93.36,85.87 85.81,93.41 76.52,97.97 l 0,0 z"
     class="fil2"
     id="iconmonstr-lifebuoy-3.svg_2" /><path
     style="fill:#ffffff"
     inkscape:connector-curvature="0"
     d="m 14.16,76.58 12.18,-6.94 c 3.28,7.13 9.03,12.88 16.17,16.13 L 35.57,97.95 C 26.28,93.39 18.73,85.85 14.16,76.57 l 0,0 z"
     class="fil2"
     id="iconmonstr-lifebuoy-3.svg_3" /></svg>
