<?xml version="1.0" encoding="UTF-8" standalone="no"?>
<svg
   xmlns:dc="http://purl.org/dc/elements/1.1/"
   xmlns:cc="http://creativecommons.org/ns#"
   xmlns:rdf="http://www.w3.org/1999/02/22-rdf-syntax-ns#"
   xmlns:svg="http://www.w3.org/2000/svg"
   xmlns="http://www.w3.org/2000/svg"
   xmlns:sodipodi="http://sodipodi.sourceforge.net/DTD/sodipodi-0.dtd"
   xmlns:inkscape="http://www.inkscape.org/namespaces/inkscape"
   xml:space="preserve"
   width="354.3307px"
   height="354.3307px"
   version="1.1"
   style="shape-rendering:geometricPrecision; text-rendering:geometricPrecision; image-rendering:optimizeQuality; fill-rule:evenodd; clip-rule:evenodd"
   viewBox="0.0 -31.820000000000007 254.55 254.55"
   id="svg10"
   sodipodi:docname="upload_cloud_color_black.svg"
   inkscape:version="1.0 (4035a4fb49, 2020-05-01)"><metadata
   id="metadata14"><rdf:RDF><cc:Work
       rdf:about=""><dc:format>image/svg+xml</dc:format><dc:type
         rdf:resource="http://purl.org/dc/dcmitype/StillImage" /></cc:Work></rdf:RDF></metadata><sodipodi:namedview
   inkscape:document-rotation="0"
   pagecolor="#ffffff"
   bordercolor="#666666"
   borderopacity="1"
   objecttolerance="10"
   gridtolerance="10"
   guidetolerance="10"
   inkscape:pageopacity="0"
   inkscape:pageshadow="2"
   inkscape:window-width="3784"
   inkscape:window-height="2134"
   id="namedview12"
   showgrid="false"
   inkscape:zoom="22.627417"
   inkscape:cx="-18.109094"
   inkscape:cy="28.522422"
   inkscape:window-x="56"
   inkscape:window-y="0"
   inkscape:window-maximized="1"
   inkscape:current-layer="svg10" />
 <defs
   id="defs4">
  <style
   type="text/css"
   id="style2">
   
    .fil0 {fill:#FEFEFE}
   
  </style>
 
  
  
  
 </defs>
 <path
   style="fill:#000000;fill-opacity:1"
   d="M 206.6,75.22 C 204.35,33.31 169.76,0 127.28,0 84.79,0 50.2,33.32 47.96,75.22 20.7,80.13 0.01,103.92 0.01,132.58 c 0,32.21 26.12,58.33 58.33,58.33 H 95.46 V 169.7 H 58.34 c -20.47,0 -37.12,-16.65 -37.12,-37.12 0,-29.66 26.29,-40.65 47.02,-39.46 -1.77,-44.74 23.42,-71.91 59.04,-71.91 36.62,0 62.48,29.66 59.04,71.91 18.51,-0.49 47.02,7.97 47.02,39.46 0,20.47 -16.65,37.12 -37.12,37.12 H 159.1 v 21.21 h 37.12 c 32.21,0 58.33,-26.12 58.33,-58.33 0,-28.66 -20.69,-52.45 -47.95,-57.36 z"
   class="fil0"
   id="iconmonstr-upload-17.svg" /><polygon
   points="137.88,190.91 116.67,190.91 116.67,137.88 84.85,137.88 127.28,95.45 169.7,137.88 137.88,137.88 "
   class="fil0"
   id="iconmonstr-upload-17.svg_0"
   style="fill:#ed6b21;fill-opacity:1" />
</svg>
