<?xml version="1.0" encoding="UTF-8" standalone="no"?>
<svg
   xmlns:dc="http://purl.org/dc/elements/1.1/"
   xmlns:cc="http://creativecommons.org/ns#"
   xmlns:rdf="http://www.w3.org/1999/02/22-rdf-syntax-ns#"
   xmlns:svg="http://www.w3.org/2000/svg"
   xmlns="http://www.w3.org/2000/svg"
   xmlns:sodipodi="http://sodipodi.sourceforge.net/DTD/sodipodi-0.dtd"
   xmlns:inkscape="http://www.inkscape.org/namespaces/inkscape"
   xml:space="preserve"
   width="354.3307px"
   height="354.3307px"
   version="1.1"
   style="shape-rendering:geometricPrecision; text-rendering:geometricPrecision; image-rendering:optimizeQuality; fill-rule:evenodd; clip-rule:evenodd"
   viewBox="-1.665000000000001 0.0 30.000000000000004 30.0"
   id="svg10"
   sodipodi:docname="move_up_fast_color.svg"
   inkscape:version="1.0.1 (3bc2e813f5, 2020-09-07)"><metadata
   id="metadata14"><rdf:RDF><cc:Work
       rdf:about=""><dc:format>image/svg+xml</dc:format><dc:type
         rdf:resource="http://purl.org/dc/dcmitype/StillImage" /></cc:Work></rdf:RDF></metadata><sodipodi:namedview
   pagecolor="#ffffff"
   bordercolor="#666666"
   borderopacity="1"
   objecttolerance="10"
   gridtolerance="10"
   guidetolerance="10"
   inkscape:pageopacity="0"
   inkscape:pageshadow="2"
   inkscape:window-width="1920"
   inkscape:window-height="979"
   id="namedview12"
   inkscape:document-rotation="0"
   showgrid="false"
   inkscape:zoom="2.373489"
   inkscape:cx="149.35818"
   inkscape:cy="177.16534"
   inkscape:window-x="0"
   inkscape:window-y="36"
   inkscape:window-maximized="1"
   inkscape:current-layer="svg10" />
 <defs
   id="defs4">
  <style
   type="text/css"
   id="style2">
   
    .fil1 {fill:#EC691F}
    .fil0 {fill:white}
   
  </style>
 
  
  
  
 </defs>
 <polygon
   id="iconmonstr-arrow-66.svg"
   class="fil0"
   points="13.33,19.62 3.14,30 0,26.86 13.33,13.33 26.67,26.86 23.52,30 " /><polygon
   id="iconmonstr-arrow-66.svg_0"
   class="fil1"
   points="13.33,6.29 3.14,16.67 0,13.52 13.33,0 26.67,13.52 23.52,16.67 "
   style="fill:#5ea796;fill-opacity:1" />
</svg>
