<?xml version="1.0" encoding="UTF-8" standalone="no"?>
<svg
   xmlns:dc="http://purl.org/dc/elements/1.1/"
   xmlns:cc="http://creativecommons.org/ns#"
   xmlns:rdf="http://www.w3.org/1999/02/22-rdf-syntax-ns#"
   xmlns:svg="http://www.w3.org/2000/svg"
   xmlns="http://www.w3.org/2000/svg"
   xmlns:sodipodi="http://sodipodi.sourceforge.net/DTD/sodipodi-0.dtd"
   xmlns:inkscape="http://www.inkscape.org/namespaces/inkscape"
   xml:space="preserve"
   width="354.3307px"
   height="354.3307px"
   version="1.1"
   style="shape-rendering:geometricPrecision; text-rendering:geometricPrecision; image-rendering:optimizeQuality; fill-rule:evenodd; clip-rule:evenodd"
   viewBox="0.0 -9.784999999999997 56.65 56.64999999999999"
   id="svg14"
   sodipodi:docname="uv_calibration.svg"
   inkscape:version="1.0.1 (3bc2e813f5, 2020-09-07)"><metadata
   id="metadata18"><rdf:RDF><cc:Work
       rdf:about=""><dc:format>image/svg+xml</dc:format><dc:type
         rdf:resource="http://purl.org/dc/dcmitype/StillImage" /></cc:Work></rdf:RDF></metadata><sodipodi:namedview
   pagecolor="#ffffff"
   bordercolor="#666666"
   borderopacity="1"
   objecttolerance="10"
   gridtolerance="10"
   guidetolerance="10"
   inkscape:pageopacity="0"
   inkscape:pageshadow="2"
   inkscape:window-width="1920"
   inkscape:window-height="979"
   id="namedview16"
   inkscape:document-rotation="0"
   showgrid="false"
   inkscape:zoom="2.373489"
   inkscape:cx="149.35818"
   inkscape:cy="177.16534"
   inkscape:window-x="0"
   inkscape:window-y="36"
   inkscape:window-maximized="1"
   inkscape:current-layer="svg14" />
 <defs
   id="defs4">
  <style
   type="text/css"
   id="style2">
   
    .fil0 {fill:white}
    .fil1 {fill:#FF6600;fill-rule:nonzero}
   
  </style>
 
  
  
  
  
 </defs>
 <rect
   class="fil0"
   x="0"
   width="56.650002"
   height="4.5300002"
   id="rect7"
   y="0" /><rect
   class="fil0"
   x="15.14"
   y="32.549999"
   width="26.379999"
   height="4.5300002"
   id="rect9" /><path
   class="fil1"
   d="m 17.94,28.55 c 0.24,0.71 -0.14,1.49 -0.85,1.73 -0.71,0.24 -1.49,-0.14 -1.73,-0.85 L 8.48,9.32 C 8.24,8.61 8.62,7.83 9.33,7.59 c 0.71,-0.24 1.49,0.14 1.73,0.85 z m 23.35,0.88 c -0.24,0.71 -1.02,1.1 -1.73,0.85 -0.71,-0.24 -1.1,-1.02 -0.85,-1.73 L 45.59,8.44 c 0.24,-0.71 1.02,-1.1 1.73,-0.85 0.71,0.24 1.1,1.02 0.85,1.73 z M 35.73,8.69 c 0.11,-0.75 0.8,-1.26 1.54,-1.16 0.75,0.11 1.26,0.8 1.16,1.54 l -2.92,20.11 c -0.11,0.75 -0.8,1.26 -1.54,1.16 -0.75,-0.11 -1.26,-0.8 -1.16,-1.54 z m -6.04,20.3 c 0,0.75 -0.61,1.37 -1.37,1.37 -0.75,0 -1.37,-0.61 -1.37,-1.37 V 8.88 c 0,-0.75 0.61,-1.37 1.37,-1.37 0.75,0 1.37,0.61 1.37,1.37 z M 23.84,28.8 c 0.11,0.75 -0.41,1.44 -1.16,1.54 -0.75,0.11 -1.44,-0.41 -1.54,-1.16 L 18.22,9.07 c -0.11,-0.75 0.41,-1.44 1.16,-1.54 0.75,-0.11 1.44,0.41 1.54,1.16 z"
   id="path11"
   style="fill:#5ea796;fill-opacity:1" />
</svg>
