<?xml version="1.0" encoding="UTF-8" standalone="no"?>
<svg
   xmlns:dc="http://purl.org/dc/elements/1.1/"
   xmlns:cc="http://creativecommons.org/ns#"
   xmlns:rdf="http://www.w3.org/1999/02/22-rdf-syntax-ns#"
   xmlns:svg="http://www.w3.org/2000/svg"
   xmlns="http://www.w3.org/2000/svg"
   xmlns:sodipodi="http://sodipodi.sourceforge.net/DTD/sodipodi-0.dtd"
   xmlns:inkscape="http://www.inkscape.org/namespaces/inkscape"
   xml:space="preserve"
   width="354.3307px"
   height="354.3307px"
   version="1.1"
   style="shape-rendering:geometricPrecision; text-rendering:geometricPrecision; image-rendering:optimizeQuality; fill-rule:evenodd; clip-rule:evenodd"
   viewBox="0.0 -2.019999999999996 48.46 48.459999999999994"
   id="svg11"
   sodipodi:docname="language_color.svg"><metadata
   id="metadata15"><rdf:RDF><cc:Work
       rdf:about=""><dc:format>image/svg+xml</dc:format><dc:type
         rdf:resource="http://purl.org/dc/dcmitype/StillImage" /></cc:Work></rdf:RDF></metadata><sodipodi:namedview
   pagecolor="#ffffff"
   bordercolor="#666666"
   borderopacity="1"
   objecttolerance="10"
   gridtolerance="10"
   guidetolerance="10"
   inkscape:pageopacity="0"
   inkscape:pageshadow="2"
   inkscape:window-width="640"
   inkscape:window-height="480"
   id="namedview13" />
 <defs
   id="defs4">
  <style
   type="text/css"
   id="style2">
   
    .fil1 {fill:#EC691F}
    .fil0 {fill:white}
   
  </style>
 </defs>
 <g
   id="Značky_x0020_a_x0020_spadávky">
  <metadata
   id="CorelCorpID_0Corel-Layer" />
  <path
   id="iconmonstr-language-9.svg"
   class="fil0"
   d="M24.23 0c-12.8,0 -24.23,8.53 -24.23,20.2 0,4.14 1.49,8.2 4.13,11.36 0.11,3.69 -2.07,9 -4.02,12.86 5.25,-0.95 12.72,-3.04 16.11,-5.12 2.86,0.7 5.6,1.02 8.19,1.02 14.3,0 24.05,-9.77 24.05,-20.11 -0,-11.73 -11.51,-20.2 -24.23,-20.2l0 -0zm0 4.04c11.13,0 20.19,7.25 20.19,16.17 0,9.93 -10.39,16.07 -20.01,16.07 -3.91,0 -6.83,-0.8 -8.87,-1.3 -2.02,1.24 -3.22,2.09 -8.62,3.67 1.08,-2.77 1.46,-5.55 1.21,-8.61 -1.69,-2.02 -4.09,-4.85 -4.09,-9.84 0,-8.91 9.06,-16.17 20.19,-16.17l0 0z" />
  <path
   id="iconmonstr-language-9.svg_0"
   class="fil1"
   d="M35.47 18.3c0.13,-0.49 0.2,-0.86 0.27,-1.22l-2.22 -0.43 -0.22 1.01c-0.75,-0.11 -1.55,-0.12 -2.35,-0.04 0.02,-0.54 0.05,-1.07 0.1,-1.58l2.48 0 0 -2.1 -2.18 0c0.11,-0.53 0.2,-0.86 0.29,-1.16l-2.17 -0.65c-0.16,0.53 -0.29,1.05 -0.43,1.81l-2.48 0 0 2.1 2.2 0c-0.06,0.68 -0.09,1.38 -0.1,2.1 -2.44,0.89 -3.47,2.6 -3.47,4.15 0,1.83 1.44,3.43 3.72,3.23 2.83,-0.26 4.72,-2.39 5.82,-5.02 1.14,0.66 1.63,1.77 1.19,2.8 -0.4,0.95 -1.57,1.86 -3.82,1.81l0 2.26c2.49,0.04 4.94,-0.91 5.91,-3.2 0.94,-2.24 -0.13,-4.68 -2.55,-5.85zm-6.74 2.28c0.06,0.95 0.17,1.84 0.32,2.62 -2.01,0.37 -2.09,-1.62 -0.32,-2.62zm3.82 -0.73c-0.35,0.78 -0.82,1.56 -1.41,2.17 -0.09,-0.65 -0.15,-1.37 -0.19,-2.13 0.54,-0.07 1.08,-0.08 1.59,-0.04l0 0z" />
  <path
   id="iconmonstr-language-9.svg_1"
   class="fil1"
   d="M16.07 13.12l2.63 0 4.99 13.12 -2.72 0 -1.09 -3.03 -4.92 0 -1.08 3.03 -2.81 0 5 -13.12zm3.06 8l-1.73 -4.95 -1.72 4.95 3.45 0z" />
 </g>
</svg>
