<?xml version="1.0" encoding="UTF-8" standalone="no"?>
<svg
   xmlns:dc="http://purl.org/dc/elements/1.1/"
   xmlns:cc="http://creativecommons.org/ns#"
   xmlns:rdf="http://www.w3.org/1999/02/22-rdf-syntax-ns#"
   xmlns:svg="http://www.w3.org/2000/svg"
   xmlns="http://www.w3.org/2000/svg"
   xmlns:sodipodi="http://sodipodi.sourceforge.net/DTD/sodipodi-0.dtd"
   xmlns:inkscape="http://www.inkscape.org/namespaces/inkscape"
   xml:space="preserve"
   width="354.3307px"
   height="354.3307px"
   version="1.1"
   style="shape-rendering:geometricPrecision; text-rendering:geometricPrecision; image-rendering:optimizeQuality; fill-rule:evenodd; clip-rule:evenodd"
   viewBox="0.0 0.0 16.63 16.63"
   id="svg13"
   sodipodi:docname="lan.svg"><metadata
   id="metadata17"><rdf:RDF><cc:Work
       rdf:about=""><dc:format>image/svg+xml</dc:format><dc:type
         rdf:resource="http://purl.org/dc/dcmitype/StillImage" /></cc:Work></rdf:RDF></metadata><sodipodi:namedview
   pagecolor="#ffffff"
   bordercolor="#666666"
   borderopacity="1"
   objecttolerance="10"
   gridtolerance="10"
   guidetolerance="10"
   inkscape:pageopacity="0"
   inkscape:pageshadow="2"
   inkscape:window-width="640"
   inkscape:window-height="480"
   id="namedview15" />
 <defs
   id="defs4">
  <style
   type="text/css"
   id="style2">
   
    .fil0 {fill:black}
   
  </style>
 </defs>
 <g
   id="Layer_x0020_1">
  <metadata
   id="CorelCorpID_0Corel-Layer" />
  <path
   id="iconmonstr-sitemap-6.svg"
   class="fil0"
   d="M10.39 12.47l-4.16 0 0 4.16 4.16 0 0 -4.16zm-1.39 1.39l0 1.39 -1.39 -0 0 -1.39 1.39 0z" />
  <polygon
   id="iconmonstr-sitemap-6.svg_0"
   class="fil0"
   points="9.01,7.62 9.01,5.54 7.62,5.54 7.62,7.62 1.39,7.62 1.39,11.08 2.77,11.08 2.77,9.01 7.62,9.01 7.62,11.08 9.01,11.08 9.01,9.01 13.86,9.01 13.86,11.08 15.24,11.08 15.24,7.62 " />
  <path
   id="iconmonstr-sitemap-6.svg_1"
   class="fil0"
   d="M16.63 12.47l-4.16 0 0 4.16 4.16 0 0 -4.16zm-1.39 1.39l0 1.39 -1.39 -0 0 -1.39 1.39 0z" />
  <path
   id="iconmonstr-sitemap-6.svg_2"
   class="fil0"
   d="M4.16 12.47l-4.16 0 0 4.16 4.16 0 0 -4.16zm-1.39 1.39l0 1.39 -1.39 -0 0 -1.39 1.39 0z" />
  <path
   id="iconmonstr-sitemap-6.svg_3"
   class="fil0"
   d="M11.08 0l-5.54 0 0 4.16 5.54 0 0 -4.16zm-1.39 1.39l0 1.39 -2.77 -0 0 -1.39 2.77 0z" />
 </g>
</svg>
