<?xml version="1.0" encoding="UTF-8" standalone="no"?>
<svg
   xmlns:dc="http://purl.org/dc/elements/1.1/"
   xmlns:cc="http://creativecommons.org/ns#"
   xmlns:rdf="http://www.w3.org/1999/02/22-rdf-syntax-ns#"
   xmlns:svg="http://www.w3.org/2000/svg"
   xmlns="http://www.w3.org/2000/svg"
   xmlns:sodipodi="http://sodipodi.sourceforge.net/DTD/sodipodi-0.dtd"
   xmlns:inkscape="http://www.inkscape.org/namespaces/inkscape"
   xml:space="preserve"
   width="354.3307px"
   height="354.3307px"
   version="1.1"
   style="shape-rendering:geometricPrecision; text-rendering:geometricPrecision; image-rendering:optimizeQuality; fill-rule:evenodd; clip-rule:evenodd"
   viewBox="0.0 0.0 56.22 56.22"
   id="svg2"
   inkscape:version="0.91 r13725"
   sodipodi:docname="print_color.svg"><metadata
     id="metadata18"><rdf:RDF><cc:Work
         rdf:about=""><dc:format>image/svg+xml</dc:format><dc:type
           rdf:resource="http://purl.org/dc/dcmitype/StillImage" /></cc:Work></rdf:RDF></metadata><sodipodi:namedview
     pagecolor="#ffffff"
     bordercolor="#666666"
     borderopacity="1"
     objecttolerance="10"
     gridtolerance="10"
     guidetolerance="10"
     inkscape:pageopacity="0"
     inkscape:pageshadow="2"
     inkscape:window-width="1483"
     inkscape:window-height="1060"
     id="namedview16"
     showgrid="false"
     inkscape:zoom="6.6581141"
     inkscape:cx="10.66368"
     inkscape:cy="17.722736"
     inkscape:window-x="0"
     inkscape:window-y="0"
     inkscape:window-maximized="0"
     inkscape:current-layer="svg2"
     inkscape:document-rotation="0" /><defs
     id="defs4"><style
       type="text/css"
       id="style6">
    .fil2 {fill:#EC691F}
    .fil0 {fill:black}
    .fil1 {fill:white;fill-rule:nonzero}
   </style></defs><rect
     class="fil0"
     x="-89.92"
     y="-177.75"
     width="1180.19"
     height="1669.12"
     id="rect8"
     style="opacity:0" /><g
     id="Layer_x0020_1"><metadata
       id="CorelCorpID_0Corel-Layer" /><path
       class="fil1"
       d="M28.1 0c24.95,0 37.53,30.31 19.87,47.97 -17.66,17.66 -47.97,5.08 -47.97,-19.87 0,-15.52 12.58,-28.1 28.1,-28.1zm15.9 12.2c-14.13,-14.12 -38.38,-4.07 -38.38,15.9 0,19.97 24.25,30.02 38.38,15.9 8.78,-8.78 8.78,-23.01 0,-31.79z"
       id="path12" /><polygon
       class="fil2"
       points="19.87,15.19 19.87,41.01 43.1,28.47 "
       id="polygon14" /></g></svg>
