<?xml version="1.0" encoding="UTF-8" standalone="no"?>
<svg
   xmlns:dc="http://purl.org/dc/elements/1.1/"
   xmlns:cc="http://creativecommons.org/ns#"
   xmlns:rdf="http://www.w3.org/1999/02/22-rdf-syntax-ns#"
   xmlns:svg="http://www.w3.org/2000/svg"
   xmlns="http://www.w3.org/2000/svg"
   xmlns:sodipodi="http://sodipodi.sourceforge.net/DTD/sodipodi-0.dtd"
   xmlns:inkscape="http://www.inkscape.org/namespaces/inkscape"
   xml:space="preserve"
   width="354.3307px"
   height="354.3307px"
   version="1.1"
   style="shape-rendering:geometricPrecision; text-rendering:geometricPrecision; image-rendering:optimizeQuality; fill-rule:evenodd; clip-rule:evenodd"
   viewBox="0.0 -1.8999999999999995 15.22 15.219999999999999"
   id="svg2"
   inkscape:version="0.91 r13725"
   sodipodi:docname="wifi_small_white.svg"><metadata
     id="metadata18"><rdf:RDF><cc:Work
         rdf:about=""><dc:format>image/svg+xml</dc:format><dc:type
           rdf:resource="http://purl.org/dc/dcmitype/StillImage" /></cc:Work></rdf:RDF></metadata><sodipodi:namedview
     pagecolor="#ffffff"
     bordercolor="#666666"
     borderopacity="1"
     objecttolerance="10"
     gridtolerance="10"
     guidetolerance="10"
     inkscape:pageopacity="0"
     inkscape:pageshadow="2"
     inkscape:window-width="1149"
     inkscape:window-height="854"
     id="namedview16"
     showgrid="false"
     inkscape:zoom="17.296262"
     inkscape:cx="6.2598526"
     inkscape:cy="6.8222835"
     inkscape:window-x="0"
     inkscape:window-y="0"
     inkscape:window-maximized="0"
     inkscape:current-layer="svg2"
     inkscape:document-rotation="0" /><defs
     id="defs4"><style
       type="text/css"
       id="style6">
    .fil0 {fill:black}
    .fil1 {fill:white}
   </style></defs><rect
     class="fil0"
     x="-54.66"
     y="-307.2"
     width="622.55"
     height="880.47"
     id="rect8"
     style="opacity:0" /><g
     id="Layer_x0020_1"><metadata
       id="CorelCorpID_0Corel-Layer" /><g
       id="_2603018612000"><path
         id="iconmonstr-wireless-1.svg"
         class="fil1"
         d="M1.51 4.95c1.56,-1.66 3.71,-2.68 6.09,-2.68 2.38,0 4.53,1.02 6.09,2.68l1.51 -1.61c-1.95,-2.07 -4.63,-3.34 -7.61,-3.34 -2.97,0 -5.66,1.28 -7.61,3.34l1.51 1.61z" /><path
         id="iconmonstr-wireless-1.svg_0"
         class="fil1"
         d="M4.1 7.69c0.9,-0.95 2.14,-1.54 3.51,-1.54 1.37,0 2.61,0.59 3.51,1.54l1.48 -1.56c-1.27,-1.35 -3.03,-2.19 -4.98,-2.19 -1.95,0 -3.71,0.83 -4.98,2.19l1.48 1.56 0 0 -0.02 0z" /><path
         id="iconmonstr-wireless-1.svg_1"
         class="fil1"
         d="M5.2 8.87c0.61,-0.65 1.46,-1.05 2.4,-1.05 0.94,0 1.79,0.4 2.4,1.05l-2.4 2.55 -2.4 -2.55z" /></g></g></svg>
