<?xml version="1.0" encoding="UTF-8" standalone="no"?>
<svg
   xmlns:dc="http://purl.org/dc/elements/1.1/"
   xmlns:cc="http://creativecommons.org/ns#"
   xmlns:rdf="http://www.w3.org/1999/02/22-rdf-syntax-ns#"
   xmlns:svg="http://www.w3.org/2000/svg"
   xmlns="http://www.w3.org/2000/svg"
   xmlns:sodipodi="http://sodipodi.sourceforge.net/DTD/sodipodi-0.dtd"
   xmlns:inkscape="http://www.inkscape.org/namespaces/inkscape"
   xml:space="preserve"
   width="354.3307px"
   height="354.3307px"
   version="1.1"
   style="shape-rendering:geometricPrecision; text-rendering:geometricPrecision; image-rendering:optimizeQuality; fill-rule:evenodd; clip-rule:evenodd"
   viewBox="0.0 0.0 69.1 69.1"
   id="svg11"
   sodipodi:docname="pause_color.svg"><metadata
   id="metadata15"><rdf:RDF><cc:Work
       rdf:about=""><dc:format>image/svg+xml</dc:format><dc:type
         rdf:resource="http://purl.org/dc/dcmitype/StillImage" /></cc:Work></rdf:RDF></metadata><sodipodi:namedview
   pagecolor="#ffffff"
   bordercolor="#666666"
   borderopacity="1"
   objecttolerance="10"
   gridtolerance="10"
   guidetolerance="10"
   inkscape:pageopacity="0"
   inkscape:pageshadow="2"
   inkscape:window-width="640"
   inkscape:window-height="480"
   id="namedview13" />
 <defs
   id="defs4">
  <style
   type="text/css"
   id="style2">
   
    .fil0 {fill:#EC691F}
    .fil1 {fill:white}
   
  </style>
 </defs>
 <g
   id="Značky_x0020_a_x0020_spadávky">
  <metadata
   id="CorelCorpID_0Corel-Layer" />
  <polygon
   id="iconmonstr-media-control-8.svg"
   class="fil0"
   points="46.06,20.15 37.43,20.15 37.43,48.94 46.06,48.94 " />
  <polygon
   id="iconmonstr-media-control-8.svg_0"
   class="fil0"
   points="31.67,48.94 23.03,48.94 23.03,20.15 31.67,20.15 " />
  <path
   id="iconmonstr-media-control-8.svg_1"
   class="fil1"
   d="M34.55 0c-19.08,0 -34.55,15.47 -34.55,34.55 0,19.08 15.47,34.55 34.55,34.55 19.08,0 34.55,-15.47 34.55,-34.55 0,-19.08 -15.47,-34.55 -34.55,-34.55zm0 5.76c15.87,0 28.79,12.92 28.79,28.79 0,15.87 -12.92,28.79 -28.79,28.79 -15.87,0 -28.79,-12.92 -28.79,-28.79 0,-15.87 12.92,-28.79 28.79,-28.79z" />
 </g>
</svg>
