<?xml version="1.0" encoding="UTF-8" standalone="no"?>
<svg
   xmlns:dc="http://purl.org/dc/elements/1.1/"
   xmlns:cc="http://creativecommons.org/ns#"
   xmlns:rdf="http://www.w3.org/1999/02/22-rdf-syntax-ns#"
   xmlns:svg="http://www.w3.org/2000/svg"
   xmlns="http://www.w3.org/2000/svg"
   xmlns:sodipodi="http://sodipodi.sourceforge.net/DTD/sodipodi-0.dtd"
   xmlns:inkscape="http://www.inkscape.org/namespaces/inkscape"
   xml:space="preserve"
   width="354.3307px"
   height="354.3307px"
   version="1.1"
   style="shape-rendering:geometricPrecision; text-rendering:geometricPrecision; image-rendering:optimizeQuality; fill-rule:evenodd; clip-rule:evenodd"
   viewBox="-1.0550000000000002 0.0 6.42 6.42"
   id="svg2"
   inkscape:version="0.91 r13725"
   sodipodi:docname="remote_small_white.svg"><metadata
     id="metadata20"><rdf:RDF><cc:Work
         rdf:about=""><dc:format>image/svg+xml</dc:format><dc:type
           rdf:resource="http://purl.org/dc/dcmitype/StillImage" /></cc:Work></rdf:RDF></metadata><sodipodi:namedview
     pagecolor="#ffffff"
     bordercolor="#666666"
     borderopacity="1"
     objecttolerance="10"
     gridtolerance="10"
     guidetolerance="10"
     inkscape:pageopacity="0"
     inkscape:pageshadow="2"
     inkscape:window-width="1050"
     inkscape:window-height="818"
     id="namedview18"
     showgrid="false"
     inkscape:zoom="16.49278"
     inkscape:cx="1.8362075"
     inkscape:cy="7.154646"
     inkscape:window-x="0"
     inkscape:window-y="0"
     inkscape:window-maximized="0"
     inkscape:current-layer="svg2"
     inkscape:document-rotation="0" /><defs
     id="defs4"><style
       type="text/css"
       id="style6">
    .fil0 {fill:black}
    .fil2 {fill:white}
    .fil1 {fill:white;fill-rule:nonzero}
   </style></defs><rect
     class="fil0"
     x="-31.22"
     y="-350.92"
     width="333.78"
     height="472.07"
     id="rect8"
     style="opacity:0" /><g
     id="Layer_x0020_1"><metadata
       id="CorelCorpID_0Corel-Layer" /><path
       class="fil1"
       d="M0.58 0l3.15 0c0.16,0 0.31,0.07 0.41,0.17l0 0c0.11,0.11 0.17,0.25 0.17,0.41l0 5.25c0,0.16 -0.07,0.31 -0.17,0.41l0 0c-0.11,0.11 -0.25,0.17 -0.41,0.17l-3.15 0c-0.16,0 -0.31,-0.07 -0.41,-0.17 -0.11,-0.11 -0.17,-0.25 -0.17,-0.41l0 -5.25c0,-0.16 0.07,-0.31 0.17,-0.41l0 0c0.11,-0.11 0.25,-0.17 0.41,-0.17l0 0zm3.15 0.53l-3.15 0c-0.01,0 -0.03,0.01 -0.03,0.01l0 0c-0.01,0.01 -0.01,0.02 -0.01,0.03l0 5.25c0,0.01 0.01,0.02 0.01,0.03 0.01,0.01 0.02,0.01 0.03,0.01l3.15 0c0.01,0 0.02,-0.01 0.03,-0.01l0 0c0.01,-0.01 0.01,-0.02 0.01,-0.03l0 -5.25c0,-0.01 -0.01,-0.03 -0.01,-0.03l-0 -0c-0.01,-0.01 -0.02,-0.01 -0.03,-0.01z"
       id="path12" /><path
       class="fil1"
       d="M1.61 1.18c-0.12,0 -0.21,-0.1 -0.21,-0.21 0,-0.12 0.1,-0.21 0.21,-0.21l1.09 0c0.12,0 0.21,0.1 0.21,0.21 0,0.12 -0.1,0.21 -0.21,0.21l-1.09 0z"
       id="path14" /><circle
       class="fil2"
       cx="2.16"
       cy="5.39"
       r="0.32"
       id="circle16" /></g></svg>
