<?xml version="1.0" encoding="UTF-8" standalone="no"?>
<svg
   xmlns:dc="http://purl.org/dc/elements/1.1/"
   xmlns:cc="http://creativecommons.org/ns#"
   xmlns:rdf="http://www.w3.org/1999/02/22-rdf-syntax-ns#"
   xmlns:svg="http://www.w3.org/2000/svg"
   xmlns="http://www.w3.org/2000/svg"
   xmlns:sodipodi="http://sodipodi.sourceforge.net/DTD/sodipodi-0.dtd"
   xmlns:inkscape="http://www.inkscape.org/namespaces/inkscape"
   xml:space="preserve"
   width="354.3307px"
   height="354.3307px"
   version="1.1"
   style="shape-rendering:geometricPrecision; text-rendering:geometricPrecision; image-rendering:optimizeQuality; fill-rule:evenodd; clip-rule:evenodd"
   viewBox="0.0 -3.552713678800501e-15 57.99 57.99000000000001"
   id="svg10"
   sodipodi:docname="time_color.svg"
   inkscape:version="1.0.1 (3bc2e813f5, 2020-09-07)"><metadata
   id="metadata14"><rdf:RDF><cc:Work
       rdf:about=""><dc:format>image/svg+xml</dc:format><dc:type
         rdf:resource="http://purl.org/dc/dcmitype/StillImage" /></cc:Work></rdf:RDF></metadata><sodipodi:namedview
   pagecolor="#ffffff"
   bordercolor="#666666"
   borderopacity="1"
   objecttolerance="10"
   gridtolerance="10"
   guidetolerance="10"
   inkscape:pageopacity="0"
   inkscape:pageshadow="2"
   inkscape:window-width="1920"
   inkscape:window-height="979"
   id="namedview12"
   inkscape:document-rotation="0"
   showgrid="false"
   inkscape:zoom="2.373489"
   inkscape:cx="149.35818"
   inkscape:cy="177.16534"
   inkscape:window-x="0"
   inkscape:window-y="36"
   inkscape:window-maximized="1"
   inkscape:current-layer="svg10" />
 <defs
   id="defs4">
  <style
   type="text/css"
   id="style2">
   
    .fil0 {fill:#EC691F}
    .fil1 {fill:white}
   
  </style>
 
  
  
  
 </defs>
 <polygon
   id="iconmonstr-time-2.svg"
   class="fil0"
   points="26.71,15.29 26.71,33.57 42.7,33.57 42.7,29 31.28,29 31.28,15.29 "
   style="fill:#5ea796;fill-opacity:1" /><path
   id="iconmonstr-time-2.svg_0"
   class="fil1"
   d="M 29,0 C 12.99,0 0,12.98 0,29 0,45.01 12.98,58 29,58 45.01,58 58,45.02 58,29 58,12.99 45.02,0 29,0 Z m 0,4.83 c 13.32,0 24.16,10.84 24.16,24.16 C 53.16,42.31 42.32,53.15 29,53.15 15.68,53.15 4.84,42.31 4.84,28.99 4.84,15.67 15.68,4.83 29,4.83 Z" />
</svg>
