<?xml version="1.0" encoding="UTF-8" standalone="no"?>
<svg
   xmlns:dc="http://purl.org/dc/elements/1.1/"
   xmlns:cc="http://creativecommons.org/ns#"
   xmlns:rdf="http://www.w3.org/1999/02/22-rdf-syntax-ns#"
   xmlns:svg="http://www.w3.org/2000/svg"
   xmlns="http://www.w3.org/2000/svg"
   xmlns:sodipodi="http://sodipodi.sourceforge.net/DTD/sodipodi-0.dtd"
   xmlns:inkscape="http://www.inkscape.org/namespaces/inkscape"
   xml:space="preserve"
   width="354.3307px"
   height="354.3307px"
   version="1.1"
   style="shape-rendering:geometricPrecision; text-rendering:geometricPrecision; image-rendering:optimizeQuality; fill-rule:evenodd; clip-rule:evenodd"
   viewBox="0.0 0.0 14.46 14.46"
   id="svg2"
   inkscape:version="0.91 r13725"
   sodipodi:docname="print_small_white.svg"><metadata
     id="metadata19"><rdf:RDF><cc:Work
         rdf:about=""><dc:format>image/svg+xml</dc:format><dc:type
           rdf:resource="http://purl.org/dc/dcmitype/StillImage" /></cc:Work></rdf:RDF></metadata><sodipodi:namedview
     pagecolor="#ffffff"
     bordercolor="#666666"
     borderopacity="1"
     objecttolerance="10"
     gridtolerance="10"
     guidetolerance="10"
     inkscape:pageopacity="0"
     inkscape:pageshadow="2"
     inkscape:window-width="1303"
     inkscape:window-height="813"
     id="namedview17"
     showgrid="false"
     inkscape:zoom="13.316095"
     inkscape:cx="5.1816993"
     inkscape:cy="8.8614568"
     inkscape:window-x="0"
     inkscape:window-y="0"
     inkscape:window-maximized="0"
     inkscape:current-layer="svg2"
     inkscape:document-rotation="0" /><defs
     id="defs4"><style
       type="text/css"
       id="style6">
    .fil0 {fill:black}
    .fil2 {fill:white}
    .fil1 {fill:white;fill-rule:nonzero}
   </style></defs><rect
     class="fil0"
     x="-53.48"
     y="-261.16"
     width="607.15"
     height="858.68"
     id="rect8"
     style="opacity:0" /><g
     id="Layer_x0020_1"><metadata
       id="CorelCorpID_0Corel-Layer" /><g
       id="_2603013547984"><path
         class="fil1"
         d="M7.23 0c6.42,0 9.65,7.8 5.11,12.34 -4.54,4.54 -12.34,1.31 -12.34,-5.11 0,-3.99 3.24,-7.23 7.23,-7.23zm4.09 3.14c-3.63,-3.63 -9.87,-1.05 -9.87,4.09 0,5.14 6.24,7.72 9.87,4.09 2.26,-2.26 2.26,-5.92 0,-8.18z"
         id="path13" /><polygon
         class="fil2"
         points="5.11,3.91 5.11,10.55 11.09,7.32 "
         id="polygon15" /></g></g></svg>
