<?xml version="1.0" encoding="UTF-8" standalone="no"?>
<svg
   xmlns:dc="http://purl.org/dc/elements/1.1/"
   xmlns:cc="http://creativecommons.org/ns#"
   xmlns:rdf="http://www.w3.org/1999/02/22-rdf-syntax-ns#"
   xmlns:svg="http://www.w3.org/2000/svg"
   xmlns="http://www.w3.org/2000/svg"
   xmlns:sodipodi="http://sodipodi.sourceforge.net/DTD/sodipodi-0.dtd"
   xmlns:inkscape="http://www.inkscape.org/namespaces/inkscape"
   inkscape:version="1.0 (unknown)"
   sodipodi:docname="restart_black.svg"
   id="svg5"
   version="1.1"
   viewBox="0.0 -1.2124999999999986 89.886 89.886"
   height="354.3307px"
   width="354.3307px">
  <metadata
     id="metadata11">
    <rdf:RDF>
      <cc:Work
         rdf:about="">
        <dc:format>image/svg+xml</dc:format>
        <dc:type
           rdf:resource="http://purl.org/dc/dcmitype/StillImage" />
      </cc:Work>
    </rdf:RDF>
  </metadata>
  <defs
     id="defs9" />
  <sodipodi:namedview
     inkscape:current-layer="svg5"
     inkscape:window-maximized="0"
     inkscape:window-y="0"
     inkscape:window-x="56"
     inkscape:cy="43.730499"
     inkscape:cx="44.943001"
     inkscape:zoom="7.3861494"
     showgrid="false"
     id="namedview7"
     inkscape:window-height="1364"
     inkscape:window-width="2121"
     inkscape:pageshadow="2"
     inkscape:pageopacity="0"
     guidetolerance="10"
     gridtolerance="10"
     objecttolerance="10"
     borderopacity="1"
     bordercolor="#666666"
     pagecolor="#ffffff"
     inkscape:document-rotation="0" />
  <path
     id="Path_109"
     data-name="Path 109"
     d="M 33.76,76.78 C 68.05,89.61 96.91,47.57 72.44,20.25 46.21,-9.04 -1.65,20.87 13.65,57.33 a 35.066,35.066 0 0 0 2.18,4.33 L 24.6,55.62 23.18,81.45 0,72.55 8.82,66.47 C -9.33,36.73 13.1,-1.72 48.58,0.06 87,1.99 104.43,50.24 75.34,76.33 a 43.839,43.839 0 0 1 -42.9,8.97 q 0.255,-4.425 0.49,-8.85 l 0.84,0.32 z"
     fill="#000000" />
</svg>
