<?xml version="1.0" encoding="UTF-8" standalone="no"?>
<svg
   xmlns:dc="http://purl.org/dc/elements/1.1/"
   xmlns:cc="http://creativecommons.org/ns#"
   xmlns:rdf="http://www.w3.org/1999/02/22-rdf-syntax-ns#"
   xmlns:svg="http://www.w3.org/2000/svg"
   xmlns="http://www.w3.org/2000/svg"
   xmlns:sodipodi="http://sodipodi.sourceforge.net/DTD/sodipodi-0.dtd"
   xmlns:inkscape="http://www.inkscape.org/namespaces/inkscape"
   xml:space="preserve"
   width="354.3307px"
   height="354.3307px"
   version="1.1"
   style="shape-rendering:geometricPrecision; text-rendering:geometricPrecision; image-rendering:optimizeQuality; fill-rule:evenodd; clip-rule:evenodd"
   viewBox="0.0 0.0 65.79 65.79"
   id="svg2"
   inkscape:version="1.0.1 (3bc2e813f5, 2020-09-07)"
   sodipodi:docname="steppers_color.svg"><metadata
     id="metadata16"><rdf:RDF><cc:Work
         rdf:about=""><dc:format>image/svg+xml</dc:format><dc:type
           rdf:resource="http://purl.org/dc/dcmitype/StillImage" /><dc:title /></cc:Work></rdf:RDF></metadata><sodipodi:namedview
     pagecolor="#ffffff"
     bordercolor="#666666"
     borderopacity="1"
     objecttolerance="10"
     gridtolerance="10"
     guidetolerance="10"
     inkscape:pageopacity="0"
     inkscape:pageshadow="2"
     inkscape:window-width="1920"
     inkscape:window-height="979"
     id="namedview14"
     showgrid="false"
     inkscape:zoom="1"
     inkscape:cx="-47.83876"
     inkscape:cy="18.841713"
     inkscape:window-x="0"
     inkscape:window-y="36"
     inkscape:window-maximized="1"
     inkscape:current-layer="svg2"
     inkscape:document-rotation="0" /><defs
     id="defs4"><style
       type="text/css"
       id="style6">
    .fil0 {fill:white}
    .fil1 {fill:#EC691F;fill-rule:nonzero}
   </style></defs><path
     style="fill:#5ea796;fill-opacity:1"
     inkscape:connector-curvature="0"
     d="m 25.65,19.08 c 0.02,2.25 0.28,3.59 -1.03,4.79 -1.31,1.2 -2.65,0.82 -4.86,0.61 L 18,28.25 c 1.6,1.58 2.74,2.34 2.66,4.12 -0.08,1.77 -1.27,2.43 -3.01,3.86 l 1.43,3.92 c 2.23,-0.02 3.59,-0.28 4.79,1.03 1.2,1.31 0.82,2.64 0.61,4.86 l 3.77,1.76 c 1.58,-1.6 2.35,-2.74 4.11,-2.66 1.78,0.08 2.45,1.28 3.88,3.01 l 3.91,-1.42 c -0.02,-2.25 -0.28,-3.59 1.03,-4.79 1.31,-1.2 2.64,-0.82 4.86,-0.61 l 1.76,-3.77 c -1.57,-1.54 -2.74,-2.33 -2.66,-4.12 0.08,-1.77 1.29,-2.44 3.01,-3.86 l -1.43,-3.92 c -2.24,0.02 -3.59,0.28 -4.79,-1.02 -1.2,-1.31 -0.82,-2.64 -0.61,-4.86 l -3.77,-1.76 c -1.58,1.6 -2.34,2.74 -4.12,2.66 -1.77,-0.08 -2.44,-1.28 -3.86,-3.01 l -3.91,1.43 z m 7.25,6.7 c 3.93,0 7.12,3.19 7.12,7.12 0,3.93 -3.19,7.12 -7.12,7.12 -3.93,0 -7.12,-3.19 -7.12,-7.12 0,-3.93 3.19,-7.12 7.12,-7.12 z"
     class="fil0"
     id="iconmonstr-gear-12.svg" /><path
     style="fill:#ffffff"
     inkscape:connector-curvature="0"
     d="M 25.19,8.3 C 27.63,7.53 30.23,7.12 32.92,7.12 47.15,7.12 58.7,18.67 58.7,32.9 58.7,47.13 47.15,58.68 32.92,58.68 18.69,58.68 7.14,47.13 7.14,32.9 c 0,-5.47 1.72,-10.53 4.63,-14.7 l 5.68,4.39 0,-16.96 -15.5,4.99 5.73,4.43 c -3.58,5.05 -5.7,11.2 -5.7,17.86 0,17.07 13.86,30.93 30.93,30.93 17.07,0 30.9,-13.86 30.9,-30.93 0,-17.07 -13.83,-30.93 -30.9,-30.93 -2.67,0 -5.26,0.34 -7.73,0.98 l 0,5.36 z"
     class="fil0"
     id="iconmonstr-gear-12.svg_0" /></svg>
