<?xml version="1.0" encoding="UTF-8" standalone="no"?>
<svg
   xmlns:dc="http://purl.org/dc/elements/1.1/"
   xmlns:cc="http://creativecommons.org/ns#"
   xmlns:rdf="http://www.w3.org/1999/02/22-rdf-syntax-ns#"
   xmlns:svg="http://www.w3.org/2000/svg"
   xmlns="http://www.w3.org/2000/svg"
   xmlns:sodipodi="http://sodipodi.sourceforge.net/DTD/sodipodi-0.dtd"
   xmlns:inkscape="http://www.inkscape.org/namespaces/inkscape"
   xml:space="preserve"
   width="354.3307px"
   height="354.3307px"
   version="1.1"
   style="shape-rendering:geometricPrecision; text-rendering:geometricPrecision; image-rendering:optimizeQuality; fill-rule:evenodd; clip-rule:evenodd"
   viewBox="0.0 0.0 58.11 58.11"
   id="svg11"
   sodipodi:docname="timezone_color.svg"><metadata
   id="metadata15"><rdf:RDF><cc:Work
       rdf:about=""><dc:format>image/svg+xml</dc:format><dc:type
         rdf:resource="http://purl.org/dc/dcmitype/StillImage" /></cc:Work></rdf:RDF></metadata><sodipodi:namedview
   pagecolor="#ffffff"
   bordercolor="#666666"
   borderopacity="1"
   objecttolerance="10"
   gridtolerance="10"
   guidetolerance="10"
   inkscape:pageopacity="0"
   inkscape:pageshadow="2"
   inkscape:window-width="640"
   inkscape:window-height="480"
   id="namedview13" />
 <defs
   id="defs4">
  <style
   type="text/css"
   id="style2">
   
    .fil0 {fill:#EC691F}
    .fil1 {fill:white}
   
  </style>
 </defs>
 <g
   id="Značky_x0020_a_x0020_spadávky">
  <metadata
   id="CorelCorpID_0Corel-Layer" />
  <path
   class="fil0"
   d="M52.14 21.75c-0.1,-0.07 -0.2,-0.12 -0.31,-0.16 -0.63,-0.25 -3.31,1.48 -3.71,0.63 -0.26,-0.57 -0.8,0.36 -1.42,0.02 -0.3,-0.16 -1.12,-1.28 -1.5,-1.14 -0.76,0.28 1.17,2.39 1.7,2.66 0.5,-0.38 2.11,-1.15 2.46,-0.1 0.66,1.99 -1.82,4.17 -3.1,5.32 -1.9,1.72 -1.54,-1.11 -2.84,-2.11 -0.68,-0.52 -0.67,-1.63 -1.36,-2.02 -0.31,-0.17 -1.72,-1.79 -1.7,-2.01l-0.04 0.41c-0.23,0.18 -0.73,-0.66 -0.78,-0.79 0,0.73 1.19,1.89 1.58,2.48 0.67,1 1.03,2.46 1.85,3.28 0.44,0.44 2.12,2.26 2.56,2.22 0.48,-0.04 1.99,-1.13 2.25,-1.07 1.59,0.38 -3.75,7.93 -4.26,8.87 -0.42,0.79 0.34,2.73 0.28,3.65 -0.07,1.07 -0.92,1.42 -1.72,2 -0.86,0.63 -0.66,1.84 -1.38,2.29 -1.28,0.79 -2.2,3.35 -4.02,3.34 -0.53,-0 -2.82,0.89 -3.12,0.02 -0.23,-0.63 -0.54,-1.11 -0.87,-1.74 -0.32,-0.61 -0.04,-1.25 -0.43,-1.79 -0.27,-0.38 -1.18,-1.23 -1.26,-1.68 -0.01,-0.38 0.29,-1.55 0.69,-1.75 0.57,-0.29 0.11,-1.13 0.04,-1.62 -0.12,-0.88 -0.66,-1.6 -1.31,-2.11 -0.96,-0.74 -0.46,-1.33 -0.24,-2.39 0,-0.51 -0.31,-1.17 -0.99,-0.97 -1.4,0.41 -0.97,-1.09 -1.99,-1.02 -0.73,0.05 -1.33,0.52 -2.01,0.72 -0.86,0.26 -1.73,-0.2 -2.58,-0.31 -3.48,-0.44 -4.62,-4.42 -3.71,-7.29 0.09,-0.47 -0.28,-1.34 -0.12,-1.7 0.39,-0.87 1.19,-1.85 1.89,-2.51 0.39,-0.37 0.89,-0.28 1.35,-0.57 0.71,-0.45 0.72,-1.37 1.42,-1.93 0.99,-0.8 2.34,-0.79 3.63,-0.96 0.69,-0.09 3.31,-0.66 3.72,-0.15 0,0.09 0.47,1.5 -0.05,1.42 1.07,0.06 2.6,1.85 3.62,1.43 0.52,-0.22 0.33,-1.82 1.4,-1.05 0.65,0.46 3.55,0.67 4.16,0.17 0.37,-0.31 0.58,-2.3 0.13,-2.53 0.29,0.28 -1.51,0.31 -1.68,0.24 -0.3,-0.11 -0.57,0.28 -1.05,0.06 0.29,0.14 -1.6,-0.88 -0.54,-1.65 -0.44,0.32 -0.86,-0.09 -1.33,0.26 -0.33,0.27 0.15,0.45 -0.32,0.68 -0.75,0.38 -1.31,-1.3 -1.59,-1.49 -0.29,-0.19 -2.51,-1.75 -1.91,-0.73l1.95 1.94c-0.1,0.06 -0.51,-0.71 -0.51,-0.15 0.13,-0.33 0.05,1.43 -0.26,0.86 -0.14,-0.22 0.22,-0.34 0.02,-0.66 0,-0.21 -0.56,-0.42 -0.67,-0.56 -0.31,-0.38 -1.13,-1.23 -1.58,-1.43 -0.12,-0.06 -1.89,0.22 -2.04,0.27 -0.17,0.24 -0.32,0.5 -0.44,0.77 -0.37,0.14 -0.71,0.31 -1.04,0.53l-0.39 0.87c-0.17,0.15 -1.89,0.72 -1.9,0.74 0.07,-0.19 -1.21,-0.42 -1.12,-0.79 0.09,-0.41 0.53,-1.68 0.42,-2.15 -0.12,-0.49 2.66,0.7 2.84,-0.58 0.07,-0.56 0.11,-1.21 -0.77,-1.3 0.17,0.02 1.72,-0.61 1.98,-0.89 0.36,-0.42 1.19,-1.09 1.79,-1.09 0.7,0 0.55,-1.02 0.88,-1.52 0.32,0.13 -0.17,0.93 0.22,1.25 -0.02,-0.26 1.1,0.14 1.21,0.08 0.26,-0.13 1.69,-0.05 1.47,-0.73 -0.25,-0.69 0.13,-0.48 0.45,-0.63 -0.05,0.02 0.84,-1.53 1,-1.02 -0.11,-0.52 -1.04,0.18 -1.37,0.16 -0.75,-0.06 -0.44,-1.29 -0.15,-1.65 0.22,-0.28 -0.6,-0.63 -0.61,-0.09 -0.02,0.81 -0.77,1.55 -0.6,2.63 0.27,1.63 -1.82,-0.39 -2,-0.28 -0.69,0.42 -1.26,-0.53 -0.9,-1.1 0.37,-0.58 1.25,-0.55 1.61,-1.18 0.26,-0.44 0.56,-0.95 0.95,-1.29 1.32,-1.11 1.69,-0.22 3.01,-0.1 1.29,0.12 0.44,0.31 0.26,0.8 -0.17,0.47 0.71,0.64 1.01,0.25 0.17,-0.23 0.57,-0.8 0.74,-1.22 0.13,-0.33 0.92,-0.44 1.21,-0.66 6.56,2.72 11.68,8.25 13.84,15.08zm-22.79 -16.91c-0.18,0.18 -0.36,0.37 -0.54,0.52 -0.88,0.73 -3.14,2.16 -4.39,1.73 -1.28,-0.44 -4.03,1.63 -4.48,1.65 -0.16,0.01 0.01,-1.57 0.89,-1.69 -0.26,0.04 1.34,-0.83 2.31,-1.48 1.89,-0.48 3.88,-0.73 5.92,-0.73l0.29 0zm-11.8 2.91c0.04,0.09 -0.04,0.21 -0.38,0.44 -0.45,0.27 -0.92,1.98 -1.34,1.98 -1.25,0.55 -1.33,-1.08 -2.72,1.01l-0.65 0.26c1.53,-1.44 3.24,-2.69 5.1,-3.69zm-12.43 17.63c0.15,0.09 0.28,0.16 0.32,0.21 0.28,0.33 0.28,1.76 0.41,2.23 0.34,1.18 1.18,1.84 1.83,2.92 0.38,0.64 1.01,2.26 0.81,2.94 0.27,-0.44 2.65,2.02 3.08,2.53 1.02,1.21 1.81,2.67 0.15,3.86 -0.54,0.39 0.82,2.79 0.12,3.39l-0.89 0.23c-0.33,0.2 -0.48,0.51 -0.51,0.84 -3.5,-4.2 -5.61,-9.6 -5.61,-15.48 0,-1.24 0.09,-2.47 0.28,-3.66zm32.9 -9.65c-0.01,-0.36 -0.47,-0.7 -0.95,-0.08 -0.33,0.43 -0.27,1.09 -0.46,1.38 -0.26,0.43 1.4,0.84 1.4,0.43 0.06,-0.69 1.81,-0.16 2.15,-0.06 0.61,0.17 1.59,-0.56 0.52,-0.94 -0.88,-0.32 -1.34,-0.67 -1.42,-1.29 0,0 0.46,-0.44 0.26,-0.41 -0.54,0.07 -1.52,1.94 -1.52,0.98l0 0z"
   id="path7" />
  <path
   id="iconmonstr-time-2.svg"
   class="fil1"
   d="M29.06 0c-16.05,0 -29.06,13.01 -29.06,29.06 0,16.05 13.01,29.06 29.06,29.06 16.05,0 29.06,-13.01 29.06,-29.06 0,-16.05 -13.01,-29.06 -29.06,-29.06zm0 4.84c13.35,0 24.21,10.86 24.21,24.21 0,13.35 -10.86,24.21 -24.21,24.21 -13.35,0 -24.21,-10.86 -24.21,-24.21 0,-13.35 10.86,-24.21 24.21,-24.21z" />
 </g>
</svg>
