{
  "name": "Nations of Mankind Random Career",
  "die": "1d100",
  "extend": true,
  "rows": [
    {
      "range": {
        "human-albionite-nom": [1, 1],
        "human-arabyan-nom": [1, 2],
        "human-breton-noble-nom": [],
        "human-breton-lowborn-nom": [1, 1],
        "human-cathayan-nom": [1, 3],
        "human-estalian-nom": [1, 3],
        "human-indan-nom": [1, 2],
        "human-gospodar-nom": [1, 1],
        "human-ungol-nom": [1, 1],
        "human-nipponese-nom": [1, 1],
        "human-norscan-nom": [1, 2],
        "human-southlander-nom": [1, 2],
        "human-strigany-nom": [1, 2],
        "human-tilean-nom": [1, 3],
        "human-westerlander-nom": [1, 1]
      },
      "human-albionite-nom": { "name": "Apothecary" },
      "human-arabyan-nom": { "name": "Apothecary" },
      "human-breton-noble-nom": { "name": "Apothecary" },
      "human-breton-lowborn-nom": { "name": "Apothecary" },
      "human-cathayan-nom": { "name": "Apothecary" },
      "human-estalian-nom": { "name": "Apothecary" },
      "human-indan-nom": { "name": "Apothecary" },
      "human-gospodar-nom": { "name": "Apothecary" },
      "human-ungol-nom": { "name": "Apothecary" },
      "human-nipponese-nom": { "name": "Apothecary" },
      "human-norscan-nom": { "name": "Apothecary" },
      "human-southlander-nom": { "name": "Apothecary" },
      "human-strigany-nom": { "name": "Apothecary" },
      "human-tilean-nom": { "name": "Apothecary" },
      "human-westerlander-nom": { "name": "Apothecary" }
    },
    {
      "range": {
        "human-albionite-nom": [],
        "human-arabyan-nom": [3, 3],
        "human-breton-noble-nom": [],
        "human-breton-lowborn-nom": [2, 2],
        "human-cathayan-nom": [4, 5],
        "human-estalian-nom": [4, 4],
        "human-indan-nom": [3, 3],
        "human-gospodar-nom": [2, 2],
        "human-ungol-nom": [2, 2],
        "human-nipponese-nom": [2, 2],
        "human-norscan-nom": [],
        "human-southlander-nom": [],
        "human-strigany-nom": [],
        "human-tilean-nom": [4, 5],
        "human-westerlander-nom": [2, 2]
      },
      "human-albionite-nom": { "name": "Engineer" },
      "human-arabyan-nom": { "name": "Engineer" },
      "human-breton-noble-nom": { "name": "Engineer" },
      "human-breton-lowborn-nom": { "name": "Engineer" },
      "human-cathayan-nom": { "name": "Engineer" },
      "human-estalian-nom": { "name": "Engineer" },
      "human-indan-nom": { "name": "Engineer" },
      "human-gospodar-nom": { "name": "Engineer" },
      "human-ungol-nom": { "name": "Engineer" },
      "human-nipponese-nom": { "name": "Engineer" },
      "human-norscan-nom": { "name": "Engineer" },
      "human-southlander-nom": { "name": "Engineer" },
      "human-strigany-nom": { "name": "Engineer" },
      "human-tilean-nom": { "name": "Engineer" },
      "human-westerlander-nom": { "name": "Engineer" }
    },
    {
      "range": {
        "human-albionite-nom": [],
        "human-arabyan-nom": [4, 4],
        "human-breton-noble-nom": [],
        "human-breton-lowborn-nom": [3, 3],
        "human-cathayan-nom": [6, 6],
        "human-estalian-nom": [5, 6],
        "human-indan-nom": [4, 4],
        "human-gospodar-nom": [3, 3],
        "human-ungol-nom": [3, 3],
        "human-nipponese-nom": [],
        "human-norscan-nom": [],
        "human-southlander-nom": [],
        "human-strigany-nom": [],
        "human-tilean-nom": [6, 7],
        "human-westerlander-nom": [3, 4]
      },
      "human-albionite-nom": { "name": "Lawyer" },
      "human-arabyan-nom": { "name": "Lawyer" },
      "human-breton-noble-nom": { "name": "Lawyer" },
      "human-breton-lowborn-nom": { "name": "Lawyer" },
      "human-cathayan-nom": { "name": "Lawyer" },
      "human-estalian-nom": { "name": "Lawyer" },
      "human-indan-nom": { "name": "Lawyer" },
      "human-gospodar-nom": { "name": "Lawyer" },
      "human-ungol-nom": { "name": "Lawyer" },
      "human-nipponese-nom": { "name": "Lawyer" },
      "human-norscan-nom": { "name": "Lawyer" },
      "human-southlander-nom": { "name": "Lawyer" },
      "human-strigany-nom": { "name": "Lawyer" },
      "human-tilean-nom": { "name": "Lawyer" },
      "human-westerlander-nom": { "name": "Lawyer" }
    },
    {
      "range": {
        "human-albionite-nom": [],
        "human-arabyan-nom": [],
        "human-breton-noble-nom": [1, 2],
        "human-breton-lowborn-nom": [4, 4],
        "human-cathayan-nom": [7, 7],
        "human-estalian-nom": [7, 7],
        "human-indan-nom": [5, 5],
        "human-gospodar-nom": [4, 4],
        "human-ungol-nom": [4, 4],
        "human-nipponese-nom": [3, 3],
        "human-norscan-nom": [],
        "human-southlander-nom": [],
        "human-strigany-nom": [],
        "human-tilean-nom": [8, 8],
        "human-westerlander-nom": [5, 5]
      },
      "human-albionite-nom": { "name": "Nun" },
      "human-arabyan-nom": { "name": "Nun" },
      "human-breton-noble-nom": { "name": "Nun" },
      "human-breton-lowborn-nom": { "name": "Nun" },
      "human-cathayan-nom": { "name": "Nun" },
      "human-estalian-nom": { "name": "Nun" },
      "human-indan-nom": { "name": "Nun" },
      "human-gospodar-nom": { "name": "Nun" },
      "human-ungol-nom": { "name": "Nun" },
      "human-nipponese-nom": { "name": "Nun" },
      "human-norscan-nom": { "name": "Nun" },
      "human-southlander-nom": { "name": "Nun" },
      "human-strigany-nom": { "name": "Nun" },
      "human-tilean-nom": { "name": "Nun" },
      "human-westerlander-nom": { "name": "Nun" }
    },
    {
      "range": {
        "human-albionite-nom": [],
        "human-arabyan-nom": [5, 7],
        "human-breton-noble-nom": [],
        "human-breton-lowborn-nom": [5, 5],
        "human-cathayan-nom": [8, 10],
        "human-estalian-nom": [8, 10],
        "human-indan-nom": [6, 8],
        "human-gospodar-nom": [5, 5],
        "human-ungol-nom": [5, 5],
        "human-nipponese-nom": [4, 4],
        "human-norscan-nom": [],
        "human-southlander-nom": [],
        "human-strigany-nom": [],
        "human-tilean-nom": [9, 9],
        "human-westerlander-nom": [6, 8]
      },
      "human-albionite-nom": { "name": "Physician" },
      "human-arabyan-nom": { "name": "Physician" },
      "human-breton-noble-nom": { "name": "Physician" },
      "human-breton-lowborn-nom": { "name": "Physician" },
      "human-cathayan-nom": { "name": "Physician" },
      "human-estalian-nom": { "name": "Physician" },
      "human-indan-nom": { "name": "Physician" },
      "human-gospodar-nom": { "name": "Physician" },
      "human-ungol-nom": { "name": "Physician" },
      "human-nipponese-nom": { "name": "Physician" },
      "human-norscan-nom": { "name": "Physician" },
      "human-southlander-nom": { "name": "Physician" },
      "human-strigany-nom": { "name": "Physician" },
      "human-tilean-nom": { "name": "Physician" },
      "human-westerlander-nom": { "name": "Physician" }
    },
    {
      "range": {
        "human-albionite-nom": [],
        "human-arabyan-nom": [8, 8],
        "human-breton-noble-nom": [],
        "human-breton-lowborn-nom": [6, 6],
        "human-cathayan-nom": [],
        "human-estalian-nom": [11, 12],
        "human-indan-nom": [9, 14],
        "human-gospodar-nom": [6, 6],
        "human-ungol-nom": [6, 6],
        "human-nipponese-nom": [5, 5],
        "human-norscan-nom": [],
        "human-southlander-nom": [],
        "human-strigany-nom": [],
        "human-tilean-nom": [10, 11],
        "human-westerlander-nom": [9, 10]
      },
      "human-albionite-nom": { "name": "Priest" },
      "human-arabyan-nom": { "name": "Priest" },
      "human-breton-noble-nom": { "name": "Priest" },
      "human-breton-lowborn-nom": { "name": "Priest" },
      "human-cathayan-nom": { "name": "Priest" },
      "human-estalian-nom": { "name": "Priest" },
      "human-indan-nom": { "name": "Priest" },
      "human-gospodar-nom": { "name": "Priest" },
      "human-ungol-nom": { "name": "Priest" },
      "human-nipponese-nom": { "name": "Priest" },
      "human-norscan-nom": { "name": "Priest" },
      "human-southlander-nom": { "name": "Priest" },
      "human-strigany-nom": { "name": "Priest" },
      "human-tilean-nom": { "name": "Priest" },
      "human-westerlander-nom": { "name": "Priest" }
    },
    {
      "range": {
        "human-albionite-nom": [],
        "human-arabyan-nom": [9, 11],
        "human-breton-noble-nom": [],
        "human-breton-lowborn-nom": [7, 7],
        "human-cathayan-nom": [11, 12],
        "human-estalian-nom": [13, 15],
        "human-indan-nom": [15, 17],
        "human-gospodar-nom": [7, 7],
        "human-ungol-nom": [7, 7],
        "human-nipponese-nom": [6, 6],
        "human-norscan-nom": [3, 3],
        "human-southlander-nom": [3, 3],
        "human-strigany-nom": [],
        "human-tilean-nom": [12, 13],
        "human-westerlander-nom": [11, 12]
      },
      "human-albionite-nom": { "name": "Scholar" },
      "human-arabyan-nom": { "name": "Scholar" },
      "human-breton-noble-nom": { "name": "Scholar" },
      "human-breton-lowborn-nom": { "name": "Scholar" },
      "human-cathayan-nom": { "name": "Scholar" },
      "human-estalian-nom": { "name": "Scholar" },
      "human-indan-nom": { "name": "Scholar" },
      "human-gospodar-nom": { "name": "Scholar" },
      "human-ungol-nom": { "name": "Scholar" },
      "human-nipponese-nom": { "name": "Scholar" },
      "human-norscan-nom": { "name": "Scholar" },
      "human-southlander-nom": { "name": "Scholar" },
      "human-strigany-nom": { "name": "Scholar" },
      "human-tilean-nom": { "name": "Scholar" },
      "human-westerlander-nom": { "name": "Scholar" }
    },
    {
      "range": {
        "human-albionite-nom": [],
        "human-arabyan-nom": [12, 12],
        "human-breton-noble-nom": [3, 3],
        "human-breton-lowborn-nom": [],
        "human-cathayan-nom": [13, 13],
        "human-estalian-nom": [16, 16],
        "human-indan-nom": [18, 18],
        "human-gospodar-nom": [],
        "human-ungol-nom": [],
        "human-nipponese-nom": [7, 7],
        "human-norscan-nom": [],
        "human-southlander-nom": [],
        "human-strigany-nom": [],
        "human-tilean-nom": [14, 14],
        "human-westerlander-nom": [13, 13]
      },
      "human-albionite-nom": { "name": "Wizard" },
      "human-arabyan-nom": { "name": "Wizard" },
      "human-breton-noble-nom": { "name": "Wizard" },
      "human-breton-lowborn-nom": { "name": "Wizard" },
      "human-cathayan-nom": { "name": "Wizard" },
      "human-estalian-nom": { "name": "Wizard" },
      "human-indan-nom": { "name": "Wizard" },
      "human-gospodar-nom": { "name": "Wizard" },
      "human-ungol-nom": { "name": "Wizard" },
      "human-nipponese-nom": { "name": "Wizard" },
      "human-norscan-nom": { "name": "Wizard" },
      "human-southlander-nom": { "name": "Wizard" },
      "human-strigany-nom": { "name": "Wizard" },
      "human-tilean-nom": { "name": "Wizard" },
      "human-westerlander-nom": { "name": "Wizard" }
    },
    {
      "range": {
        "human-albionite-nom": [],
        "human-arabyan-nom": [13, 13],
        "human-breton-noble-nom": [],
        "human-breton-lowborn-nom": [8, 9],
        "human-cathayan-nom": [14, 14],
        "human-estalian-nom": [17, 17],
        "human-indan-nom": [19, 19],
        "human-gospodar-nom": [8, 8],
        "human-ungol-nom": [8, 8],
        "human-nipponese-nom": [8, 8],
        "human-norscan-nom": [4, 5],
        "human-southlander-nom": [4, 4],
        "human-strigany-nom": [3, 3],
        "human-tilean-nom": [15, 15],
        "human-westerlander-nom": [14, 15]
      },
      "human-albionite-nom": { "name": "Agitator" },
      "human-arabyan-nom": { "name": "Agitator" },
      "human-breton-noble-nom": { "name": "Agitator" },
      "human-breton-lowborn-nom": { "name": "Agitator" },
      "human-cathayan-nom": { "name": "Agitator" },
      "human-estalian-nom": { "name": "Agitator" },
      "human-indan-nom": { "name": "Agitator" },
      "human-gospodar-nom": { "name": "Agitator" },
      "human-ungol-nom": { "name": "Agitator" },
      "human-nipponese-nom": { "name": "Agitator" },
      "human-norscan-nom": { "name": "Agitator" },
      "human-southlander-nom": { "name": "Agitator" },
      "human-strigany-nom": { "name": "Agitator" },
      "human-tilean-nom": { "name": "Agitator" },
      "human-westerlander-nom": { "name": "Agitator" }
    },
    {
      "range": {
        "human-albionite-nom": [2, 5],
        "human-arabyan-nom": [14, 16],
        "human-breton-noble-nom": [],
        "human-breton-lowborn-nom": [10, 14],
        "human-cathayan-nom": [15, 17],
        "human-estalian-nom": [18, 20],
        "human-indan-nom": [20, 22],
        "human-gospodar-nom": [9, 11],
        "human-ungol-nom": [9, 11],
        "human-nipponese-nom": [9, 11],
        "human-norscan-nom": [6, 9],
        "human-southlander-nom": [5, 10],
        "human-strigany-nom": [4, 6],
        "human-tilean-nom": [16, 17],
        "human-westerlander-nom": [16, 17]
      },
      "human-albionite-nom": { "name": "Artisan" },
      "human-arabyan-nom": { "name": "Artisan" },
      "human-breton-noble-nom": { "name": "Artisan" },
      "human-breton-lowborn-nom": { "name": "Artisan" },
      "human-cathayan-nom": { "name": "Artisan" },
      "human-estalian-nom": { "name": "Artisan" },
      "human-indan-nom": { "name": "Artisan" },
      "human-gospodar-nom": { "name": "Artisan" },
      "human-ungol-nom": { "name": "Artisan" },
      "human-nipponese-nom": { "name": "Artisan" },
      "human-norscan-nom": { "name": "Artisan" },
      "human-southlander-nom": { "name": "Artisan" },
      "human-strigany-nom": { "name": "Artisan" },
      "human-tilean-nom": { "name": "Artisan" },
      "human-westerlander-nom": { "name": "Artisan" }
    },
    {
      "range": {
        "human-albionite-nom": [],
        "human-arabyan-nom": [17, 17],
        "human-breton-noble-nom": [],
        "human-breton-lowborn-nom": [15, 15],
        "human-cathayan-nom": [18, 19],
        "human-estalian-nom": [21, 21],
        "human-indan-nom": [23, 24],
        "human-gospodar-nom": [12, 12],
        "human-ungol-nom": [12, 12],
        "human-nipponese-nom": [12, 12],
        "human-norscan-nom": [],
        "human-southlander-nom": [],
        "human-strigany-nom": [7, 7],
        "human-tilean-nom": [18, 18],
        "human-westerlander-nom": [18, 19]
      },
      "human-albionite-nom": { "name": "Beggar" },
      "human-arabyan-nom": { "name": "Beggar" },
      "human-breton-noble-nom": { "name": "Beggar" },
      "human-breton-lowborn-nom": { "name": "Beggar" },
      "human-cathayan-nom": { "name": "Beggar" },
      "human-estalian-nom": { "name": "Beggar" },
      "human-indan-nom": { "name": "Beggar" },
      "human-gospodar-nom": { "name": "Beggar" },
      "human-ungol-nom": { "name": "Beggar" },
      "human-nipponese-nom": { "name": "Beggar" },
      "human-norscan-nom": { "name": "Beggar" },
      "human-southlander-nom": { "name": "Beggar" },
      "human-strigany-nom": { "name": "Beggar" },
      "human-tilean-nom": { "name": "Beggar" },
      "human-westerlander-nom": { "name": "Beggar" }
    },
    {
      "range": {
        "human-albionite-nom": [],
        "human-arabyan-nom": [18, 18],
        "human-breton-noble-nom": [],
        "human-breton-lowborn-nom": [16, 16],
        "human-cathayan-nom": [20, 21],
        "human-estalian-nom": [22, 22],
        "human-indan-nom": [25, 25],
        "human-gospodar-nom": [13, 14],
        "human-ungol-nom": [13, 14],
        "human-nipponese-nom": [13, 13],
        "human-norscan-nom": [10, 10],
        "human-southlander-nom": [11, 11],
        "human-strigany-nom": [8, 8],
        "human-tilean-nom": [19, 19],
        "human-westerlander-nom": [20, 20]
      },
      "human-albionite-nom": { "name": "Investigator" },
      "human-arabyan-nom": { "name": "Investigator" },
      "human-breton-noble-nom": { "name": "Investigator" },
      "human-breton-lowborn-nom": { "name": "Investigator" },
      "human-cathayan-nom": { "name": "Investigator" },
      "human-estalian-nom": { "name": "Investigator" },
      "human-indan-nom": { "name": "Investigator" },
      "human-gospodar-nom": { "name": "Investigator" },
      "human-ungol-nom": { "name": "Investigator" },
      "human-nipponese-nom": { "name": "Investigator" },
      "human-norscan-nom": { "name": "Investigator" },
      "human-southlander-nom": { "name": "Investigator" },
      "human-strigany-nom": { "name": "Investigator" },
      "human-tilean-nom": { "name": "Investigator" },
      "human-westerlander-nom": { "name": "Investigator" }
    },
    {
      "range": {
        "human-albionite-nom": [6, 6],
        "human-arabyan-nom": [19, 20],
        "human-breton-noble-nom": [],
        "human-breton-lowborn-nom": [17, 17],
        "human-cathayan-nom": [22, 23],
        "human-estalian-nom": [23, 23],
        "human-indan-nom": [26, 26],
        "human-gospodar-nom": [15, 15],
        "human-ungol-nom": [15, 15],
        "human-nipponese-nom": [14, 14],
        "human-norscan-nom": [11, 12],
        "human-southlander-nom": [12, 12],
        "human-strigany-nom": [9, 9],
        "human-tilean-nom": [20, 23],
        "human-westerlander-nom": [21, 24]
      },
      "human-albionite-nom": { "name": "Merchant" },
      "human-arabyan-nom": { "name": "Merchant" },
      "human-breton-noble-nom": { "name": "Merchant" },
      "human-breton-lowborn-nom": { "name": "Merchant" },
      "human-cathayan-nom": { "name": "Merchant" },
      "human-estalian-nom": { "name": "Merchant" },
      "human-indan-nom": { "name": "Merchant" },
      "human-gospodar-nom": { "name": "Merchant" },
      "human-ungol-nom": { "name": "Merchant" },
      "human-nipponese-nom": { "name": "Merchant" },
      "human-norscan-nom": { "name": "Merchant" },
      "human-southlander-nom": { "name": "Merchant" },
      "human-strigany-nom": { "name": "Merchant" },
      "human-tilean-nom": { "name": "Merchant" },
      "human-westerlander-nom": { "name": "Merchant" }
    },
    {
      "range": {
        "human-albionite-nom": [],
        "human-arabyan-nom": [21, 21],
        "human-breton-noble-nom": [],
        "human-breton-lowborn-nom": [18, 18],
        "human-cathayan-nom": [24, 25],
        "human-estalian-nom": [24, 24],
        "human-indan-nom": [27, 27],
        "human-gospodar-nom": [16, 16],
        "human-ungol-nom": [16, 16],
        "human-nipponese-nom": [15, 16],
        "human-norscan-nom": [],
        "human-southlander-nom": [],
        "human-strigany-nom": [10, 11],
        "human-tilean-nom": [24, 25],
        "human-westerlander-nom": [25, 26]
      },
      "human-albionite-nom": { "name": "Rat Catcher" },
      "human-arabyan-nom": { "name": "Rat Catcher" },
      "human-breton-noble-nom": { "name": "Rat Catcher" },
      "human-breton-lowborn-nom": { "name": "Rat Catcher" },
      "human-cathayan-nom": { "name": "Rat Catcher" },
      "human-estalian-nom": { "name": "Rat Catcher" },
      "human-indan-nom": { "name": "Rat Catcher" },
      "human-gospodar-nom": { "name": "Rat Catcher" },
      "human-ungol-nom": { "name": "Rat Catcher" },
      "human-nipponese-nom": { "name": "Rat Catcher" },
      "human-norscan-nom": { "name": "Rat Catcher" },
      "human-southlander-nom": { "name": "Rat Catcher" },
      "human-strigany-nom": { "name": "Rat Catcher" },
      "human-tilean-nom": { "name": "Rat Catcher" },
      "human-westerlander-nom": { "name": "Rat Catcher" }
    },
    {
      "range": {
        "human-albionite-nom": [],
        "human-arabyan-nom": [22, 26],
        "human-breton-noble-nom": [],
        "human-breton-lowborn-nom": [19, 24],
        "human-cathayan-nom": [26, 30],
        "human-estalian-nom": [25, 27],
        "human-indan-nom": [28, 30],
        "human-gospodar-nom": [17, 25],
        "human-ungol-nom": [17, 25],
        "human-nipponese-nom": [17, 20],
        "human-norscan-nom": [13, 14],
        "human-southlander-nom": [],
        "human-strigany-nom": [],
        "human-tilean-nom": [26, 30],
        "human-westerlander-nom": [27, 30]
      },
      "human-albionite-nom": { "name": "Townsman" },
      "human-arabyan-nom": { "name": "Townsman" },
      "human-breton-noble-nom": { "name": "Townsman" },
      "human-breton-lowborn-nom": { "name": "Townsman" },
      "human-cathayan-nom": { "name": "Townsman" },
      "human-estalian-nom": { "name": "Townsman" },
      "human-indan-nom": { "name": "Townsman" },
      "human-gospodar-nom": { "name": "Townsman" },
      "human-ungol-nom": { "name": "Townsman" },
      "human-nipponese-nom": { "name": "Townsman" },
      "human-norscan-nom": { "name": "Townsman" },
      "human-southlander-nom": { "name": "Townsman" },
      "human-strigany-nom": { "name": "Townsman" },
      "human-tilean-nom": { "name": "Townsman" },
      "human-westerlander-nom": { "name": "Townsman" }
    },
    {
      "range": {
        "human-albionite-nom": [],
        "human-arabyan-nom": [27, 27],
        "human-breton-noble-nom": [],
        "human-breton-lowborn-nom": [25, 26],
        "human-cathayan-nom": [31, 31],
        "human-estalian-nom": [28, 29],
        "human-indan-nom": [31, 31],
        "human-gospodar-nom": [26, 28],
        "human-ungol-nom": [26, 28],
        "human-nipponese-nom": [21, 21],
        "human-norscan-nom": [],
        "human-southlander-nom": [13, 13],
        "human-strigany-nom": [],
        "human-tilean-nom": [31, 33],
        "human-westerlander-nom": []
      },
      "human-albionite-nom": { "name": "Watchman" },
      "human-arabyan-nom": { "name": "Watchman" },
      "human-breton-noble-nom": { "name": "Watchman" },
      "human-breton-lowborn-nom": { "name": "Watchman" },
      "human-cathayan-nom": { "name": "Watchman" },
      "human-estalian-nom": { "name": "Watchman" },
      "human-indan-nom": { "name": "Watchman" },
      "human-gospodar-nom": { "name": "Watchman" },
      "human-ungol-nom": { "name": "Watchman" },
      "human-nipponese-nom": { "name": "Watchman" },
      "human-norscan-nom": { "name": "Watchman" },
      "human-southlander-nom": { "name": "Watchman" },
      "human-strigany-nom": { "name": "Watchman" },
      "human-tilean-nom": { "name": "Watchman" },
      "human-westerlander-nom": { "name": "Watchman" }
    },
    {
      "range": {
        "human-albionite-nom": [],
        "human-arabyan-nom": [28, 28],
        "human-breton-noble-nom": [4, 10],
        "human-breton-lowborn-nom": [],
        "human-cathayan-nom": [32, 32],
        "human-estalian-nom": [30, 30],
        "human-indan-nom": [32, 32],
        "human-gospodar-nom": [29, 29],
        "human-ungol-nom": [29, 29],
        "human-nipponese-nom": [23, 23],
        "human-norscan-nom": [15, 15],
        "human-southlander-nom": [14, 14],
        "human-strigany-nom": [],
        "human-tilean-nom": [34, 34],
        "human-westerlander-nom": [31, 31]
      },
      "human-albionite-nom": { "name": "Advisor" },
      "human-arabyan-nom": { "name": "Advisor" },
      "human-breton-noble-nom": { "name": "Advisor" },
      "human-breton-lowborn-nom": { "name": "Advisor" },
      "human-cathayan-nom": { "name": "Advisor" },
      "human-estalian-nom": { "name": "Advisor" },
      "human-indan-nom": { "name": "Advisor" },
      "human-gospodar-nom": { "name": "Advisor" },
      "human-ungol-nom": { "name": "Advisor" },
      "human-nipponese-nom": { "name": "Advisor" },
      "human-norscan-nom": { "name": "Advisor" },
      "human-southlander-nom": { "name": "Advisor" },
      "human-strigany-nom": { "name": "Advisor" },
      "human-tilean-nom": { "name": "Advisor" },
      "human-westerlander-nom": { "name": "Advisor" }
    },
    {
      "range": {
        "human-albionite-nom": [],
        "human-arabyan-nom": [29, 30],
        "human-breton-noble-nom": [],
        "human-breton-lowborn-nom": [27, 27],
        "human-cathayan-nom": [33, 34],
        "human-estalian-nom": [31, 31],
        "human-indan-nom": [33, 33],
        "human-gospodar-nom": [30, 30],
        "human-ungol-nom": [30, 30],
        "human-nipponese-nom": [24, 25],
        "human-norscan-nom": [],
        "human-southlander-nom": [],
        "human-strigany-nom": [],
        "human-tilean-nom": [35, 37],
        "human-westerlander-nom": [32, 32]
      },
      "human-albionite-nom": { "name": "Artist" },
      "human-arabyan-nom": { "name": "Artist" },
      "human-breton-noble-nom": { "name": "Artist" },
      "human-breton-lowborn-nom": { "name": "Artist" },
      "human-cathayan-nom": { "name": "Artist" },
      "human-estalian-nom": { "name": "Artist" },
      "human-indan-nom": { "name": "Artist" },
      "human-gospodar-nom": { "name": "Artist" },
      "human-ungol-nom": { "name": "Artist" },
      "human-nipponese-nom": { "name": "Artist" },
      "human-norscan-nom": { "name": "Artist" },
      "human-southlander-nom": { "name": "Artist" },
      "human-strigany-nom": { "name": "Artist" },
      "human-tilean-nom": { "name": "Artist" },
      "human-westerlander-nom": { "name": "Artist" }
    },
    {
      "range": {
        "human-albionite-nom": [],
        "human-arabyan-nom": [],
        "human-breton-noble-nom": [],
        "human-breton-lowborn-nom": [],
        "human-cathayan-nom": [],
        "human-estalian-nom": [32, 32],
        "human-indan-nom": [],
        "human-gospodar-nom": [31, 31],
        "human-ungol-nom": [31, 31],
        "human-nipponese-nom": [],
        "human-norscan-nom": [],
        "human-southlander-nom": [],
        "human-strigany-nom": [12, 12],
        "human-tilean-nom": [38, 38],
        "human-westerlander-nom": [33, 33]
      },
      "human-albionite-nom": { "name": "Duellist" },
      "human-arabyan-nom": { "name": "Duellist" },
      "human-breton-noble-nom": { "name": "Duellist" },
      "human-breton-lowborn-nom": { "name": "Duellist" },
      "human-cathayan-nom": { "name": "Duellist" },
      "human-estalian-nom": { "name": "Duellist" },
      "human-indan-nom": { "name": "Duellist" },
      "human-gospodar-nom": { "name": "Duellist" },
      "human-ungol-nom": { "name": "Duellist" },
      "human-nipponese-nom": { "name": "Duellist" },
      "human-norscan-nom": { "name": "Duellist" },
      "human-southlander-nom": { "name": "Duellist" },
      "human-strigany-nom": { "name": "Duellist" },
      "human-tilean-nom": { "name": "Duellist" },
      "human-westerlander-nom": { "name": "Duellist" }
    },
    {
      "range": {
        "human-albionite-nom": [],
        "human-arabyan-nom": [31, 31],
        "human-breton-noble-nom": [11, 15],
        "human-breton-lowborn-nom": [],
        "human-cathayan-nom": [35, 35],
        "human-estalian-nom": [33, 33],
        "human-indan-nom": [34, 34],
        "human-gospodar-nom": [32, 32],
        "human-ungol-nom": [32, 32],
        "human-nipponese-nom": [26, 26],
        "human-norscan-nom": [16, 16],
        "human-southlander-nom": [15, 16],
        "human-strigany-nom": [],
        "human-tilean-nom": [39, 39],
        "human-westerlander-nom": [34, 34]
      },
      "human-albionite-nom": { "name": "Envoy" },
      "human-arabyan-nom": { "name": "Envoy" },
      "human-breton-noble-nom": { "name": "Envoy" },
      "human-breton-lowborn-nom": { "name": "Envoy" },
      "human-cathayan-nom": { "name": "Envoy" },
      "human-estalian-nom": { "name": "Envoy" },
      "human-indan-nom": { "name": "Envoy" },
      "human-gospodar-nom": { "name": "Envoy" },
      "human-ungol-nom": { "name": "Envoy" },
      "human-nipponese-nom": { "name": "Envoy" },
      "human-norscan-nom": { "name": "Envoy" },
      "human-southlander-nom": { "name": "Envoy" },
      "human-strigany-nom": { "name": "Envoy" },
      "human-tilean-nom": { "name": "Envoy" },
      "human-westerlander-nom": { "name": "Envoy" }
    },
    {
      "range": {
        "human-albionite-nom": [7, 7],
        "human-arabyan-nom": [32, 32],
        "human-breton-noble-nom": [16, 30],
        "human-breton-lowborn-nom": [],
        "human-cathayan-nom": [36, 36],
        "human-estalian-nom": [34, 34],
        "human-indan-nom": [35, 35],
        "human-gospodar-nom": [33, 33],
        "human-ungol-nom": [33, 33],
        "human-nipponese-nom": [27, 27],
        "human-norscan-nom": [],
        "human-southlander-nom": [17, 17],
        "human-strigany-nom": [],
        "human-tilean-nom": [40, 40],
        "human-westerlander-nom": []
      },
      "human-albionite-nom": { "name": "Noble" },
      "human-arabyan-nom": { "name": "Noble" },
      "human-breton-noble-nom": { "name": "Noble" },
      "human-breton-lowborn-nom": { "name": "Noble" },
      "human-cathayan-nom": { "name": "Noble" },
      "human-estalian-nom": { "name": "Noble" },
      "human-indan-nom": { "name": "Noble" },
      "human-gospodar-nom": { "name": "Noble" },
      "human-ungol-nom": { "name": "Noble" },
      "human-nipponese-nom": { "name": "Noble" },
      "human-norscan-nom": { "name": "Noble" },
      "human-southlander-nom": { "name": "Noble" },
      "human-strigany-nom": { "name": "Noble" },
      "human-tilean-nom": { "name": "Noble" },
      "human-westerlander-nom": { "name": "Noble" }
    },
    {
      "range": {
        "human-albionite-nom": [8, 8],
        "human-arabyan-nom": [33, 33],
        "human-breton-noble-nom": [],
        "human-breton-lowborn-nom": [28, 29],
        "human-cathayan-nom": [37, 38],
        "human-estalian-nom": [35, 35],
        "human-indan-nom": [36, 37],
        "human-gospodar-nom": [34, 34],
        "human-ungol-nom": [34, 34],
        "human-nipponese-nom": [28, 29],
        "human-norscan-nom": [17, 18],
        "human-southlander-nom": [18, 20],
        "human-strigany-nom": [13, 14],
        "human-tilean-nom": [41, 41],
        "human-westerlander-nom": [35, 36]
      },
      "human-albionite-nom": { "name": "Servant" },
      "human-arabyan-nom": { "name": "Servant" },
      "human-breton-noble-nom": { "name": "Servant" },
      "human-breton-lowborn-nom": { "name": "Servant" },
      "human-cathayan-nom": { "name": "Servant" },
      "human-estalian-nom": { "name": "Servant" },
      "human-indan-nom": { "name": "Servant" },
      "human-gospodar-nom": { "name": "Servant" },
      "human-ungol-nom": { "name": "Servant" },
      "human-nipponese-nom": { "name": "Servant" },
      "human-norscan-nom": { "name": "Servant" },
      "human-southlander-nom": { "name": "Servant" },
      "human-strigany-nom": { "name": "Servant" },
      "human-tilean-nom": { "name": "Servant" },
      "human-westerlander-nom": { "name": "Servant" }
    },
    {
      "range": {
        "human-albionite-nom": [9, 9],
        "human-arabyan-nom": [34, 35],
        "human-breton-noble-nom": [],
        "human-breton-lowborn-nom": [30, 30],
        "human-cathayan-nom": [39, 39],
        "human-estalian-nom": [36, 36],
        "human-indan-nom": [38, 38],
        "human-gospodar-nom": [35, 35],
        "human-ungol-nom": [35, 35],
        "human-nipponese-nom": [28, 29],
        "human-norscan-nom": [],
        "human-southlander-nom": [],
        "human-strigany-nom": [15, 16],
        "human-tilean-nom": [42, 42],
        "human-westerlander-nom": [37, 37]
      },
      "human-albionite-nom": { "name": "Spy" },
      "human-arabyan-nom": { "name": "Spy" },
      "human-breton-noble-nom": { "name": "Spy" },
      "human-breton-lowborn-nom": { "name": "Spy" },
      "human-cathayan-nom": { "name": "Spy" },
      "human-estalian-nom": { "name": "Spy" },
      "human-indan-nom": { "name": "Spy" },
      "human-gospodar-nom": { "name": "Spy" },
      "human-ungol-nom": { "name": "Spy" },
      "human-nipponese-nom": { "name": "Spy" },
      "human-norscan-nom": { "name": "Spy" },
      "human-southlander-nom": { "name": "Spy" },
      "human-strigany-nom": { "name": "Spy" },
      "human-tilean-nom": { "name": "Spy" },
      "human-westerlander-nom": { "name": "Spy" }
    },
    {
      "range": {
        "human-albionite-nom": [],
        "human-arabyan-nom": [36, 36],
        "human-breton-noble-nom": [],
        "human-breton-lowborn-nom": [31, 31],
        "human-cathayan-nom": [40, 40],
        "human-estalian-nom": [37, 37],
        "human-indan-nom": [39, 39],
        "human-gospodar-nom": [36, 36],
        "human-ungol-nom": [36, 36],
        "human-nipponese-nom": [31, 31],
        "human-norscan-nom": [19, 19],
        "human-southlander-nom": [],
        "human-strigany-nom": [],
        "human-tilean-nom": [43, 43],
        "human-westerlander-nom": [38, 38]
      },
      "human-albionite-nom": { "name": "Warden" },
      "human-arabyan-nom": { "name": "Warden" },
      "human-breton-noble-nom": { "name": "Warden" },
      "human-breton-lowborn-nom": { "name": "Warden" },
      "human-cathayan-nom": { "name": "Warden" },
      "human-estalian-nom": { "name": "Warden" },
      "human-indan-nom": { "name": "Warden" },
      "human-gospodar-nom": { "name": "Warden" },
      "human-ungol-nom": { "name": "Warden" },
      "human-nipponese-nom": { "name": "Warden" },
      "human-norscan-nom": { "name": "Warden" },
      "human-southlander-nom": { "name": "Warden" },
      "human-strigany-nom": { "name": "Warden" },
      "human-tilean-nom": { "name": "Warden" },
      "human-westerlander-nom": { "name": "Warden" }
    },
    {
      "range": {
        "human-albionite-nom": [],
        "human-arabyan-nom": [37, 37],
        "human-breton-noble-nom": [],
        "human-breton-lowborn-nom": [32, 32],
        "human-cathayan-nom": [41, 41],
        "human-estalian-nom": [38, 38],
        "human-indan-nom": [40, 40],
        "human-gospodar-nom": [37, 37],
        "human-ungol-nom": [37, 37],
        "human-nipponese-nom": [32, 32],
        "human-norscan-nom": [],
        "human-southlander-nom": [],
        "human-strigany-nom": [],
        "human-tilean-nom": [44, 44],
        "human-westerlander-nom": [39, 39]
      },
      "human-albionite-nom": { "name": "Bailiff" },
      "human-arabyan-nom": { "name": "Bailiff" },
      "human-breton-noble-nom": { "name": "Bailiff" },
      "human-breton-lowborn-nom": { "name": "Bailiff" },
      "human-cathayan-nom": { "name": "Bailiff" },
      "human-estalian-nom": { "name": "Bailiff" },
      "human-indan-nom": { "name": "Bailiff" },
      "human-gospodar-nom": { "name": "Bailiff" },
      "human-ungol-nom": { "name": "Bailiff" },
      "human-nipponese-nom": { "name": "Bailiff" },
      "human-norscan-nom": { "name": "Bailiff" },
      "human-southlander-nom": { "name": "Bailiff" },
      "human-strigany-nom": { "name": "Bailiff" },
      "human-tilean-nom": { "name": "Bailiff" },
      "human-westerlander-nom": { "name": "Bailiff" }
    },
    {
      "range": {
        "human-albionite-nom": [10, 10],
        "human-arabyan-nom": [],
        "human-breton-noble-nom": [],
        "human-breton-lowborn-nom": [33, 33],
        "human-cathayan-nom": [42, 42],
        "human-estalian-nom": [39, 39],
        "human-indan-nom": [41, 41],
        "human-gospodar-nom": [38, 38],
        "human-ungol-nom": [38, 38],
        "human-nipponese-nom": [33, 33],
        "human-norscan-nom": [20, 21],
        "human-southlander-nom": [21, 22],
        "human-strigany-nom": [17, 18],
        "human-tilean-nom": [45, 45],
        "human-westerlander-nom": [40, 40]
      },
      "human-albionite-nom": { "name": "Hedge Witch" },
      "human-arabyan-nom": { "name": "Hedge Witch" },
      "human-breton-noble-nom": { "name": "Hedge Witch" },
      "human-breton-lowborn-nom": { "name": "Hedge Witch" },
      "human-cathayan-nom": { "name": "Hedge Witch" },
      "human-estalian-nom": { "name": "Hedge Witch" },
      "human-indan-nom": { "name": "Hedge Witch" },
      "human-gospodar-nom": { "name": "Hedge Witch" },
      "human-ungol-nom": { "name": "Hedge Witch" },
      "human-nipponese-nom": { "name": "Hedge Witch" },
      "human-norscan-nom": { "name": "Hedge Witch" },
      "human-southlander-nom": { "name": "Hedge Witch" },
      "human-strigany-nom": { "name": "Hedge Witch" },
      "human-tilean-nom": { "name": "Hedge Witch" },
      "human-westerlander-nom": { "name": "Hedge Witch" }
    },
    {
      "range": {
        "human-albionite-nom": [11, 12],
        "human-arabyan-nom": [38, 38],
        "human-breton-noble-nom": [],
        "human-breton-lowborn-nom": [34, 35],
        "human-cathayan-nom": [43, 43],
        "human-estalian-nom": [40, 40],
        "human-indan-nom": [42, 42],
        "human-gospodar-nom": [39, 39],
        "human-ungol-nom": [39, 39],
        "human-nipponese-nom": [34, 34],
        "human-norscan-nom": [22, 23],
        "human-southlander-nom": [23, 24],
        "human-strigany-nom": [19, 20],
        "human-tilean-nom": [46, 46],
        "human-westerlander-nom": [41, 41]
      },
      "human-albionite-nom": { "name": "Herbalist" },
      "human-arabyan-nom": { "name": "Herbalist" },
      "human-breton-noble-nom": { "name": "Herbalist" },
      "human-breton-lowborn-nom": { "name": "Herbalist" },
      "human-cathayan-nom": { "name": "Herbalist" },
      "human-estalian-nom": { "name": "Herbalist" },
      "human-indan-nom": { "name": "Herbalist" },
      "human-gospodar-nom": { "name": "Herbalist" },
      "human-ungol-nom": { "name": "Herbalist" },
      "human-nipponese-nom": { "name": "Herbalist" },
      "human-norscan-nom": { "name": "Herbalist" },
      "human-southlander-nom": { "name": "Herbalist" },
      "human-strigany-nom": { "name": "Herbalist" },
      "human-tilean-nom": { "name": "Herbalist" },
      "human-westerlander-nom": { "name": "Herbalist" }
    },
    {
      "range": {
        "human-albionite-nom": [13, 20],
        "human-arabyan-nom": [39, 39],
        "human-breton-noble-nom": [],
        "human-breton-lowborn-nom": [36, 38],
        "human-cathayan-nom": [44, 44],
        "human-estalian-nom": [41, 41],
        "human-indan-nom": [43, 43],
        "human-gospodar-nom": [40, 40],
        "human-ungol-nom": [40, 40],
        "human-nipponese-nom": [35, 35],
        "human-norscan-nom": [24, 31],
        "human-southlander-nom": [25, 31],
        "human-strigany-nom": [21, 23],
        "human-tilean-nom": [47, 47],
        "human-westerlander-nom": [42, 42]
      },
      "human-albionite-nom": { "name": "Hunter" },
      "human-arabyan-nom": { "name": "Hunter" },
      "human-breton-noble-nom": { "name": "Hunter" },
      "human-breton-lowborn-nom": { "name": "Hunter" },
      "human-cathayan-nom": { "name": "Hunter" },
      "human-estalian-nom": { "name": "Hunter" },
      "human-indan-nom": { "name": "Hunter" },
      "human-gospodar-nom": { "name": "Hunter" },
      "human-ungol-nom": { "name": "Hunter" },
      "human-nipponese-nom": { "name": "Hunter" },
      "human-norscan-nom": { "name": "Hunter" },
      "human-southlander-nom": { "name": "Hunter" },
      "human-strigany-nom": { "name": "Hunter" },
      "human-tilean-nom": { "name": "Hunter" },
      "human-westerlander-nom": { "name": "Hunter" }
    },
    {
      "range": {
        "human-albionite-nom": [21, 21],
        "human-arabyan-nom": [40, 40],
        "human-breton-noble-nom": [],
        "human-breton-lowborn-nom": [39, 40],
        "human-cathayan-nom": [45, 45],
        "human-estalian-nom": [42, 42],
        "human-indan-nom": [44, 44],
        "human-gospodar-nom": [41, 41],
        "human-ungol-nom": [41, 41],
        "human-nipponese-nom": [36, 36],
        "human-norscan-nom": [31, 32],
        "human-southlander-nom": [32, 32],
        "human-strigany-nom": [24, 26],
        "human-tilean-nom": [48, 48],
        "human-westerlander-nom": []
      },
      "human-albionite-nom": { "name": "Miner" },
      "human-arabyan-nom": { "name": "Miner" },
      "human-breton-noble-nom": { "name": "Miner" },
      "human-breton-lowborn-nom": { "name": "Miner" },
      "human-cathayan-nom": { "name": "Miner" },
      "human-estalian-nom": { "name": "Miner" },
      "human-indan-nom": { "name": "Miner" },
      "human-gospodar-nom": { "name": "Miner" },
      "human-ungol-nom": { "name": "Miner" },
      "human-nipponese-nom": { "name": "Miner" },
      "human-norscan-nom": { "name": "Miner" },
      "human-southlander-nom": { "name": "Miner" },
      "human-strigany-nom": { "name": "Miner" },
      "human-tilean-nom": { "name": "Miner" },
      "human-westerlander-nom": { "name": "Miner" }
    },
    {
      "range": {
        "human-albionite-nom": [22, 22],
        "human-arabyan-nom": [41, 41],
        "human-breton-noble-nom": [],
        "human-breton-lowborn-nom": [41, 41],
        "human-cathayan-nom": [46, 46],
        "human-estalian-nom": [43, 43],
        "human-indan-nom": [45, 45],
        "human-gospodar-nom": [42, 42],
        "human-ungol-nom": [42, 42],
        "human-nipponese-nom": [37, 37],
        "human-norscan-nom": [33, 33],
        "human-southlander-nom": [33, 33],
        "human-strigany-nom": [27, 30],
        "human-tilean-nom": [49, 49],
        "human-westerlander-nom": [43, 43]
      },
      "human-albionite-nom": { "name": "Mystic" },
      "human-arabyan-nom": { "name": "Mystic" },
      "human-breton-noble-nom": { "name": "Mystic" },
      "human-breton-lowborn-nom": { "name": "Mystic" },
      "human-cathayan-nom": { "name": "Mystic" },
      "human-estalian-nom": { "name": "Mystic" },
      "human-indan-nom": { "name": "Mystic" },
      "human-gospodar-nom": { "name": "Mystic" },
      "human-ungol-nom": { "name": "Mystic" },
      "human-nipponese-nom": { "name": "Mystic" },
      "human-norscan-nom": { "name": "Mystic" },
      "human-southlander-nom": { "name": "Mystic" },
      "human-strigany-nom": { "name": "Mystic" },
      "human-tilean-nom": { "name": "Mystic" },
      "human-westerlander-nom": { "name": "Mystic" }
    },
    {
      "range": {
        "human-albionite-nom": [23, 24],
        "human-arabyan-nom": [42, 42],
        "human-breton-noble-nom": [],
        "human-breton-lowborn-nom": [42, 43],
        "human-cathayan-nom": [47, 47],
        "human-estalian-nom": [44, 44],
        "human-indan-nom": [46, 46],
        "human-gospodar-nom": [43, 43],
        "human-ungol-nom": [43, 43],
        "human-nipponese-nom": [38, 38],
        "human-norscan-nom": [34, 34],
        "human-southlander-nom": [34, 38],
        "human-strigany-nom": [31, 31],
        "human-tilean-nom": [50, 50],
        "human-westerlander-nom": [44, 44]
      },
      "human-albionite-nom": { "name": "Scout" },
      "human-arabyan-nom": { "name": "Scout" },
      "human-breton-noble-nom": { "name": "Scout" },
      "human-breton-lowborn-nom": { "name": "Scout" },
      "human-cathayan-nom": { "name": "Scout" },
      "human-estalian-nom": { "name": "Scout" },
      "human-indan-nom": { "name": "Scout" },
      "human-gospodar-nom": { "name": "Scout" },
      "human-ungol-nom": { "name": "Scout" },
      "human-nipponese-nom": { "name": "Scout" },
      "human-norscan-nom": { "name": "Scout" },
      "human-southlander-nom": { "name": "Scout" },
      "human-strigany-nom": { "name": "Scout" },
      "human-tilean-nom": { "name": "Scout" },
      "human-westerlander-nom": { "name": "Scout" }
    },
    {
      "range": {
        "human-albionite-nom": [25, 45],
        "human-arabyan-nom": [43, 48],
        "human-breton-noble-nom": [],
        "human-breton-lowborn-nom": [44, 55],
        "human-cathayan-nom": [48, 50],
        "human-estalian-nom": [45, 48],
        "human-indan-nom": [47, 52],
        "human-gospodar-nom": [44, 48],
        "human-ungol-nom": [44, 48],
        "human-nipponese-nom": [39, 44],
        "human-norscan-nom": [35, 42],
        "human-southlander-nom": [39, 50],
        "human-strigany-nom": [],
        "human-tilean-nom": [51, 53],
        "human-westerlander-nom": [45, 46]
      },
      "human-albionite-nom": { "name": "Villager" },
      "human-arabyan-nom": { "name": "Villager" },
      "human-breton-noble-nom": { "name": "Villager" },
      "human-breton-lowborn-nom": { "name": "Villager" },
      "human-cathayan-nom": { "name": "Villager" },
      "human-estalian-nom": { "name": "Villager" },
      "human-indan-nom": { "name": "Villager" },
      "human-gospodar-nom": { "name": "Villager" },
      "human-ungol-nom": { "name": "Villager" },
      "human-nipponese-nom": { "name": "Villager" },
      "human-norscan-nom": { "name": "Villager" },
      "human-southlander-nom": { "name": "Villager" },
      "human-strigany-nom": { "name": "Villager" },
      "human-tilean-nom": { "name": "Villager" },
      "human-westerlander-nom": { "name": "Villager" }
    },
    {
      "range": {
        "human-albionite-nom": [46, 46],
        "human-arabyan-nom": [49, 49],
        "human-breton-noble-nom": [],
        "human-breton-lowborn-nom": [56, 56],
        "human-cathayan-nom": [51, 51],
        "human-estalian-nom": [49, 49],
        "human-indan-nom": [],
        "human-gospodar-nom": [49, 50],
        "human-ungol-nom": [49, 50],
        "human-nipponese-nom": [45, 45],
        "human-norscan-nom": [43, 43],
        "human-southlander-nom": [51, 51],
        "human-strigany-nom": [32, 32],
        "human-tilean-nom": [54, 54],
        "human-westerlander-nom": [47, 47]
      },
      "human-albionite-nom": { "name": "Bounty Hunter" },
      "human-arabyan-nom": { "name": "Bounty Hunter" },
      "human-breton-noble-nom": { "name": "Bounty Hunter" },
      "human-breton-lowborn-nom": { "name": "Bounty Hunter" },
      "human-cathayan-nom": { "name": "Bounty Hunter" },
      "human-estalian-nom": { "name": "Bounty Hunter" },
      "human-indan-nom": { "name": "Bounty Hunter" },
      "human-gospodar-nom": { "name": "Bounty Hunter" },
      "human-ungol-nom": { "name": "Bounty Hunter" },
      "human-nipponese-nom": { "name": "Bounty Hunter" },
      "human-norscan-nom": { "name": "Bounty Hunter" },
      "human-southlander-nom": { "name": "Bounty Hunter" },
      "human-strigany-nom": { "name": "Bounty Hunter" },
      "human-tilean-nom": { "name": "Bounty Hunter" },
      "human-westerlander-nom": { "name": "Bounty Hunter" }
    },
    {
      "range": {
        "human-albionite-nom": [],
        "human-arabyan-nom": [50, 50],
        "human-breton-noble-nom": [],
        "human-breton-lowborn-nom": [57, 57],
        "human-cathayan-nom": [52, 52],
        "human-estalian-nom": [50, 50],
        "human-indan-nom": [53, 53],
        "human-gospodar-nom": [51, 51],
        "human-ungol-nom": [51, 51],
        "human-nipponese-nom": [46, 46],
        "human-norscan-nom": [],
        "human-southlander-nom": [],
        "human-strigany-nom": [33, 40],
        "human-tilean-nom": [55, 55],
        "human-westerlander-nom": [48, 48]
      },
      "human-albionite-nom": { "name": "Coachman" },
      "human-arabyan-nom": { "name": "Coachman" },
      "human-breton-noble-nom": { "name": "Coachman" },
      "human-breton-lowborn-nom": { "name": "Coachman" },
      "human-cathayan-nom": { "name": "Coachman" },
      "human-estalian-nom": { "name": "Coachman" },
      "human-indan-nom": { "name": "Coachman" },
      "human-gospodar-nom": { "name": "Coachman" },
      "human-ungol-nom": { "name": "Coachman" },
      "human-nipponese-nom": { "name": "Coachman" },
      "human-norscan-nom": { "name": "Coachman" },
      "human-southlander-nom": { "name": "Coachman" },
      "human-strigany-nom": { "name": "Coachman" },
      "human-tilean-nom": { "name": "Coachman" },
      "human-westerlander-nom": { "name": "Coachman" }
    },
    {
      "range": {
        "human-albionite-nom": [47, 50],
        "human-arabyan-nom": [51, 52],
        "human-breton-noble-nom": [],
        "human-breton-lowborn-nom": [58, 59],
        "human-cathayan-nom": [53, 54],
        "human-estalian-nom": [51, 52],
        "human-indan-nom": [54, 56],
        "human-gospodar-nom": [52, 52],
        "human-ungol-nom": [52, 52],
        "human-nipponese-nom": [47, 47],
        "human-norscan-nom": [44, 44],
        "human-southlander-nom": [52, 55],
        "human-strigany-nom": [41, 50],
        "human-tilean-nom": [56, 58],
        "human-westerlander-nom": [49, 50]
      },
      "human-albionite-nom": { "name": "Entertainer" },
      "human-arabyan-nom": { "name": "Entertainer" },
      "human-breton-noble-nom": { "name": "Entertainer" },
      "human-breton-lowborn-nom": { "name": "Entertainer" },
      "human-cathayan-nom": { "name": "Entertainer" },
      "human-estalian-nom": { "name": "Entertainer" },
      "human-indan-nom": { "name": "Entertainer" },
      "human-gospodar-nom": { "name": "Entertainer" },
      "human-ungol-nom": { "name": "Entertainer" },
      "human-nipponese-nom": { "name": "Entertainer" },
      "human-norscan-nom": { "name": "Entertainer" },
      "human-southlander-nom": { "name": "Entertainer" },
      "human-strigany-nom": { "name": "Entertainer" },
      "human-tilean-nom": { "name": "Entertainer" },
      "human-westerlander-nom": { "name": "Entertainer" }
    },
    {
      "range": {
        "human-albionite-nom": [],
        "human-arabyan-nom": [],
        "human-breton-noble-nom": [],
        "human-breton-lowborn-nom": [],
        "human-cathayan-nom": [],
        "human-estalian-nom": [],
        "human-indan-nom": [],
        "human-gospodar-nom": [],
        "human-ungol-nom": [],
        "human-nipponese-nom": [],
        "human-norscan-nom": [],
        "human-southlander-nom": [],
        "human-strigany-nom": [],
        "human-tilean-nom": [],
        "human-westerlander-nom": []
      },
      "human-albionite-nom": { "name": "Flagellant" },
      "human-arabyan-nom": { "name": "Flagellant" },
      "human-breton-noble-nom": { "name": "Flagellant" },
      "human-breton-lowborn-nom": { "name": "Flagellant" },
      "human-cathayan-nom": { "name": "Flagellant" },
      "human-estalian-nom": { "name": "Flagellant" },
      "human-indan-nom": { "name": "Flagellant" },
      "human-gospodar-nom": { "name": "Flagellant" },
      "human-ungol-nom": { "name": "Flagellant" },
      "human-nipponese-nom": { "name": "Flagellant" },
      "human-norscan-nom": { "name": "Flagellant" },
      "human-southlander-nom": { "name": "Flagellant" },
      "human-strigany-nom": { "name": "Flagellant" },
      "human-tilean-nom": { "name": "Flagellant" },
      "human-westerlander-nom": { "name": "Flagellant" }
    },
    {
      "range": {
        "human-albionite-nom": [51, 53],
        "human-arabyan-nom": [53, 53],
        "human-breton-noble-nom": [],
        "human-breton-lowborn-nom": [60, 60],
        "human-cathayan-nom": [55, 55],
        "human-estalian-nom": [53, 53],
        "human-indan-nom": [57, 57],
        "human-gospodar-nom": [53, 53],
        "human-ungol-nom": [53, 53],
        "human-nipponese-nom": [48, 48],
        "human-norscan-nom": [45, 45],
        "human-southlander-nom": [56, 57],
        "human-strigany-nom": [51, 52],
        "human-tilean-nom": [59, 59],
        "human-westerlander-nom": [51, 51]
      },
      "human-albionite-nom": { "name": "Messenger" },
      "human-arabyan-nom": { "name": "Messenger" },
      "human-breton-noble-nom": { "name": "Messenger" },
      "human-breton-lowborn-nom": { "name": "Messenger" },
      "human-cathayan-nom": { "name": "Messenger" },
      "human-estalian-nom": { "name": "Messenger" },
      "human-indan-nom": { "name": "Messenger" },
      "human-gospodar-nom": { "name": "Messenger" },
      "human-ungol-nom": { "name": "Messenger" },
      "human-nipponese-nom": { "name": "Messenger" },
      "human-norscan-nom": { "name": "Messenger" },
      "human-southlander-nom": { "name": "Messenger" },
      "human-strigany-nom": { "name": "Messenger" },
      "human-tilean-nom": { "name": "Messenger" },
      "human-westerlander-nom": { "name": "Messenger" }
    },
    {
      "range": {
        "human-albionite-nom": [54, 58],
        "human-arabyan-nom": [54, 56],
        "human-breton-noble-nom": [],
        "human-breton-lowborn-nom": [61, 63],
        "human-cathayan-nom": [56, 57],
        "human-estalian-nom": [54, 55],
        "human-indan-nom": [58, 60],
        "human-gospodar-nom": [1, 1],
        "human-ungol-nom": [1, 1],
        "human-nipponese-nom": [1, 1],
        "human-norscan-nom": [1, 2],
        "human-southlander-nom": [],
        "human-strigany-nom": [1, 1],
        "human-tilean-nom": [1, 2],
        "human-westerlander-nom": []
      },
      "human-albionite-nom": { "name": "Pedlar" },
      "human-arabyan-nom": { "name": "Pedlar" },
      "human-breton-noble-nom": { "name": "Pedlar" },
      "human-breton-lowborn-nom": { "name": "Pedlar" },
      "human-cathayan-nom": { "name": "Pedlar" },
      "human-estalian-nom": { "name": "Pedlar" },
      "human-indan-nom": { "name": "Pedlar" },
      "human-gospodar-nom": { "name": "Pedlar" },
      "human-ungol-nom": { "name": "Pedlar" },
      "human-nipponese-nom": { "name": "Pedlar" },
      "human-norscan-nom": { "name": "Pedlar" },
      "human-southlander-nom": { "name": "Pedlar" },
      "human-strigany-nom": { "name": "Pedlar" },
      "human-tilean-nom": { "name": "Pedlar" },
      "human-westerlander-nom": { "name": "Pedlar" }
    },
    {
      "range": {
        "human-albionite-nom": [1, 1],
        "human-arabyan-nom": [1, 1],
        "human-breton-noble-nom": [1, 1],
        "human-breton-lowborn-nom": [1, 1],
        "human-cathayan-nom": [1, 2],
        "human-estalian-nom": [],
        "human-indan-nom": [1, 1],
        "human-gospodar-nom": [1, 1],
        "human-ungol-nom": [1, 1],
        "human-nipponese-nom": [1, 1],
        "human-norscan-nom": [1, 2],
        "human-southlander-nom": [],
        "human-strigany-nom": [1, 1],
        "human-tilean-nom": [1, 2],
        "human-westerlander-nom": []
      },
      "human-albionite-nom": { "name": "Road warden" },
      "human-arabyan-nom": { "name": "Road warden" },
      "human-breton-noble-nom": { "name": "Road warden" },
      "human-breton-lowborn-nom": { "name": "Road warden" },
      "human-cathayan-nom": { "name": "Road warden" },
      "human-estalian-nom": { "name": "Road warden" },
      "human-indan-nom": { "name": "Road warden" },
      "human-gospodar-nom": { "name": "Road warden" },
      "human-ungol-nom": { "name": "Road warden" },
      "human-nipponese-nom": { "name": "Road warden" },
      "human-norscan-nom": { "name": "Road warden" },
      "human-southlander-nom": { "name": "Road warden" },
      "human-strigany-nom": { "name": "Road warden" },
      "human-tilean-nom": { "name": "Road warden" },
      "human-westerlander-nom": { "name": "Road warden" }
    },
    {
      "range": {
        "human-albionite-nom": [1, 1],
        "human-arabyan-nom": [1, 1],
        "human-breton-noble-nom": [1, 1],
        "human-breton-lowborn-nom": [1, 1],
        "human-cathayan-nom": [1, 2],
        "human-estalian-nom": [],
        "human-indan-nom": [1, 1],
        "human-gospodar-nom": [1, 1],
        "human-ungol-nom": [1, 1],
        "human-nipponese-nom": [1, 1],
        "human-norscan-nom": [1, 2],
        "human-southlander-nom": [],
        "human-strigany-nom": [1, 1],
        "human-tilean-nom": [1, 2],
        "human-westerlander-nom": []
      },
      "human-albionite-nom": { "name": "Witch Hunter" },
      "human-arabyan-nom": { "name": "Witch Hunter" },
      "human-breton-noble-nom": { "name": "Witch Hunter" },
      "human-breton-lowborn-nom": { "name": "Witch Hunter" },
      "human-cathayan-nom": { "name": "Witch Hunter" },
      "human-estalian-nom": { "name": "Witch Hunter" },
      "human-indan-nom": { "name": "Witch Hunter" },
      "human-gospodar-nom": { "name": "Witch Hunter" },
      "human-ungol-nom": { "name": "Witch Hunter" },
      "human-nipponese-nom": { "name": "Witch Hunter" },
      "human-norscan-nom": { "name": "Witch Hunter" },
      "human-southlander-nom": { "name": "Witch Hunter" },
      "human-strigany-nom": { "name": "Witch Hunter" },
      "human-tilean-nom": { "name": "Witch Hunter" },
      "human-westerlander-nom": { "name": "Witch Hunter" }
    },
    {
      "range": {
        "human-albionite-nom": [1, 1],
        "human-arabyan-nom": [1, 1],
        "human-breton-noble-nom": [1, 1],
        "human-breton-lowborn-nom": [1, 1],
        "human-cathayan-nom": [1, 2],
        "human-estalian-nom": [],
        "human-indan-nom": [1, 1],
        "human-gospodar-nom": [1, 1],
        "human-ungol-nom": [1, 1],
        "human-nipponese-nom": [1, 1],
        "human-norscan-nom": [1, 2],
        "human-southlander-nom": [],
        "human-strigany-nom": [1, 1],
        "human-tilean-nom": [1, 2],
        "human-westerlander-nom": []
      },
      "human-albionite-nom": { "name": "Boatman" },
      "human-arabyan-nom": { "name": "Boatman" },
      "human-breton-noble-nom": { "name": "Boatman" },
      "human-breton-lowborn-nom": { "name": "Boatman" },
      "human-cathayan-nom": { "name": "Boatman" },
      "human-estalian-nom": { "name": "Boatman" },
      "human-indan-nom": { "name": "Boatman" },
      "human-gospodar-nom": { "name": "Boatman" },
      "human-ungol-nom": { "name": "Boatman" },
      "human-nipponese-nom": { "name": "Boatman" },
      "human-norscan-nom": { "name": "Boatman" },
      "human-southlander-nom": { "name": "Boatman" },
      "human-strigany-nom": { "name": "Boatman" },
      "human-tilean-nom": { "name": "Boatman" },
      "human-westerlander-nom": { "name": "Boatman" }
    },
    {
      "range": {
        "human-albionite-nom": [1, 1],
        "human-arabyan-nom": [1, 1],
        "human-breton-noble-nom": [1, 1],
        "human-breton-lowborn-nom": [1, 1],
        "human-cathayan-nom": [1, 2],
        "human-estalian-nom": [],
        "human-indan-nom": [1, 1],
        "human-gospodar-nom": [1, 1],
        "human-ungol-nom": [1, 1],
        "human-nipponese-nom": [1, 1],
        "human-norscan-nom": [1, 2],
        "human-southlander-nom": [],
        "human-strigany-nom": [1, 1],
        "human-tilean-nom": [1, 2],
        "human-westerlander-nom": []
      },
      "human-albionite-nom": { "name": "Huffer" },
      "human-arabyan-nom": { "name": "Huffer" },
      "human-breton-noble-nom": { "name": "Huffer" },
      "human-breton-lowborn-nom": { "name": "Huffer" },
      "human-cathayan-nom": { "name": "Huffer" },
      "human-estalian-nom": { "name": "Huffer" },
      "human-indan-nom": { "name": "Huffer" },
      "human-gospodar-nom": { "name": "Huffer" },
      "human-ungol-nom": { "name": "Huffer" },
      "human-nipponese-nom": { "name": "Huffer" },
      "human-norscan-nom": { "name": "Huffer" },
      "human-southlander-nom": { "name": "Huffer" },
      "human-strigany-nom": { "name": "Huffer" },
      "human-tilean-nom": { "name": "Huffer" },
      "human-westerlander-nom": { "name": "Huffer" }
    },
    {
      "range": {
        "human-albionite-nom": [1, 1],
        "human-arabyan-nom": [1, 1],
        "human-breton-noble-nom": [1, 1],
        "human-breton-lowborn-nom": [1, 1],
        "human-cathayan-nom": [1, 2],
        "human-estalian-nom": [],
        "human-indan-nom": [1, 1],
        "human-gospodar-nom": [1, 1],
        "human-ungol-nom": [1, 1],
        "human-nipponese-nom": [1, 1],
        "human-norscan-nom": [1, 2],
        "human-southlander-nom": [],
        "human-strigany-nom": [1, 1],
        "human-tilean-nom": [1, 2],
        "human-westerlander-nom": []
      },
      "human-albionite-nom": { "name": "Riverwarden" },
      "human-arabyan-nom": { "name": "Riverwarden" },
      "human-breton-noble-nom": { "name": "Riverwarden" },
      "human-breton-lowborn-nom": { "name": "Riverwarden" },
      "human-cathayan-nom": { "name": "Riverwarden" },
      "human-estalian-nom": { "name": "Riverwarden" },
      "human-indan-nom": { "name": "Riverwarden" },
      "human-gospodar-nom": { "name": "Riverwarden" },
      "human-ungol-nom": { "name": "Riverwarden" },
      "human-nipponese-nom": { "name": "Riverwarden" },
      "human-norscan-nom": { "name": "Riverwarden" },
      "human-southlander-nom": { "name": "Riverwarden" },
      "human-strigany-nom": { "name": "Riverwarden" },
      "human-tilean-nom": { "name": "Riverwarden" },
      "human-westerlander-nom": { "name": "Riverwarden" }
    },
    {
      "range": {
        "human-albionite-nom": [1, 1],
        "human-arabyan-nom": [1, 1],
        "human-breton-noble-nom": [1, 1],
        "human-breton-lowborn-nom": [1, 1],
        "human-cathayan-nom": [1, 2],
        "human-estalian-nom": [],
        "human-indan-nom": [1, 1],
        "human-gospodar-nom": [1, 1],
        "human-ungol-nom": [1, 1],
        "human-nipponese-nom": [1, 1],
        "human-norscan-nom": [1, 2],
        "human-southlander-nom": [],
        "human-strigany-nom": [1, 1],
        "human-tilean-nom": [1, 2],
        "human-westerlander-nom": []
      },
      "human-albionite-nom": { "name": "Riverwoman" },
      "human-arabyan-nom": { "name": "Riverwoman" },
      "human-breton-noble-nom": { "name": "Riverwoman" },
      "human-breton-lowborn-nom": { "name": "Riverwoman" },
      "human-cathayan-nom": { "name": "Riverwoman" },
      "human-estalian-nom": { "name": "Riverwoman" },
      "human-indan-nom": { "name": "Riverwoman" },
      "human-gospodar-nom": { "name": "Riverwoman" },
      "human-ungol-nom": { "name": "Riverwoman" },
      "human-nipponese-nom": { "name": "Riverwoman" },
      "human-norscan-nom": { "name": "Riverwoman" },
      "human-southlander-nom": { "name": "Riverwoman" },
      "human-strigany-nom": { "name": "Riverwoman" },
      "human-tilean-nom": { "name": "Riverwoman" },
      "human-westerlander-nom": { "name": "Riverwoman" }
    },
    {
      "range": {
        "human-albionite-nom": [1, 1],
        "human-arabyan-nom": [1, 1],
        "human-breton-noble-nom": [1, 1],
        "human-breton-lowborn-nom": [1, 1],
        "human-cathayan-nom": [1, 2],
        "human-estalian-nom": [],
        "human-indan-nom": [1, 1],
        "human-gospodar-nom": [1, 1],
        "human-ungol-nom": [1, 1],
        "human-nipponese-nom": [1, 1],
        "human-norscan-nom": [1, 2],
        "human-southlander-nom": [],
        "human-strigany-nom": [1, 1],
        "human-tilean-nom": [1, 2],
        "human-westerlander-nom": []
      },
      "human-albionite-nom": { "name": "Seaman" },
      "human-arabyan-nom": { "name": "Seaman" },
      "human-breton-noble-nom": { "name": "Seaman" },
      "human-breton-lowborn-nom": { "name": "Seaman" },
      "human-cathayan-nom": { "name": "Seaman" },
      "human-estalian-nom": { "name": "Seaman" },
      "human-indan-nom": { "name": "Seaman" },
      "human-gospodar-nom": { "name": "Seaman" },
      "human-ungol-nom": { "name": "Seaman" },
      "human-nipponese-nom": { "name": "Seaman" },
      "human-norscan-nom": { "name": "Seaman" },
      "human-southlander-nom": { "name": "Seaman" },
      "human-strigany-nom": { "name": "Seaman" },
      "human-tilean-nom": { "name": "Seaman" },
      "human-westerlander-nom": { "name": "Seaman" }
    },
    {
      "range": {
        "human-albionite-nom": [1, 1],
        "human-arabyan-nom": [1, 1],
        "human-breton-noble-nom": [1, 1],
        "human-breton-lowborn-nom": [1, 1],
        "human-cathayan-nom": [1, 2],
        "human-estalian-nom": [],
        "human-indan-nom": [1, 1],
        "human-gospodar-nom": [1, 1],
        "human-ungol-nom": [1, 1],
        "human-nipponese-nom": [1, 1],
        "human-norscan-nom": [1, 2],
        "human-southlander-nom": [],
        "human-strigany-nom": [1, 1],
        "human-tilean-nom": [1, 2],
        "human-westerlander-nom": []
      },
      "human-albionite-nom": { "name": "Smuggler" },
      "human-arabyan-nom": { "name": "Smuggler" },
      "human-breton-noble-nom": { "name": "Smuggler" },
      "human-breton-lowborn-nom": { "name": "Smuggler" },
      "human-cathayan-nom": { "name": "Smuggler" },
      "human-estalian-nom": { "name": "Smuggler" },
      "human-indan-nom": { "name": "Smuggler" },
      "human-gospodar-nom": { "name": "Smuggler" },
      "human-ungol-nom": { "name": "Smuggler" },
      "human-nipponese-nom": { "name": "Smuggler" },
      "human-norscan-nom": { "name": "Smuggler" },
      "human-southlander-nom": { "name": "Smuggler" },
      "human-strigany-nom": { "name": "Smuggler" },
      "human-tilean-nom": { "name": "Smuggler" },
      "human-westerlander-nom": { "name": "Smuggler" }
    },
    {
      "range": {
        "human-albionite-nom": [1, 1],
        "human-arabyan-nom": [1, 1],
        "human-breton-noble-nom": [1, 1],
        "human-breton-lowborn-nom": [1, 1],
        "human-cathayan-nom": [1, 2],
        "human-estalian-nom": [],
        "human-indan-nom": [1, 1],
        "human-gospodar-nom": [1, 1],
        "human-ungol-nom": [1, 1],
        "human-nipponese-nom": [1, 1],
        "human-norscan-nom": [1, 2],
        "human-southlander-nom": [],
        "human-strigany-nom": [1, 1],
        "human-tilean-nom": [1, 2],
        "human-westerlander-nom": []
      },
      "human-albionite-nom": { "name": "Stevedore" },
      "human-arabyan-nom": { "name": "Stevedore" },
      "human-breton-noble-nom": { "name": "Stevedore" },
      "human-breton-lowborn-nom": { "name": "Stevedore" },
      "human-cathayan-nom": { "name": "Stevedore" },
      "human-estalian-nom": { "name": "Stevedore" },
      "human-indan-nom": { "name": "Stevedore" },
      "human-gospodar-nom": { "name": "Stevedore" },
      "human-ungol-nom": { "name": "Stevedore" },
      "human-nipponese-nom": { "name": "Stevedore" },
      "human-norscan-nom": { "name": "Stevedore" },
      "human-southlander-nom": { "name": "Stevedore" },
      "human-strigany-nom": { "name": "Stevedore" },
      "human-tilean-nom": { "name": "Stevedore" },
      "human-westerlander-nom": { "name": "Stevedore" }
    },
    {
      "range": {
        "human-albionite-nom": [1, 1],
        "human-arabyan-nom": [1, 1],
        "human-breton-noble-nom": [1, 1],
        "human-breton-lowborn-nom": [1, 1],
        "human-cathayan-nom": [1, 2],
        "human-estalian-nom": [],
        "human-indan-nom": [1, 1],
        "human-gospodar-nom": [1, 1],
        "human-ungol-nom": [1, 1],
        "human-nipponese-nom": [1, 1],
        "human-norscan-nom": [1, 2],
        "human-southlander-nom": [],
        "human-strigany-nom": [1, 1],
        "human-tilean-nom": [1, 2],
        "human-westerlander-nom": []
      },
      "human-albionite-nom": { "name": "Wrecker" },
      "human-arabyan-nom": { "name": "Wrecker" },
      "human-breton-noble-nom": { "name": "Wrecker" },
      "human-breton-lowborn-nom": { "name": "Wrecker" },
      "human-cathayan-nom": { "name": "Wrecker" },
      "human-estalian-nom": { "name": "Wrecker" },
      "human-indan-nom": { "name": "Wrecker" },
      "human-gospodar-nom": { "name": "Wrecker" },
      "human-ungol-nom": { "name": "Wrecker" },
      "human-nipponese-nom": { "name": "Wrecker" },
      "human-norscan-nom": { "name": "Wrecker" },
      "human-southlander-nom": { "name": "Wrecker" },
      "human-strigany-nom": { "name": "Wrecker" },
      "human-tilean-nom": { "name": "Wrecker" },
      "human-westerlander-nom": { "name": "Wrecker" }
    },
    {
      "range": {
        "human-albionite-nom": [1, 1],
        "human-arabyan-nom": [1, 1],
        "human-breton-noble-nom": [1, 1],
        "human-breton-lowborn-nom": [1, 1],
        "human-cathayan-nom": [1, 2],
        "human-estalian-nom": [],
        "human-indan-nom": [1, 1],
        "human-gospodar-nom": [1, 1],
        "human-ungol-nom": [1, 1],
        "human-nipponese-nom": [1, 1],
        "human-norscan-nom": [1, 2],
        "human-southlander-nom": [],
        "human-strigany-nom": [1, 1],
        "human-tilean-nom": [1, 2],
        "human-westerlander-nom": []
      },
      "human-albionite-nom": { "name": "Bawd" },
      "human-arabyan-nom": { "name": "Bawd" },
      "human-breton-noble-nom": { "name": "Bawd" },
      "human-breton-lowborn-nom": { "name": "Bawd" },
      "human-cathayan-nom": { "name": "Bawd" },
      "human-estalian-nom": { "name": "Bawd" },
      "human-indan-nom": { "name": "Bawd" },
      "human-gospodar-nom": { "name": "Bawd" },
      "human-ungol-nom": { "name": "Bawd" },
      "human-nipponese-nom": { "name": "Bawd" },
      "human-norscan-nom": { "name": "Bawd" },
      "human-southlander-nom": { "name": "Bawd" },
      "human-strigany-nom": { "name": "Bawd" },
      "human-tilean-nom": { "name": "Bawd" },
      "human-westerlander-nom": { "name": "Bawd" }
    },
    {
      "range": {
        "human-albionite-nom": [1, 1],
        "human-arabyan-nom": [1, 1],
        "human-breton-noble-nom": [1, 1],
        "human-breton-lowborn-nom": [1, 1],
        "human-cathayan-nom": [1, 2],
        "human-estalian-nom": [],
        "human-indan-nom": [1, 1],
        "human-gospodar-nom": [1, 1],
        "human-ungol-nom": [1, 1],
        "human-nipponese-nom": [1, 1],
        "human-norscan-nom": [1, 2],
        "human-southlander-nom": [],
        "human-strigany-nom": [1, 1],
        "human-tilean-nom": [1, 2],
        "human-westerlander-nom": []
      },
      "human-albionite-nom": { "name": "Charlatan" },
      "human-arabyan-nom": { "name": "Charlatan" },
      "human-breton-noble-nom": { "name": "Charlatan" },
      "human-breton-lowborn-nom": { "name": "Charlatan" },
      "human-cathayan-nom": { "name": "Charlatan" },
      "human-estalian-nom": { "name": "Charlatan" },
      "human-indan-nom": { "name": "Charlatan" },
      "human-gospodar-nom": { "name": "Charlatan" },
      "human-ungol-nom": { "name": "Charlatan" },
      "human-nipponese-nom": { "name": "Charlatan" },
      "human-norscan-nom": { "name": "Charlatan" },
      "human-southlander-nom": { "name": "Charlatan" },
      "human-strigany-nom": { "name": "Charlatan" },
      "human-tilean-nom": { "name": "Charlatan" },
      "human-westerlander-nom": { "name": "Charlatan" }
    },
    {
      "range": {
        "human-albionite-nom": [1, 1],
        "human-arabyan-nom": [1, 1],
        "human-breton-noble-nom": [1, 1],
        "human-breton-lowborn-nom": [1, 1],
        "human-cathayan-nom": [1, 2],
        "human-estalian-nom": [],
        "human-indan-nom": [1, 1],
        "human-gospodar-nom": [1, 1],
        "human-ungol-nom": [1, 1],
        "human-nipponese-nom": [1, 1],
        "human-norscan-nom": [1, 2],
        "human-southlander-nom": [],
        "human-strigany-nom": [1, 1],
        "human-tilean-nom": [1, 2],
        "human-westerlander-nom": []
      },
      "human-albionite-nom": { "name": "Fence" },
      "human-arabyan-nom": { "name": "Fence" },
      "human-breton-noble-nom": { "name": "Fence" },
      "human-breton-lowborn-nom": { "name": "Fence" },
      "human-cathayan-nom": { "name": "Fence" },
      "human-estalian-nom": { "name": "Fence" },
      "human-indan-nom": { "name": "Fence" },
      "human-gospodar-nom": { "name": "Fence" },
      "human-ungol-nom": { "name": "Fence" },
      "human-nipponese-nom": { "name": "Fence" },
      "human-norscan-nom": { "name": "Fence" },
      "human-southlander-nom": { "name": "Fence" },
      "human-strigany-nom": { "name": "Fence" },
      "human-tilean-nom": { "name": "Fence" },
      "human-westerlander-nom": { "name": "Fence" }
    },
    {
      "range": {
        "human-albionite-nom": [1, 1],
        "human-arabyan-nom": [1, 1],
        "human-breton-noble-nom": [1, 1],
        "human-breton-lowborn-nom": [1, 1],
        "human-cathayan-nom": [1, 2],
        "human-estalian-nom": [],
        "human-indan-nom": [1, 1],
        "human-gospodar-nom": [1, 1],
        "human-ungol-nom": [1, 1],
        "human-nipponese-nom": [1, 1],
        "human-norscan-nom": [1, 2],
        "human-southlander-nom": [],
        "human-strigany-nom": [1, 1],
        "human-tilean-nom": [1, 2],
        "human-westerlander-nom": []
      },
      "human-albionite-nom": { "name": "Grave Robber" },
      "human-arabyan-nom": { "name": "Grave Robber" },
      "human-breton-noble-nom": { "name": "Grave Robber" },
      "human-breton-lowborn-nom": { "name": "Grave Robber" },
      "human-cathayan-nom": { "name": "Grave Robber" },
      "human-estalian-nom": { "name": "Grave Robber" },
      "human-indan-nom": { "name": "Grave Robber" },
      "human-gospodar-nom": { "name": "Grave Robber" },
      "human-ungol-nom": { "name": "Grave Robber" },
      "human-nipponese-nom": { "name": "Grave Robber" },
      "human-norscan-nom": { "name": "Grave Robber" },
      "human-southlander-nom": { "name": "Grave Robber" },
      "human-strigany-nom": { "name": "Grave Robber" },
      "human-tilean-nom": { "name": "Grave Robber" },
      "human-westerlander-nom": { "name": "Grave Robber" }
    },
    {
      "range": {
        "human-albionite-nom": [1, 1],
        "human-arabyan-nom": [1, 1],
        "human-breton-noble-nom": [1, 1],
        "human-breton-lowborn-nom": [1, 1],
        "human-cathayan-nom": [1, 2],
        "human-estalian-nom": [],
        "human-indan-nom": [1, 1],
        "human-gospodar-nom": [1, 1],
        "human-ungol-nom": [1, 1],
        "human-nipponese-nom": [1, 1],
        "human-norscan-nom": [1, 2],
        "human-southlander-nom": [],
        "human-strigany-nom": [1, 1],
        "human-tilean-nom": [1, 2],
        "human-westerlander-nom": []
      },
      "human-albionite-nom": { "name": "Outlaw" },
      "human-arabyan-nom": { "name": "Outlaw" },
      "human-breton-noble-nom": { "name": "Outlaw" },
      "human-breton-lowborn-nom": { "name": "Outlaw" },
      "human-cathayan-nom": { "name": "Outlaw" },
      "human-estalian-nom": { "name": "Outlaw" },
      "human-indan-nom": { "name": "Outlaw" },
      "human-gospodar-nom": { "name": "Outlaw" },
      "human-ungol-nom": { "name": "Outlaw" },
      "human-nipponese-nom": { "name": "Outlaw" },
      "human-norscan-nom": { "name": "Outlaw" },
      "human-southlander-nom": { "name": "Outlaw" },
      "human-strigany-nom": { "name": "Outlaw" },
      "human-tilean-nom": { "name": "Outlaw" },
      "human-westerlander-nom": { "name": "Outlaw" }
    },
    {
      "range": {
        "human-albionite-nom": [1, 1],
        "human-arabyan-nom": [1, 1],
        "human-breton-noble-nom": [1, 1],
        "human-breton-lowborn-nom": [1, 1],
        "human-cathayan-nom": [1, 2],
        "human-estalian-nom": [],
        "human-indan-nom": [1, 1],
        "human-gospodar-nom": [1, 1],
        "human-ungol-nom": [1, 1],
        "human-nipponese-nom": [1, 1],
        "human-norscan-nom": [1, 2],
        "human-southlander-nom": [],
        "human-strigany-nom": [1, 1],
        "human-tilean-nom": [1, 2],
        "human-westerlander-nom": []
      },
      "human-albionite-nom": { "name": "Racketeer" },
      "human-arabyan-nom": { "name": "Racketeer" },
      "human-breton-noble-nom": { "name": "Racketeer" },
      "human-breton-lowborn-nom": { "name": "Racketeer" },
      "human-cathayan-nom": { "name": "Racketeer" },
      "human-estalian-nom": { "name": "Racketeer" },
      "human-indan-nom": { "name": "Racketeer" },
      "human-gospodar-nom": { "name": "Racketeer" },
      "human-ungol-nom": { "name": "Racketeer" },
      "human-nipponese-nom": { "name": "Racketeer" },
      "human-norscan-nom": { "name": "Racketeer" },
      "human-southlander-nom": { "name": "Racketeer" },
      "human-strigany-nom": { "name": "Racketeer" },
      "human-tilean-nom": { "name": "Racketeer" },
      "human-westerlander-nom": { "name": "Racketeer" }
    },
    {
      "range": {
        "human-albionite-nom": [1, 1],
        "human-arabyan-nom": [1, 1],
        "human-breton-noble-nom": [1, 1],
        "human-breton-lowborn-nom": [1, 1],
        "human-cathayan-nom": [1, 2],
        "human-estalian-nom": [],
        "human-indan-nom": [1, 1],
        "human-gospodar-nom": [1, 1],
        "human-ungol-nom": [1, 1],
        "human-nipponese-nom": [1, 1],
        "human-norscan-nom": [1, 2],
        "human-southlander-nom": [],
        "human-strigany-nom": [1, 1],
        "human-tilean-nom": [1, 2],
        "human-westerlander-nom": []
      },
      "human-albionite-nom": { "name": "Thief" },
      "human-arabyan-nom": { "name": "Thief" },
      "human-breton-noble-nom": { "name": "Thief" },
      "human-breton-lowborn-nom": { "name": "Thief" },
      "human-cathayan-nom": { "name": "Thief" },
      "human-estalian-nom": { "name": "Thief" },
      "human-indan-nom": { "name": "Thief" },
      "human-gospodar-nom": { "name": "Thief" },
      "human-ungol-nom": { "name": "Thief" },
      "human-nipponese-nom": { "name": "Thief" },
      "human-norscan-nom": { "name": "Thief" },
      "human-southlander-nom": { "name": "Thief" },
      "human-strigany-nom": { "name": "Thief" },
      "human-tilean-nom": { "name": "Thief" },
      "human-westerlander-nom": { "name": "Thief" }
    },
    {
      "range": {
        "human-albionite-nom": [1, 1],
        "human-arabyan-nom": [1, 1],
        "human-breton-noble-nom": [1, 1],
        "human-breton-lowborn-nom": [1, 1],
        "human-cathayan-nom": [1, 2],
        "human-estalian-nom": [],
        "human-indan-nom": [1, 1],
        "human-gospodar-nom": [1, 1],
        "human-ungol-nom": [1, 1],
        "human-nipponese-nom": [1, 1],
        "human-norscan-nom": [1, 2],
        "human-southlander-nom": [],
        "human-strigany-nom": [1, 1],
        "human-tilean-nom": [1, 2],
        "human-westerlander-nom": []
      },
      "human-albionite-nom": { "name": "Witch" },
      "human-arabyan-nom": { "name": "Witch" },
      "human-breton-noble-nom": { "name": "Witch" },
      "human-breton-lowborn-nom": { "name": "Witch" },
      "human-cathayan-nom": { "name": "Witch" },
      "human-estalian-nom": { "name": "Witch" },
      "human-indan-nom": { "name": "Witch" },
      "human-gospodar-nom": { "name": "Witch" },
      "human-ungol-nom": { "name": "Witch" },
      "human-nipponese-nom": { "name": "Witch" },
      "human-norscan-nom": { "name": "Witch" },
      "human-southlander-nom": { "name": "Witch" },
      "human-strigany-nom": { "name": "Witch" },
      "human-tilean-nom": { "name": "Witch" },
      "human-westerlander-nom": { "name": "Witch" }
    },
    {
      "range": {
        "human-albionite-nom": [1, 1],
        "human-arabyan-nom": [1, 1],
        "human-breton-noble-nom": [1, 1],
        "human-breton-lowborn-nom": [1, 1],
        "human-cathayan-nom": [1, 2],
        "human-estalian-nom": [],
        "human-indan-nom": [1, 1],
        "human-gospodar-nom": [1, 1],
        "human-ungol-nom": [1, 1],
        "human-nipponese-nom": [1, 1],
        "human-norscan-nom": [1, 2],
        "human-southlander-nom": [],
        "human-strigany-nom": [1, 1],
        "human-tilean-nom": [1, 2],
        "human-westerlander-nom": []
      },
      "human-albionite-nom": { "name": "Cavalryman" },
      "human-arabyan-nom": { "name": "Cavalryman" },
      "human-breton-noble-nom": { "name": "Cavalryman" },
      "human-breton-lowborn-nom": { "name": "Cavalryman" },
      "human-cathayan-nom": { "name": "Cavalryman" },
      "human-estalian-nom": { "name": "Cavalryman" },
      "human-indan-nom": { "name": "Cavalryman" },
      "human-gospodar-nom": { "name": "Cavalryman" },
      "human-ungol-nom": { "name": "Cavalryman" },
      "human-nipponese-nom": { "name": "Cavalryman" },
      "human-norscan-nom": { "name": "Cavalryman" },
      "human-southlander-nom": { "name": "Cavalryman" },
      "human-strigany-nom": { "name": "Cavalryman" },
      "human-tilean-nom": { "name": "Cavalryman" },
      "human-westerlander-nom": { "name": "Cavalryman" }
    },
    {
      "range": {
        "human-albionite-nom": [1, 1],
        "human-arabyan-nom": [1, 1],
        "human-breton-noble-nom": [1, 1],
        "human-breton-lowborn-nom": [1, 1],
        "human-cathayan-nom": [1, 2],
        "human-estalian-nom": [],
        "human-indan-nom": [1, 1],
        "human-gospodar-nom": [1, 1],
        "human-ungol-nom": [1, 1],
        "human-nipponese-nom": [1, 1],
        "human-norscan-nom": [1, 2],
        "human-southlander-nom": [],
        "human-strigany-nom": [1, 1],
        "human-tilean-nom": [1, 2],
        "human-westerlander-nom": []
      },
      "human-albionite-nom": { "name": "Guard" },
      "human-arabyan-nom": { "name": "Guard" },
      "human-breton-noble-nom": { "name": "Guard" },
      "human-breton-lowborn-nom": { "name": "Guard" },
      "human-cathayan-nom": { "name": "Guard" },
      "human-estalian-nom": { "name": "Guard" },
      "human-indan-nom": { "name": "Guard" },
      "human-gospodar-nom": { "name": "Guard" },
      "human-ungol-nom": { "name": "Guard" },
      "human-nipponese-nom": { "name": "Guard" },
      "human-norscan-nom": { "name": "Guard" },
      "human-southlander-nom": { "name": "Guard" },
      "human-strigany-nom": { "name": "Guard" },
      "human-tilean-nom": { "name": "Guard" },
      "human-westerlander-nom": { "name": "Guard" }
    },
    {
      "range": {
        "human-albionite-nom": [1, 1],
        "human-arabyan-nom": [1, 1],
        "human-breton-noble-nom": [1, 1],
        "human-breton-lowborn-nom": [1, 1],
        "human-cathayan-nom": [1, 2],
        "human-estalian-nom": [],
        "human-indan-nom": [1, 1],
        "human-gospodar-nom": [1, 1],
        "human-ungol-nom": [1, 1],
        "human-nipponese-nom": [1, 1],
        "human-norscan-nom": [1, 2],
        "human-southlander-nom": [],
        "human-strigany-nom": [1, 1],
        "human-tilean-nom": [1, 2],
        "human-westerlander-nom": []
      },
      "human-albionite-nom": { "name": "Knight" },
      "human-arabyan-nom": { "name": "Knight" },
      "human-breton-noble-nom": { "name": "Knight" },
      "human-breton-lowborn-nom": { "name": "Knight" },
      "human-cathayan-nom": { "name": "Knight" },
      "human-estalian-nom": { "name": "Knight" },
      "human-indan-nom": { "name": "Knight" },
      "human-gospodar-nom": { "name": "Knight" },
      "human-ungol-nom": { "name": "Knight" },
      "human-nipponese-nom": { "name": "Knight" },
      "human-norscan-nom": { "name": "Knight" },
      "human-southlander-nom": { "name": "Knight" },
      "human-strigany-nom": { "name": "Knight" },
      "human-tilean-nom": { "name": "Knight" },
      "human-westerlander-nom": { "name": "Knight" }
    },
    {
      "range": {
        "human-albionite-nom": [1, 1],
        "human-arabyan-nom": [1, 1],
        "human-breton-noble-nom": [1, 1],
        "human-breton-lowborn-nom": [1, 1],
        "human-cathayan-nom": [1, 2],
        "human-estalian-nom": [],
        "human-indan-nom": [1, 1],
        "human-gospodar-nom": [1, 1],
        "human-ungol-nom": [1, 1],
        "human-nipponese-nom": [1, 1],
        "human-norscan-nom": [1, 2],
        "human-southlander-nom": [],
        "human-strigany-nom": [1, 1],
        "human-tilean-nom": [1, 2],
        "human-westerlander-nom": []
      },
      "human-albionite-nom": { "name": "Pit Fighter" },
      "human-arabyan-nom": { "name": "Pit Fighter" },
      "human-breton-noble-nom": { "name": "Pit Fighter" },
      "human-breton-lowborn-nom": { "name": "Pit Fighter" },
      "human-cathayan-nom": { "name": "Pit Fighter" },
      "human-estalian-nom": { "name": "Pit Fighter" },
      "human-indan-nom": { "name": "Pit Fighter" },
      "human-gospodar-nom": { "name": "Pit Fighter" },
      "human-ungol-nom": { "name": "Pit Fighter" },
      "human-nipponese-nom": { "name": "Pit Fighter" },
      "human-norscan-nom": { "name": "Pit Fighter" },
      "human-southlander-nom": { "name": "Pit Fighter" },
      "human-strigany-nom": { "name": "Pit Fighter" },
      "human-tilean-nom": { "name": "Pit Fighter" },
      "human-westerlander-nom": { "name": "Pit Fighter" }
    },
    {
      "range": {
        "human-albionite-nom": [1, 1],
        "human-arabyan-nom": [1, 1],
        "human-breton-noble-nom": [1, 1],
        "human-breton-lowborn-nom": [1, 1],
        "human-cathayan-nom": [1, 2],
        "human-estalian-nom": [],
        "human-indan-nom": [1, 1],
        "human-gospodar-nom": [1, 1],
        "human-ungol-nom": [1, 1],
        "human-nipponese-nom": [1, 1],
        "human-norscan-nom": [1, 2],
        "human-southlander-nom": [],
        "human-strigany-nom": [1, 1],
        "human-tilean-nom": [1, 2],
        "human-westerlander-nom": []
      },
      "human-albionite-nom": { "name": "Protagonist" },
      "human-arabyan-nom": { "name": "Protagonist" },
      "human-breton-noble-nom": { "name": "Protagonist" },
      "human-breton-lowborn-nom": { "name": "Protagonist" },
      "human-cathayan-nom": { "name": "Protagonist" },
      "human-estalian-nom": { "name": "Protagonist" },
      "human-indan-nom": { "name": "Protagonist" },
      "human-gospodar-nom": { "name": "Protagonist" },
      "human-ungol-nom": { "name": "Protagonist" },
      "human-nipponese-nom": { "name": "Protagonist" },
      "human-norscan-nom": { "name": "Protagonist" },
      "human-southlander-nom": { "name": "Protagonist" },
      "human-strigany-nom": { "name": "Protagonist" },
      "human-tilean-nom": { "name": "Protagonist" },
      "human-westerlander-nom": { "name": "Protagonist" }
    },
    {
      "range": {
        "human-albionite-nom": [1, 1],
        "human-arabyan-nom": [1, 1],
        "human-breton-noble-nom": [1, 1],
        "human-breton-lowborn-nom": [1, 1],
        "human-cathayan-nom": [1, 2],
        "human-estalian-nom": [],
        "human-indan-nom": [1, 1],
        "human-gospodar-nom": [1, 1],
        "human-ungol-nom": [1, 1],
        "human-nipponese-nom": [1, 1],
        "human-norscan-nom": [1, 2],
        "human-southlander-nom": [],
        "human-strigany-nom": [1, 1],
        "human-tilean-nom": [1, 2],
        "human-westerlander-nom": []
      },
      "human-albionite-nom": { "name": "Soldier" },
      "human-arabyan-nom": { "name": "Soldier" },
      "human-breton-noble-nom": { "name": "Soldier" },
      "human-breton-lowborn-nom": { "name": "Soldier" },
      "human-cathayan-nom": { "name": "Soldier" },
      "human-estalian-nom": { "name": "Soldier" },
      "human-indan-nom": { "name": "Soldier" },
      "human-gospodar-nom": { "name": "Soldier" },
      "human-ungol-nom": { "name": "Soldier" },
      "human-nipponese-nom": { "name": "Soldier" },
      "human-norscan-nom": { "name": "Soldier" },
      "human-southlander-nom": { "name": "Soldier" },
      "human-strigany-nom": { "name": "Soldier" },
      "human-tilean-nom": { "name": "Soldier" },
      "human-westerlander-nom": { "name": "Soldier" }
    },
    {
      "range": {
        "human-albionite-nom": [1, 1],
        "human-arabyan-nom": [1, 1],
        "human-breton-noble-nom": [1, 1],
        "human-breton-lowborn-nom": [1, 1],
        "human-cathayan-nom": [1, 2],
        "human-estalian-nom": [],
        "human-indan-nom": [1, 1],
        "human-gospodar-nom": [1, 1],
        "human-ungol-nom": [1, 1],
        "human-nipponese-nom": [1, 1],
        "human-norscan-nom": [1, 2],
        "human-southlander-nom": [],
        "human-strigany-nom": [1, 1],
        "human-tilean-nom": [1, 2],
        "human-westerlander-nom": []
      },
      "human-albionite-nom": { "name": "Slayer" },
      "human-arabyan-nom": { "name": "Slayer" },
      "human-breton-noble-nom": { "name": "Slayer" },
      "human-breton-lowborn-nom": { "name": "Slayer" },
      "human-cathayan-nom": { "name": "Slayer" },
      "human-estalian-nom": { "name": "Slayer" },
      "human-indan-nom": { "name": "Slayer" },
      "human-gospodar-nom": { "name": "Slayer" },
      "human-ungol-nom": { "name": "Slayer" },
      "human-nipponese-nom": { "name": "Slayer" },
      "human-norscan-nom": { "name": "Slayer" },
      "human-southlander-nom": { "name": "Slayer" },
      "human-strigany-nom": { "name": "Slayer" },
      "human-tilean-nom": { "name": "Slayer" },
      "human-westerlander-nom": { "name": "Slayer" }
    },
    {
      "range": {
        "human-albionite-nom": [1, 1],
        "human-arabyan-nom": [1, 1],
        "human-breton-noble-nom": [1, 1],
        "human-breton-lowborn-nom": [1, 1],
        "human-cathayan-nom": [1, 2],
        "human-estalian-nom": [],
        "human-indan-nom": [1, 1],
        "human-gospodar-nom": [1, 1],
        "human-ungol-nom": [1, 1],
        "human-nipponese-nom": [1, 1],
        "human-norscan-nom": [1, 2],
        "human-southlander-nom": [],
        "human-strigany-nom": [1, 1],
        "human-tilean-nom": [1, 2],
        "human-westerlander-nom": []
      },
      "human-albionite-nom": { "name": "Warrior Priest" },
      "human-arabyan-nom": { "name": "Warrior Priest" },
      "human-breton-noble-nom": { "name": "Warrior Priest" },
      "human-breton-lowborn-nom": { "name": "Warrior Priest" },
      "human-cathayan-nom": { "name": "Warrior Priest" },
      "human-estalian-nom": { "name": "Warrior Priest" },
      "human-indan-nom": { "name": "Warrior Priest" },
      "human-gospodar-nom": { "name": "Warrior Priest" },
      "human-ungol-nom": { "name": "Warrior Priest" },
      "human-nipponese-nom": { "name": "Warrior Priest" },
      "human-norscan-nom": { "name": "Warrior Priest" },
      "human-southlander-nom": { "name": "Warrior Priest" },
      "human-strigany-nom": { "name": "Warrior Priest" },
      "human-tilean-nom": { "name": "Warrior Priest" },
      "human-westerlander-nom": { "name": "Warrior Priest" }
    }
  ],
  "multi": [
    "human-albionite-nom",
    "human-arabyan-nom",
    "human-breton-noble-nom",
    "human-breton-lowborn-nom",
    "human-cathayan-nom",
    "human-estalian-nom",
    "human-indan-nom",
    "human-gospodar-nom",
    "human-ungol-nom",
    "human-nipponese-nom",
    "human-norscan-nom",
    "human-southlander-nom",
    "human-strigany-nom",
    "human-tilean-nom",
    "human-westerlander-nom"
  ]
}
