{
  "resourceType": "Organization",
  "id": "9ea46c9b-dbde-4da6-9e53-c51761e6ad02",
  "meta": {
    "versionId": "05e72ba2-8d4d-4115-8eb2-1eda1ffedd69",
    "lastUpdated": "2022-11-08T09:44:01.909+00:00",
    "profile": [
      "https://fhir.hl7.org.uk/StructureDefinition/UKCore-Organization"
    ]
  },
  "identifier": [
    {
      "system": "https://fhir.nhs.uk/Id/ods-organization-code",
      "value": "RGT68"
    }
  ],
  "name": "CAMBRIDGE BREAST UNIT",
  "address": [
    {
      "line": [
        "PHARMACY BOX 104",
        "ADDENBROOKES HOSPITAL",
        "HILLS ROAD"
      ],
      "city": "CAMBRIDGESHIRE",
      "postalCode": "CB2 0QQ"
    }
  ]
}
