{
  "resourceType": "MessageHeader",
  "id": "9588def0-3241-4af6-8d99-a41e29192345",
  "meta": {
    "versionId": "9ebb24ff-5772-4750-8c48-eb152050d0a9",
    "lastUpdated": "2022-11-22T16:03:48.916+00:00",
    "profile": [
      "https://fhir.hl7.org.uk/StructureDefinition/UKCore-MessageHeader"
    ]
  },
  "extension": [
    {
      "url": "https://fhir.nhs.uk/StructureDefinition/Extension-NHSEngland-MessageEventType",
      "valueCodeableConcept": {
        "coding": [
          {
            "system": "https://fhir.nhs.uk/CodeSystem/NHSEngland-MessageEventType",
            "code": "new",
            "display": "New Event Message"
          }
        ]
      }
    }
  ],
  "eventCoding": {
    "system": "https://fhir.nhs.uk/CodeSystem/NHSEngland-MessageEventType",
    "code": "new",
    "display": "New Event Message"
  },
  "destination": [
    {
      "name": "CAMBRIDGE BREAST UNIT",
      "endpoint": "RGT68",
      "receiver": {
        "reference": "urn:uuid:9ea46c9b-dbde-4da6-9e53-c51761e6ad02"
      }
    }
  ],
  "sender": {
    "reference": "urn:uuid:e3bbec3c-e287-42c5-a1eb-c7be8874ef1f"
  },
  "source": {
    "name": "ACCIDENT & EMERGENCY",
    "endpoint": "RGT1F"
  },
  "focus": [
    {
      "reference": "urn:uuid:6dda9172-9924-47f0-8d08-6dd4eaddcd83"
    }
  ]
}
