{
  "resourceType": "Bundle",
  "id": "b4765a8a-0f0a-4db4-be8e-5f2be61d6a14",
  "meta": {
    "versionId": "9ed60f1e-ccd6-4204-9072-4b599c081d5e",
    "lastUpdated": "2022-11-14T11:57:59.054+00:00",
    "profile": [
      "https://fhir.hl7.org.uk/StructureDefinition/UKCore-Bundle"
    ]
  },
  "identifier": {
    "system": "https://tools.ietf.org/html/rfc4122",
    "value": "f36927ef-7703-45ed-b0e5-6ec6723cf0f6"
  },
  "type": "message",
  "entry": [
    {
      "fullUrl": "556cd51d-8a2f-4e89-8c95-0f68e5d6cc09",
      "resource": {
        "resourceType": "MessageHeader",
        "id": "556cd51d-8a2f-4e89-8c95-0f68e5d6cc09",
        "meta": {
          "versionId": "cb46aa29-1f11-4f66-aebb-a89be643520a",
          "lastUpdated": "2022-11-04T14:36:17.259+00:00",
          "profile": [
            "https://fhir.hl7.org.uk/StructureDefinition/UKCore-MessageHeader"
          ]
        },
        "extension": [
          {
            "url": "https://fhir.nhs.uk/StructureDefinition/Extension-NHSEngland-MessageEventType",
            "valueCodeableConcept": {
              "coding": [
                {
                  "system": "https://fhir.nhs.uk/CodeSystem/NHSEngland-MessageEventType",
                  "code": "update",
                  "display": "Update event message"
                }
              ]
            }
          }
        ],
        "eventCoding": {
          "system": "http://snomed.info/sct",
          "code": "51201000000109",
          "display": "WGS - whole genome sequencing"
        },
        "destination": [
          {
            "name": "CAMBRIDGE UNIVERSITY HOSPITALS NHS FOUNDATION TRUST",
            "endpoint": "RGT",
            "receiver": {
              "reference": "urn:uuid:29c61b8b-666b-4402-9404-85b34221d97c"
            }
          }
        ],
        "sender": {
          "reference": "urn:uuid:f2bf638b-da00-4b62-999c-4abb8078b9e3"
        },
        "source": {
          "name": "CAMBRIDGESHIRE AND PETERBOROUGH NHS FOUNDATION TRUST",
          "endpoint": "10.10.10.10"
        },
        "focus": [
          {
            "reference": "urn:uuid:fcafff6b-726b-4937-ab7e-ca45c92e6304"
          }
        ]
      }
    },
    {
      "fullUrl": "fcafff6b-726b-4937-ab7e-ca45c92e6304",
      "resource": {
        "resourceType": "ServiceRequest",
        "id": "fcafff6b-726b-4937-ab7e-ca45c92e6304",
        "meta": {
          "versionId": "aa7e17ce-4a5e-4aa4-9df5-c5175cf8ae3a",
          "lastUpdated": "2022-11-14T11:57:58.881+00:00",
          "profile": [
            "https://fhir.hl7.org.uk/StructureDefinition/UKCore-ServiceRequest"
          ]
        },
        "identifier": [
          {
            "system": "https://tools.ietf.org/html/rfc4122",
            "value": "7e9bbd01-4e52-420d-b05b-48bc671d6708"
          }
        ],
        "status": "draft",
        "intent": "order",
        "code": {
          "coding": [
            {
              "system": "https://www.england.nhs.uk/publication/national-genomic-test-directories/",
              "code": "R122.1",
              "display": "Factor XIII deficiency"
            }
          ]
        },
        "subject": {
          "reference": "urn:uuid:4ecdd9d7-66ea-4d56-8c7d-c0f7864837e3",
          "display": "DAVIES, Michael"
        },
        "requester": {
          "reference": "urn:uuid:f7e520f4-8ccc-4767-a3e2-c342ff473f5c",
          "display": "KHAN"
        },
        "performer": [
          {
            "reference": "urn:uuid:f2bf638b-da00-4b62-999c-4abb8078b9e3",
            "display": "CAMBRIDGESHIRE AND PETERBOROUGH NHS FOUNDATION TRUST"
          }
        ]
      }
    },
    {
      "fullUrl": "4ecdd9d7-66ea-4d56-8c7d-c0f7864837e3",
      "resource": {
        "resourceType": "Patient",
        "id": "4ecdd9d7-66ea-4d56-8c7d-c0f7864837e3",
        "meta": {
          "versionId": "d53a605b-1031-4371-831c-3daed2cf83ca",
          "lastUpdated": "2022-10-28T16:14:32.285+00:00",
          "profile": [
            "https://fhir.hl7.org.uk/StructureDefinition/UKCore-Patient"
          ]
        },
        "identifier": [
          {
            "extension": [
              {
                "url": "https://fhir.hl7.org.uk/StructureDefinition/Extension-UKCore-NHSNumberVerificationStatus",
                "valueCodeableConcept": {
                  "coding": [
                    {
                      "system": "https://fhir.hl7.org.uk/CodeSystem/UKCore-NHSNumberVerificationStatus",
                      "code": "number-present-and-verified",
                      "display": "Number present and verified"
                    }
                  ]
                }
              }
            ],
            "system": "https://fhir.nhs.uk/Id/nhs-number",
            "value": "9432003812"
          }
        ],
        "name": [
          {
            "use": "official",
            "family": "Davies",
            "given": [
              "Michael"
            ]
          }
        ],
        "gender": "male",
        "birthDate": "1961-12-29"
      }
    },
    {
      "fullUrl": "f7e520f4-8ccc-4767-a3e2-c342ff473f5c",
      "resource": {
        "resourceType": "Practitioner",
        "id": "f7e520f4-8ccc-4767-a3e2-c342ff473f5c",
        "meta": {
          "versionId": "7017d1d6-bc7e-44b4-929c-ad71874094bf",
          "lastUpdated": "2022-10-31T11:41:28.438+00:00",
          "profile": [
            "https://fhir.hl7.org.uk/StructureDefinition/UKCore-Practitioner"
          ]
        },
        "identifier": [
          {
            "system": "https://fhir.nhs.uk/Id/sds-user-id",
            "value": "3415870223"
          }
        ],
        "name": [
          {
            "use": "official",
            "family": "Khan",
            "given": [
              "Ibrahim"
            ],
            "prefix": [
              "Dr"
            ],
            "suffix": [
              "MB ChB"
            ]
          }
        ]
      }
    },
    {
      "fullUrl": "29c61b8b-666b-4402-9404-85b34221d97c",
      "resource": {
        "resourceType": "Organization",
        "id": "29c61b8b-666b-4402-9404-85b34221d97c",
        "meta": {
          "versionId": "e91c5a7c-9620-4c76-9766-c1525ff84838",
          "lastUpdated": "2022-10-30T17:05:42.114+00:00",
          "profile": [
            "https://fhir.hl7.org.uk/StructureDefinition/UKCore-Organization"
          ]
        },
        "identifier": [
          {
            "system": "https://fhir.nhs.uk/Id/ods-organization-code",
            "value": "RGT"
          }
        ],
        "name": "Cambridge University Hospitals NHS Foundation Trust",
        "address": [
          {
            "line": [
              "CAMBRIDGE BIOMEDICAL CAMPUS",
              "N/A",
              "N/A"
            ],
            "city": "HILLS ROAD",
            "postalCode": "CB2 0QQ"
          }
        ]
      }
    },
    {
      "fullUrl": "f2bf638b-da00-4b62-999c-4abb8078b9e3",
      "resource": {
        "resourceType": "Organization",
        "id": "f2bf638b-da00-4b62-999c-4abb8078b9e3",
        "meta": {
          "versionId": "ab88d7d8-d5ec-42b7-964b-266e6859c808",
          "lastUpdated": "2022-10-29T22:45:22.954+00:00",
          "profile": [
            "https://fhir.hl7.org.uk/StructureDefinition/UKCore-Organization"
          ]
        },
        "identifier": [
          {
            "system": "https://fhir.nhs.uk/Id/ods-organization-code",
            "value": "RGD12"
          }
        ],
        "name": "CAMBRIDGESHIRE AND PETERBOROUGH NHS FOUNDATION TRUST",
        "address": [
          {
            "line": [
              "ELIZABETH HOUSE,",
              "FULBOURN HOSPITAL",
              "FULBOURN"
            ],
            "city": "CAMBRIDGE",
            "postalCode": "CB21 5EF"
          }
        ]
      }
    }
  ]
}
