{
  "resourceType": "Organization",
  "id": "29c61b8b-666b-4402-9404-85b34221d97c",
  "meta": {
    "versionId": "e91c5a7c-9620-4c76-9766-c1525ff84838",
    "lastUpdated": "2022-10-30T17:05:42.114+00:00",
    "profile": [
      "https://fhir.hl7.org.uk/StructureDefinition/UKCore-Organization"
    ]
  },
  "identifier": [
    {
      "system": "https://fhir.nhs.uk/Id/ods-organization-code",
      "value": "RGT"
    }
  ],
  "name": "Cambridge University Hospitals NHS Foundation Trust",
  "address": [
    {
      "line": [
        "CAMBRIDGE BIOMEDICAL CAMPUS",
        "N/A",
        "N/A"
      ],
      "city": "HILLS ROAD",
      "postalCode": "CB2 0QQ"
    }
  ]
}
