{
  "resourceType": "ServiceRequest",
  "id": "fcafff6b-726b-4937-ab7e-ca45c92e6304",
  "meta": {
    "versionId": "9d909cf0-e1aa-4411-bb03-874a19137aa0",
    "lastUpdated": "2022-11-24T08:50:16.553+00:00",
    "profile": [
      "https://fhir.hl7.org.uk/StructureDefinition/UKCore-ServiceRequest"
    ]
  },
  "identifier": [
    {
      "system": "https://tools.ietf.org/html/rfc4122",
      "value": "7e9bbd01-4e52-420d-b05b-48bc671d6708"
    }
  ],
  "status": "active",
  "intent": "order",
  "code": {
    "coding": [
      {
        "system": "https://www.england.nhs.uk/publication/national-genomic-test-directories/",
        "code": "R122.1",
        "display": "Factor XIII deficiency"
      }
    ]
  },
  "subject": {
    "reference": "urn:uuid:4ecdd9d7-66ea-4d56-8c7d-c0f7864837e3",
    "display": "DAVIES, Michael"
  },
  "requester": {
    "reference": "urn:uuid:f7e520f4-8ccc-4767-a3e2-c342ff473f5c",
    "display": "KHAN"
  },
  "performer": [
    {
      "reference": "urn:uuid:f2bf638b-da00-4b62-999c-4abb8078b9e3",
      "display": "CAMBRIDGESHIRE AND PETERBOROUGH NHS FOUNDATION TRUST"
    }
  ]
}
