{
  "resourceType": "Bundle",
  "id": "8378ce54-0a59-4f8c-9ae6-4cd8e3468ba0",
  "meta": {
    "versionId": "f91f7f72-523a-4d43-bc9f-a131404d78d2",
    "lastUpdated": "2022-11-18T16:03:54.879+00:00",
    "profile": [
      "https://fhir.hl7.org.uk/StructureDefinition/UKCore-Bundle"
    ]
  },
  "identifier": {
    "system": "https://tools.ietf.org/html/rfc4122",
    "value": "3f4d7312-8c68-41a3-abe6-5701c63204cd"
  },
  "type": "message",
  "entry": [
    {
      "fullUrl": "urn:uuid:23625195-daec-4a0c-b224-1a7e53612686",
      "resource": {
        "resourceType": "MessageHeader",
        "id": "23625195-daec-4a0c-b224-1a7e53612686",
        "meta": {
          "versionId": "e5217829-2113-4579-8e6b-bb7ed7cf0b1f",
          "lastUpdated": "2022-11-18T16:03:13.189+00:00",
          "profile": [
            "https://fhir.hl7.org.uk/StructureDefinition/UKCore-MessageHeader"
          ]
        },
        "extension": [
          {
            "url": "https://fhir.nhs.uk/StructureDefinition/Extension-NHSEngland-MessageEventType",
            "valueCodeableConcept": {
              "coding": [
                {
                  "system": "https://fhir.nhs.uk/CodeSystem/NHSEngland-MessageEventType",
                  "code": "new",
                  "display": "New Event Message"
                }
              ]
            }
          }
        ],
        "eventCoding": {
          "system": "https://fhir.nhs.uk/CodeSystem/NHSEngland-MessageEventType",
          "code": "new",
          "display": "New Event Message"
        },
        "destination": [
          {
            "name": "BOWEL CANCER SCREENING - ADDENBROOKE'S",
            "endpoint": "RGT63",
            "receiver": {
              "reference": "urn:uuid:bc54dec2-e1e6-4c83-abd9-449b055d38ca"
            }
          }
        ],
        "sender": {
          "reference": "urn:uuid:ceed87ef-3d61-4501-9119-1dd43e11ed96"
        },
        "source": {
          "name": "BLOCK 9 IDA DARWIN HOSPITAL",
          "endpoint": "RGT1F"
        },
        "focus": [
          {
            "reference": "urn:uuid:a703bac1-7ea4-4807-9b07-c9c20e17a562"
          }
        ]
      }
    },
    {
      "fullUrl": "urn:uuid:a703bac1-7ea4-4807-9b07-c9c20e17a562",
      "resource": {
        "resourceType": "ServiceRequest",
        "id": "a703bac1-7ea4-4807-9b07-c9c20e17a562",
        "meta": {
          "versionId": "bcd1db41-fb17-4057-997c-af1ce6c63a64",
          "lastUpdated": "2022-11-11T10:16:18.796+00:00",
          "profile": [
            "https://fhir.hl7.org.uk/StructureDefinition/UKCore-ServiceRequest"
          ]
        },
        "identifier": [
          {
            "system": "https://tools.ietf.org/html/rfc4122",
            "value": "7e9bbd01-4e52-420d-b05b-48bc671d6708"
          }
        ],
        "status": "draft",
        "intent": "order",
        "code": {
          "coding": [
            {
              "system": "https://www.england.nhs.uk/publication/national-genomic-test-directories/",
              "code": "M238",
              "display": "Small Bowel Cancer"
            }
          ]
        },
        "subject": {
          "reference": "urn:uuid:f4aa1962-b25b-4915-b6fe-bd928d9c9691",
          "display": "Jones John"
        },
        "requester": {
          "reference": "urn:uuid:a9c74e03-c7df-4942-9a9d-2ca63bd812a5",
          "display": "Eliza Evelyne"
        },
        "performer": [
          {
            "reference": "urn:uuid:bc54dec2-e1e6-4c83-abd9-449b055d38ca",
            "display": "BOWEL CANCER SCREENING - ADDENBROOKE'S"
          }
        ]
      }
    },
    {
      "fullUrl": "urn:uuid:f4aa1962-b25b-4915-b6fe-bd928d9c9691",
      "resource": {
        "resourceType": "Patient",
        "id": "f4aa1962-b25b-4915-b6fe-bd928d9c9691",
        "meta": {
          "versionId": "53041d4b-f1f0-4fce-a729-e8b7321bd492",
          "lastUpdated": "2022-11-10T13:59:09.184+00:00",
          "profile": [
            "https://fhir.hl7.org.uk/StructureDefinition/UKCore-Patient"
          ]
        },
        "identifier": [
          {
            "extension": [
              {
                "url": "https://fhir.hl7.org.uk/StructureDefinition/Extension-UKCore-NHSNumberVerificationStatus",
                "valueCodeableConcept": {
                  "coding": [
                    {
                      "system": "https://fhir.hl7.org.uk/CodeSystem/UKCore-NHSNumberVerificationStatus",
                      "code": "number-present-and-verified",
                      "display": "Number present and verified"
                    }
                  ]
                }
              }
            ],
            "system": "https://fhir.nhs.uk/Id/nhs-number",
            "value": "9807639360"
          }
        ],
        "name": [
          {
            "use": "official",
            "family": "Jones",
            "given": [
              "John"
            ]
          }
        ],
        "gender": "male",
        "birthDate": "1986-05-22"
      }
    },
    {
      "fullUrl": "urn:uuid:a9c74e03-c7df-4942-9a9d-2ca63bd812a5",
      "resource": {
        "resourceType": "Practitioner",
        "id": "a9c74e03-c7df-4942-9a9d-2ca63bd812a5",
        "meta": {
          "versionId": "22e9bd69-6ebd-433d-9fee-eb9dd228bfe4",
          "lastUpdated": "2022-11-08T09:31:15.345+00:00",
          "profile": [
            "https://fhir.hl7.org.uk/StructureDefinition/UKCore-Practitioner"
          ]
        },
        "identifier": [
          {
            "system": "https://fhir.nhs.uk/Id/sds-user-id",
            "value": "3415870223"
          }
        ],
        "name": [
          {
            "use": "official",
            "family": "Eliza",
            "given": [
              "Evelyne"
            ],
            "prefix": [
              "Dr."
            ],
            "suffix": [
              "MBBS"
            ]
          }
        ]
      }
    },
    {
      "fullUrl": "urn:uuid:bc54dec2-e1e6-4c83-abd9-449b055d38ca",
      "resource": {
        "resourceType": "Organization",
        "id": "bc54dec2-e1e6-4c83-abd9-449b055d38ca",
        "meta": {
          "versionId": "ebb9dbc3-e8a7-465b-bff0-87ad9da72f64",
          "lastUpdated": "2022-11-15T16:01:23.383+00:00",
          "profile": [
            "https://fhir.hl7.org.uk/StructureDefinition/UKCore-Organization"
          ]
        },
        "identifier": [
          {
            "system": "https://fhir.nhs.uk/Id/ods-organization-code",
            "value": "RGT63"
          }
        ],
        "name": "BOWEL CANCER SCREENING - ADDENBROOKE'S",
        "address": [
          {
            "line": [
              "ADDENBROOKES HOSPITAL",
              "HILLS ROAD",
              "CAMBRIDGE"
            ],
            "city": "CAMBRIDGESHIRE",
            "postalCode": "CB2 0QQ"
          }
        ]
      }
    },
    {
      "fullUrl": "urn:uuid:ceed87ef-3d61-4501-9119-1dd43e11ed96",
      "resource": {
        "resourceType": "Organization",
        "id": "ceed87ef-3d61-4501-9119-1dd43e11ed96",
        "meta": {
          "versionId": "56d84104-537c-45e6-9163-a66b9440b15e",
          "lastUpdated": "2022-11-08T09:41:44.597+00:00",
          "profile": [
            "https://fhir.hl7.org.uk/StructureDefinition/UKCore-Organization"
          ]
        },
        "identifier": [
          {
            "system": "https://fhir.nhs.uk/Id/ods-organization-code",
            "value": "RGT1F"
          }
        ],
        "name": "BLOCK 9 IDA DARWIN HOSPITAL",
        "address": [
          {
            "line": [
              "CAMBRIDGE ROAD",
              "FULBOURN",
              "CAMBRIDGE"
            ],
            "city": "CAMBRIDGESHIRE",
            "postalCode": "CB21 5EE"
          }
        ]
      }
    }
  ]
}
