{
  "resourceType": "Patient",
  "id": "4ecdd9d7-66ea-4d56-8c7d-c0f7864837e3",
  "meta": {
    "versionId": "d53a605b-1031-4371-831c-3daed2cf83ca",
    "lastUpdated": "2022-10-28T16:14:32.285+00:00",
    "profile": [
      "https://fhir.hl7.org.uk/StructureDefinition/UKCore-Patient"
    ]
  },
  "identifier": [
    {
      "extension": [
        {
          "url": "https://fhir.hl7.org.uk/StructureDefinition/Extension-UKCore-NHSNumberVerificationStatus",
          "valueCodeableConcept": {
            "coding": [
              {
                "system": "https://fhir.hl7.org.uk/CodeSystem/UKCore-NHSNumberVerificationStatus",
                "code": "number-present-and-verified",
                "display": "Number present and verified"
              }
            ]
          }
        }
      ],
      "system": "https://fhir.nhs.uk/Id/nhs-number",
      "value": "9432003812"
    }
  ],
  "name": [
    {
      "use": "official",
      "family": "Davies",
      "given": [
        "Michael"
      ]
    }
  ],
  "gender": "male",
  "birthDate": "1961-12-29"
}
