<?xml version="1.0" encoding="UTF-8" standalone="no"?>
<!-- Created with Inkscape (http://www.inkscape.org/) -->

<svg
   width="99.999992mm"
   height="100mm"
   viewBox="0 0 99.999992 100"
   version="1.1"
   id="svg4341"
   xmlns="http://www.w3.org/2000/svg"
   xmlns:svg="http://www.w3.org/2000/svg">
  <defs
     id="defs4338" />
  <g
     id="layer1"
     transform="translate(-67.297344,-71.890089)">
    <path
       id="rect4424"
       style="fill:#ffffff;fill-opacity:0.5;fill-rule:evenodd;stroke-width:0.436119;paint-order:markers stroke fill"
       d="m 157.92965,109.61384 -28.35604,-1e-5 -2e-5,-28.35657 -24.5525,-10e-7 0,28.356571 -28.356572,0 2e-6,24.55252 28.35657,-1e-5 0,28.35657 24.55251,0 -1e-5,-28.35655 28.35605,-1e-5 z" />
  </g>
</svg>
