<?xml version="1.0" encoding="UTF-8" standalone="no"?>
<!-- Created with Inkscape (http://www.inkscape.org/) -->

<svg
   width="120"
   height="120"
   viewBox="0 0 120 120"
   version="1.1"
   id="svg5"
   xmlns="http://www.w3.org/2000/svg"
   xmlns:svg="http://www.w3.org/2000/svg">
  <defs
     id="defs2" />
  <g
     id="layer1">
    <path
       id="rect962"
       style="fill:#796084;fill-opacity:1;fill-rule:evenodd;stroke:none;stroke-width:1.68061;paint-order:markers stroke fill"
       d="M 60,19.646484 29.441406,56.767578 h 15.09375 V 100.35352 H 75.464844 V 56.767578 h 15.09375 z" />
  </g>
</svg>
