(['/home/marcoslessa/Desktop/crawlex/crawlex.py'],
 ['/home/marcoslessa/Desktop/crawlex'],
 ['codecs'],
 ['/home/marcoslessa/.local/lib/python3.8/site-packages/_pyinstaller_hooks_contrib/hooks/stdhooks',
  '/home/marcoslessa/.local/lib/python3.8/site-packages/_pyinstaller_hooks_contrib/hooks/stdhooks/__pycache__',
  '/home/marcoslessa/.local/lib/python3.8/site-packages/_pyinstaller_hooks_contrib/hooks/rthooks',
  '/home/marcoslessa/.local/lib/python3.8/site-packages/_pyinstaller_hooks_contrib/hooks/rthooks/__pycache__',
  '/home/marcoslessa/.local/lib/python3.8/site-packages/_pyinstaller_hooks_contrib/hooks'],
 {},
 [],
 [],
 False,
 False,
 False,
 '3.8.10 (default, Mar 15 2022, 12:22:08) \n[GCC 9.4.0]',
 [('pyi_rth_subprocess',
   '/home/marcoslessa/.local/lib/python3.8/site-packages/PyInstaller/hooks/rthooks/pyi_rth_subprocess.py',
   'PYSOURCE'),
  ('pyi_rth_pyqt5',
   '/home/marcoslessa/.local/lib/python3.8/site-packages/PyInstaller/hooks/rthooks/pyi_rth_pyqt5.py',
   'PYSOURCE'),
  ('pyi_rth_pkgutil',
   '/home/marcoslessa/.local/lib/python3.8/site-packages/PyInstaller/hooks/rthooks/pyi_rth_pkgutil.py',
   'PYSOURCE'),
  ('pyi_rth_inspect',
   '/home/marcoslessa/.local/lib/python3.8/site-packages/PyInstaller/hooks/rthooks/pyi_rth_inspect.py',
   'PYSOURCE'),
  ('pyi_rth_multiprocessing',
   '/home/marcoslessa/.local/lib/python3.8/site-packages/PyInstaller/hooks/rthooks/pyi_rth_multiprocessing.py',
   'PYSOURCE'),
  ('crawlex', '/home/marcoslessa/Desktop/crawlex/crawlex.py', 'PYSOURCE')],
 [('multiprocessing.popen_spawn_posix',
   '/usr/lib/python3.8/multiprocessing/popen_spawn_posix.py',
   'PYMODULE'),
  ('multiprocessing.resource_tracker',
   '/usr/lib/python3.8/multiprocessing/resource_tracker.py',
   'PYMODULE'),
  ('threading', '/usr/lib/python3.8/threading.py', 'PYMODULE'),
  ('_threading_local', '/usr/lib/python3.8/_threading_local.py', 'PYMODULE'),
  ('contextlib', '/usr/lib/python3.8/contextlib.py', 'PYMODULE'),
  ('_strptime', '/usr/lib/python3.8/_strptime.py', 'PYMODULE'),
  ('datetime', '/usr/lib/python3.8/datetime.py', 'PYMODULE'),
  ('calendar', '/usr/lib/python3.8/calendar.py', 'PYMODULE'),
  ('argparse', '/usr/lib/python3.8/argparse.py', 'PYMODULE'),
  ('textwrap', '/usr/lib/python3.8/textwrap.py', 'PYMODULE'),
  ('shutil', '/usr/lib/python3.8/shutil.py', 'PYMODULE'),
  ('zipfile', '/usr/lib/python3.8/zipfile.py', 'PYMODULE'),
  ('py_compile', '/usr/lib/python3.8/py_compile.py', 'PYMODULE'),
  ('importlib.machinery',
   '/usr/lib/python3.8/importlib/machinery.py',
   'PYMODULE'),
  ('importlib', '/usr/lib/python3.8/importlib/__init__.py', 'PYMODULE'),
  ('importlib._bootstrap',
   '/usr/lib/python3.8/importlib/_bootstrap.py',
   'PYMODULE'),
  ('importlib._bootstrap_external',
   '/usr/lib/python3.8/importlib/_bootstrap_external.py',
   'PYMODULE'),
  ('importlib.metadata',
   '/usr/lib/python3.8/importlib/metadata.py',
   'PYMODULE'),
  ('importlib.abc', '/usr/lib/python3.8/importlib/abc.py', 'PYMODULE'),
  ('configparser', '/usr/lib/python3.8/configparser.py', 'PYMODULE'),
  ('pathlib', '/usr/lib/python3.8/pathlib.py', 'PYMODULE'),
  ('urllib.parse', '/usr/lib/python3.8/urllib/parse.py', 'PYMODULE'),
  ('urllib', '/usr/lib/python3.8/urllib/__init__.py', 'PYMODULE'),
  ('ntpath', '/usr/lib/python3.8/ntpath.py', 'PYMODULE'),
  ('string', '/usr/lib/python3.8/string.py', 'PYMODULE'),
  ('genericpath', '/usr/lib/python3.8/genericpath.py', 'PYMODULE'),
  ('email', '/usr/lib/python3.8/email/__init__.py', 'PYMODULE'),
  ('email.parser', '/usr/lib/python3.8/email/parser.py', 'PYMODULE'),
  ('email._policybase', '/usr/lib/python3.8/email/_policybase.py', 'PYMODULE'),
  ('email.utils', '/usr/lib/python3.8/email/utils.py', 'PYMODULE'),
  ('email._parseaddr', '/usr/lib/python3.8/email/_parseaddr.py', 'PYMODULE'),
  ('socket', '/usr/lib/python3.8/socket.py', 'PYMODULE'),
  ('selectors', '/usr/lib/python3.8/selectors.py', 'PYMODULE'),
  ('random', '/usr/lib/python3.8/random.py', 'PYMODULE'),
  ('hashlib', '/usr/lib/python3.8/hashlib.py', 'PYMODULE'),
  ('logging', '/usr/lib/python3.8/logging/__init__.py', 'PYMODULE'),
  ('pickle', '/usr/lib/python3.8/pickle.py', 'PYMODULE'),
  ('pprint', '/usr/lib/python3.8/pprint.py', 'PYMODULE'),
  ('_compat_pickle', '/usr/lib/python3.8/_compat_pickle.py', 'PYMODULE'),
  ('bisect', '/usr/lib/python3.8/bisect.py', 'PYMODULE'),
  ('email.feedparser', '/usr/lib/python3.8/email/feedparser.py', 'PYMODULE'),
  ('email.message', '/usr/lib/python3.8/email/message.py', 'PYMODULE'),
  ('email.policy', '/usr/lib/python3.8/email/policy.py', 'PYMODULE'),
  ('email.contentmanager',
   '/usr/lib/python3.8/email/contentmanager.py',
   'PYMODULE'),
  ('email.quoprimime', '/usr/lib/python3.8/email/quoprimime.py', 'PYMODULE'),
  ('email.headerregistry',
   '/usr/lib/python3.8/email/headerregistry.py',
   'PYMODULE'),
  ('email.iterators', '/usr/lib/python3.8/email/iterators.py', 'PYMODULE'),
  ('email.generator', '/usr/lib/python3.8/email/generator.py', 'PYMODULE'),
  ('email._encoded_words',
   '/usr/lib/python3.8/email/_encoded_words.py',
   'PYMODULE'),
  ('base64', '/usr/lib/python3.8/base64.py', 'PYMODULE'),
  ('getopt', '/usr/lib/python3.8/getopt.py', 'PYMODULE'),
  ('quopri', '/usr/lib/python3.8/quopri.py', 'PYMODULE'),
  ('uu', '/usr/lib/python3.8/uu.py', 'PYMODULE'),
  ('optparse', '/usr/lib/python3.8/optparse.py', 'PYMODULE'),
  ('email._header_value_parser',
   '/usr/lib/python3.8/email/_header_value_parser.py',
   'PYMODULE'),
  ('email.header', '/usr/lib/python3.8/email/header.py', 'PYMODULE'),
  ('email.base64mime', '/usr/lib/python3.8/email/base64mime.py', 'PYMODULE'),
  ('email.charset', '/usr/lib/python3.8/email/charset.py', 'PYMODULE'),
  ('email.encoders', '/usr/lib/python3.8/email/encoders.py', 'PYMODULE'),
  ('email.errors', '/usr/lib/python3.8/email/errors.py', 'PYMODULE'),
  ('csv', '/usr/lib/python3.8/csv.py', 'PYMODULE'),
  ('struct', '/usr/lib/python3.8/struct.py', 'PYMODULE'),
  ('posixpath', '/usr/lib/python3.8/posixpath.py', 'PYMODULE'),
  ('importlib.util', '/usr/lib/python3.8/importlib/util.py', 'PYMODULE'),
  ('tarfile', '/usr/lib/python3.8/tarfile.py', 'PYMODULE'),
  ('gzip', '/usr/lib/python3.8/gzip.py', 'PYMODULE'),
  ('_compression', '/usr/lib/python3.8/_compression.py', 'PYMODULE'),
  ('lzma', '/usr/lib/python3.8/lzma.py', 'PYMODULE'),
  ('bz2', '/usr/lib/python3.8/bz2.py', 'PYMODULE'),
  ('fnmatch', '/usr/lib/python3.8/fnmatch.py', 'PYMODULE'),
  ('stat', '/usr/lib/python3.8/stat.py', 'PYMODULE'),
  ('copy', '/usr/lib/python3.8/copy.py', 'PYMODULE'),
  ('gettext', '/usr/lib/python3.8/gettext.py', 'PYMODULE'),
  ('signal', '/usr/lib/python3.8/signal.py', 'PYMODULE'),
  ('multiprocessing.util',
   '/usr/lib/python3.8/multiprocessing/util.py',
   'PYMODULE'),
  ('multiprocessing.forkserver',
   '/usr/lib/python3.8/multiprocessing/forkserver.py',
   'PYMODULE'),
  ('multiprocessing.connection',
   '/usr/lib/python3.8/multiprocessing/connection.py',
   'PYMODULE'),
  ('multiprocessing.resource_sharer',
   '/usr/lib/python3.8/multiprocessing/resource_sharer.py',
   'PYMODULE'),
  ('xmlrpc.client', '/usr/lib/python3.8/xmlrpc/client.py', 'PYMODULE'),
  ('xmlrpc', '/usr/lib/python3.8/xmlrpc/__init__.py', 'PYMODULE'),
  ('xml.parsers.expat', '/usr/lib/python3.8/xml/parsers/expat.py', 'PYMODULE'),
  ('xml.parsers', '/usr/lib/python3.8/xml/parsers/__init__.py', 'PYMODULE'),
  ('xml', '/usr/lib/python3.8/xml/__init__.py', 'PYMODULE'),
  ('xml.sax.expatreader',
   '/usr/lib/python3.8/xml/sax/expatreader.py',
   'PYMODULE'),
  ('xml.sax.saxutils', '/usr/lib/python3.8/xml/sax/saxutils.py', 'PYMODULE'),
  ('urllib.request', '/usr/lib/python3.8/urllib/request.py', 'PYMODULE'),
  ('getpass', '/usr/lib/python3.8/getpass.py', 'PYMODULE'),
  ('nturl2path', '/usr/lib/python3.8/nturl2path.py', 'PYMODULE'),
  ('ftplib', '/usr/lib/python3.8/ftplib.py', 'PYMODULE'),
  ('netrc', '/usr/lib/python3.8/netrc.py', 'PYMODULE'),
  ('shlex', '/usr/lib/python3.8/shlex.py', 'PYMODULE'),
  ('mimetypes', '/usr/lib/python3.8/mimetypes.py', 'PYMODULE'),
  ('http.cookiejar', '/usr/lib/python3.8/http/cookiejar.py', 'PYMODULE'),
  ('http', '/usr/lib/python3.8/http/__init__.py', 'PYMODULE'),
  ('ssl', '/usr/lib/python3.8/ssl.py', 'PYMODULE'),
  ('urllib.response', '/usr/lib/python3.8/urllib/response.py', 'PYMODULE'),
  ('urllib.error', '/usr/lib/python3.8/urllib/error.py', 'PYMODULE'),
  ('xml.sax', '/usr/lib/python3.8/xml/sax/__init__.py', 'PYMODULE'),
  ('xml.sax.handler', '/usr/lib/python3.8/xml/sax/handler.py', 'PYMODULE'),
  ('xml.sax._exceptions',
   '/usr/lib/python3.8/xml/sax/_exceptions.py',
   'PYMODULE'),
  ('xml.sax.xmlreader', '/usr/lib/python3.8/xml/sax/xmlreader.py', 'PYMODULE'),
  ('http.client', '/usr/lib/python3.8/http/client.py', 'PYMODULE'),
  ('decimal', '/usr/lib/python3.8/decimal.py', 'PYMODULE'),
  ('_pydecimal', '/usr/lib/python3.8/_pydecimal.py', 'PYMODULE'),
  ('contextvars', '/usr/lib/python3.8/contextvars.py', 'PYMODULE'),
  ('numbers', '/usr/lib/python3.8/numbers.py', 'PYMODULE'),
  ('hmac', '/usr/lib/python3.8/hmac.py', 'PYMODULE'),
  ('tempfile', '/usr/lib/python3.8/tempfile.py', 'PYMODULE'),
  ('multiprocessing.process',
   '/usr/lib/python3.8/multiprocessing/process.py',
   'PYMODULE'),
  ('multiprocessing.context',
   '/usr/lib/python3.8/multiprocessing/context.py',
   'PYMODULE'),
  ('multiprocessing.popen_forkserver',
   '/usr/lib/python3.8/multiprocessing/popen_forkserver.py',
   'PYMODULE'),
  ('multiprocessing.sharedctypes',
   '/usr/lib/python3.8/multiprocessing/sharedctypes.py',
   'PYMODULE'),
  ('multiprocessing.heap',
   '/usr/lib/python3.8/multiprocessing/heap.py',
   'PYMODULE'),
  ('ctypes', '/usr/lib/python3.8/ctypes/__init__.py', 'PYMODULE'),
  ('ctypes._endian', '/usr/lib/python3.8/ctypes/_endian.py', 'PYMODULE'),
  ('multiprocessing.pool',
   '/usr/lib/python3.8/multiprocessing/pool.py',
   'PYMODULE'),
  ('multiprocessing.dummy',
   '/usr/lib/python3.8/multiprocessing/dummy/__init__.py',
   'PYMODULE'),
  ('multiprocessing.dummy.connection',
   '/usr/lib/python3.8/multiprocessing/dummy/connection.py',
   'PYMODULE'),
  ('queue', '/usr/lib/python3.8/queue.py', 'PYMODULE'),
  ('multiprocessing.queues',
   '/usr/lib/python3.8/multiprocessing/queues.py',
   'PYMODULE'),
  ('multiprocessing.synchronize',
   '/usr/lib/python3.8/multiprocessing/synchronize.py',
   'PYMODULE'),
  ('multiprocessing.managers',
   '/usr/lib/python3.8/multiprocessing/managers.py',
   'PYMODULE'),
  ('multiprocessing.shared_memory',
   '/usr/lib/python3.8/multiprocessing/shared_memory.py',
   'PYMODULE'),
  ('secrets', '/usr/lib/python3.8/secrets.py', 'PYMODULE'),
  ('multiprocessing.reduction',
   '/usr/lib/python3.8/multiprocessing/reduction.py',
   'PYMODULE'),
  ('multiprocessing.popen_fork',
   '/usr/lib/python3.8/multiprocessing/popen_fork.py',
   'PYMODULE'),
  ('multiprocessing.popen_spawn_win32',
   '/usr/lib/python3.8/multiprocessing/popen_spawn_win32.py',
   'PYMODULE'),
  ('subprocess', '/usr/lib/python3.8/subprocess.py', 'PYMODULE'),
  ('os', '/usr/lib/python3.8/os.py', 'PYMODULE'),
  ('multiprocessing.spawn',
   '/usr/lib/python3.8/multiprocessing/spawn.py',
   'PYMODULE'),
  ('runpy', '/usr/lib/python3.8/runpy.py', 'PYMODULE'),
  ('pkgutil', '/usr/lib/python3.8/pkgutil.py', 'PYMODULE'),
  ('zipimport', '/usr/lib/python3.8/zipimport.py', 'PYMODULE'),
  ('inspect', '/usr/lib/python3.8/inspect.py', 'PYMODULE'),
  ('ast', '/usr/lib/python3.8/ast.py', 'PYMODULE'),
  ('token', '/usr/lib/python3.8/token.py', 'PYMODULE'),
  ('dis', '/usr/lib/python3.8/dis.py', 'PYMODULE'),
  ('opcode', '/usr/lib/python3.8/opcode.py', 'PYMODULE'),
  ('multiprocessing',
   '/usr/lib/python3.8/multiprocessing/__init__.py',
   'PYMODULE'),
  ('tracemalloc', '/usr/lib/python3.8/tracemalloc.py', 'PYMODULE'),
  ('typing', '/usr/lib/python3.8/typing.py', 'PYMODULE'),
  ('stringprep', '/usr/lib/python3.8/stringprep.py', 'PYMODULE'),
  ('_py_abc', '/usr/lib/python3.8/_py_abc.py', 'PYMODULE'),
  ('ArticleDao', '/home/marcoslessa/Desktop/crawlex/ArticleDao.py', 'PYMODULE'),
  ('Article', '/home/marcoslessa/Desktop/crawlex/Article.py', 'PYMODULE'),
  ('sqlite3', '/usr/lib/python3.8/sqlite3/__init__.py', 'PYMODULE'),
  ('sqlite3.dump', '/usr/lib/python3.8/sqlite3/dump.py', 'PYMODULE'),
  ('sqlite3.dbapi2', '/usr/lib/python3.8/sqlite3/dbapi2.py', 'PYMODULE'),
  ('PyQt5',
   '/home/marcoslessa/.local/lib/python3.8/site-packages/PyQt5/__init__.py',
   'PYMODULE'),
  ('ui', '/home/marcoslessa/Desktop/crawlex/ui.py', 'PYMODULE'),
  ('TermController',
   '/home/marcoslessa/Desktop/crawlex/TermController.py',
   'PYMODULE'),
  ('SharedCrawler',
   '/home/marcoslessa/Desktop/crawlex/SharedCrawler.py',
   'PYMODULE'),
  ('EmailSender',
   '/home/marcoslessa/Desktop/crawlex/EmailSender.py',
   'PYMODULE'),
  ('smtplib', '/usr/lib/python3.8/smtplib.py', 'PYMODULE'),
  ('WebsiteExecutor',
   '/home/marcoslessa/Desktop/crawlex/WebsiteExecutor.py',
   'PYMODULE'),
  ('Extractor', '/home/marcoslessa/Desktop/crawlex/Extractor.py', 'PYMODULE'),
  ('DefaultDatePatternConverter',
   '/home/marcoslessa/Desktop/crawlex/DefaultDatePatternConverter.py',
   'PYMODULE'),
  ('requests',
   '/usr/lib/python3/dist-packages/requests/__init__.py',
   'PYMODULE'),
  ('requests.status_codes',
   '/usr/lib/python3/dist-packages/requests/status_codes.py',
   'PYMODULE'),
  ('requests.structures',
   '/usr/lib/python3/dist-packages/requests/structures.py',
   'PYMODULE'),
  ('requests.compat',
   '/usr/lib/python3/dist-packages/requests/compat.py',
   'PYMODULE'),
  ('http.cookies', '/usr/lib/python3.8/http/cookies.py', 'PYMODULE'),
  ('json', '/usr/lib/python3.8/json/__init__.py', 'PYMODULE'),
  ('json.encoder', '/usr/lib/python3.8/json/encoder.py', 'PYMODULE'),
  ('json.decoder', '/usr/lib/python3.8/json/decoder.py', 'PYMODULE'),
  ('json.scanner', '/usr/lib/python3.8/json/scanner.py', 'PYMODULE'),
  ('simplejson',
   '/usr/lib/python3/dist-packages/simplejson/__init__.py',
   'PYMODULE'),
  ('simplejson.scanner',
   '/usr/lib/python3/dist-packages/simplejson/scanner.py',
   'PYMODULE'),
  ('simplejson.ordered_dict',
   '/usr/lib/python3/dist-packages/simplejson/ordered_dict.py',
   'PYMODULE'),
  ('simplejson.encoder',
   '/usr/lib/python3/dist-packages/simplejson/encoder.py',
   'PYMODULE'),
  ('simplejson.compat',
   '/usr/lib/python3/dist-packages/simplejson/compat.py',
   'PYMODULE'),
  ('imp', '/usr/lib/python3.8/imp.py', 'PYMODULE'),
  ('simplejson.decoder',
   '/usr/lib/python3/dist-packages/simplejson/decoder.py',
   'PYMODULE'),
  ('simplejson.raw_json',
   '/usr/lib/python3/dist-packages/simplejson/raw_json.py',
   'PYMODULE'),
  ('simplejson.errors',
   '/usr/lib/python3/dist-packages/simplejson/errors.py',
   'PYMODULE'),
  ('__future__', '/usr/lib/python3.8/__future__.py', 'PYMODULE'),
  ('requests.api',
   '/usr/lib/python3/dist-packages/requests/api.py',
   'PYMODULE'),
  ('requests.sessions',
   '/usr/lib/python3/dist-packages/requests/sessions.py',
   'PYMODULE'),
  ('requests.adapters',
   '/usr/lib/python3/dist-packages/requests/adapters.py',
   'PYMODULE'),
  ('urllib3.contrib.socks',
   '/usr/lib/python3/dist-packages/urllib3/contrib/socks.py',
   'PYMODULE'),
  ('urllib3.util.url',
   '/usr/lib/python3/dist-packages/urllib3/util/url.py',
   'PYMODULE'),
  ('idna', '/usr/lib/python3/dist-packages/idna/__init__.py', 'PYMODULE'),
  ('idna.core', '/usr/lib/python3/dist-packages/idna/core.py', 'PYMODULE'),
  ('idna.uts46data',
   '/usr/lib/python3/dist-packages/idna/uts46data.py',
   'PYMODULE'),
  ('idna.intranges',
   '/usr/lib/python3/dist-packages/idna/intranges.py',
   'PYMODULE'),
  ('idna.idnadata',
   '/usr/lib/python3/dist-packages/idna/idnadata.py',
   'PYMODULE'),
  ('idna.package_data',
   '/usr/lib/python3/dist-packages/idna/package_data.py',
   'PYMODULE'),
  ('six', '/usr/lib/python3/dist-packages/six.py', 'PYMODULE'),
  ('urllib3.connectionpool',
   '/usr/lib/python3/dist-packages/urllib3/connectionpool.py',
   'PYMODULE'),
  ('urllib3.util.queue',
   '/usr/lib/python3/dist-packages/urllib3/util/queue.py',
   'PYMODULE'),
  ('urllib3.util.timeout',
   '/usr/lib/python3/dist-packages/urllib3/util/timeout.py',
   'PYMODULE'),
  ('urllib3.util.response',
   '/usr/lib/python3/dist-packages/urllib3/util/response.py',
   'PYMODULE'),
  ('urllib3.util.request',
   '/usr/lib/python3/dist-packages/urllib3/util/request.py',
   'PYMODULE'),
  ('urllib3.util.connection',
   '/usr/lib/python3/dist-packages/urllib3/util/connection.py',
   'PYMODULE'),
  ('urllib3.contrib._appengine_environ',
   '/usr/lib/python3/dist-packages/urllib3/contrib/_appengine_environ.py',
   'PYMODULE'),
  ('urllib3.util.wait',
   '/usr/lib/python3/dist-packages/urllib3/util/wait.py',
   'PYMODULE'),
  ('urllib3.request',
   '/usr/lib/python3/dist-packages/urllib3/request.py',
   'PYMODULE'),
  ('urllib3.filepost',
   '/usr/lib/python3/dist-packages/urllib3/filepost.py',
   'PYMODULE'),
  ('urllib3.fields',
   '/usr/lib/python3/dist-packages/urllib3/fields.py',
   'PYMODULE'),
  ('urllib3.packages.ssl_match_hostname',
   '/usr/lib/python3/dist-packages/urllib3/packages/ssl_match_hostname/__init__.py',
   'PYMODULE'),
  ('urllib3.packages',
   '/usr/lib/python3/dist-packages/urllib3/packages/__init__.py',
   'PYMODULE'),
  ('urllib3.packages.ssl_match_hostname._implementation',
   '/usr/lib/python3/dist-packages/urllib3/packages/ssl_match_hostname/_implementation.py',
   'PYMODULE'),
  ('ipaddress', '/usr/lib/python3.8/ipaddress.py', 'PYMODULE'),
  ('urllib3.connection',
   '/usr/lib/python3/dist-packages/urllib3/connection.py',
   'PYMODULE'),
  ('urllib3._collections',
   '/usr/lib/python3/dist-packages/urllib3/_collections.py',
   'PYMODULE'),
  ('urllib3.util.ssl_',
   '/usr/lib/python3/dist-packages/urllib3/util/ssl_.py',
   'PYMODULE'),
  ('urllib3.util.retry',
   '/usr/lib/python3/dist-packages/urllib3/util/retry.py',
   'PYMODULE'),
  ('urllib3.util',
   '/usr/lib/python3/dist-packages/urllib3/util/__init__.py',
   'PYMODULE'),
  ('urllib3.response',
   '/usr/lib/python3/dist-packages/urllib3/response.py',
   'PYMODULE'),
  ('urllib3.poolmanager',
   '/usr/lib/python3/dist-packages/urllib3/poolmanager.py',
   'PYMODULE'),
  ('requests._internal_utils',
   '/usr/lib/python3/dist-packages/requests/_internal_utils.py',
   'PYMODULE'),
  ('requests.hooks',
   '/usr/lib/python3/dist-packages/requests/hooks.py',
   'PYMODULE'),
  ('requests.cookies',
   '/usr/lib/python3/dist-packages/requests/cookies.py',
   'PYMODULE'),
  ('dummy_threading', '/usr/lib/python3.8/dummy_threading.py', 'PYMODULE'),
  ('_dummy_thread', '/usr/lib/python3.8/_dummy_thread.py', 'PYMODULE'),
  ('requests.auth',
   '/usr/lib/python3/dist-packages/requests/auth.py',
   'PYMODULE'),
  ('requests.models',
   '/usr/lib/python3/dist-packages/requests/models.py',
   'PYMODULE'),
  ('requests.packages',
   '/usr/lib/python3/dist-packages/requests/packages.py',
   'PYMODULE'),
  ('requests.utils',
   '/usr/lib/python3/dist-packages/requests/utils.py',
   'PYMODULE'),
  ('requests.certs',
   '/usr/lib/python3/dist-packages/requests/certs.py',
   'PYMODULE'),
  ('certifi', '/usr/lib/python3/dist-packages/certifi/__init__.py', 'PYMODULE'),
  ('certifi.core',
   '/usr/lib/python3/dist-packages/certifi/core.py',
   'PYMODULE'),
  ('requests.__version__',
   '/usr/lib/python3/dist-packages/requests/__version__.py',
   'PYMODULE'),
  ('urllib3.exceptions',
   '/usr/lib/python3/dist-packages/urllib3/exceptions.py',
   'PYMODULE'),
  ('cryptography',
   '/usr/lib/python3/dist-packages/cryptography/__init__.py',
   'PYMODULE'),
  ('cryptography.hazmat.bindings.openssl.binding',
   '/usr/lib/python3/dist-packages/cryptography/hazmat/bindings/openssl/binding.py',
   'PYMODULE'),
  ('cryptography.hazmat.bindings',
   '/usr/lib/python3/dist-packages/cryptography/hazmat/bindings/__init__.py',
   'PYMODULE'),
  ('cryptography.hazmat',
   '/usr/lib/python3/dist-packages/cryptography/hazmat/__init__.py',
   'PYMODULE'),
  ('cryptography.exceptions',
   '/usr/lib/python3/dist-packages/cryptography/exceptions.py',
   'PYMODULE'),
  ('cryptography.hazmat.bindings.openssl._conditional',
   '/usr/lib/python3/dist-packages/cryptography/hazmat/bindings/openssl/_conditional.py',
   'PYMODULE'),
  ('cryptography.hazmat.bindings.openssl',
   '/usr/lib/python3/dist-packages/cryptography/hazmat/bindings/openssl/__init__.py',
   'PYMODULE'),
  ('cryptography.hazmat.backends.openssl.x509',
   '/usr/lib/python3/dist-packages/cryptography/hazmat/backends/openssl/x509.py',
   'PYMODULE'),
  ('cryptography.hazmat.primitives.asymmetric.rsa',
   '/usr/lib/python3/dist-packages/cryptography/hazmat/primitives/asymmetric/rsa.py',
   'PYMODULE'),
  ('fractions', '/usr/lib/python3.8/fractions.py', 'PYMODULE'),
  ('cryptography.hazmat.primitives.asymmetric.ec',
   '/usr/lib/python3/dist-packages/cryptography/hazmat/primitives/asymmetric/ec.py',
   'PYMODULE'),
  ('cryptography.hazmat._oid',
   '/usr/lib/python3/dist-packages/cryptography/hazmat/_oid.py',
   'PYMODULE'),
  ('cryptography.x509.oid',
   '/usr/lib/python3/dist-packages/cryptography/x509/oid.py',
   'PYMODULE'),
  ('cryptography.hazmat.primitives.asymmetric.dsa',
   '/usr/lib/python3/dist-packages/cryptography/hazmat/primitives/asymmetric/dsa.py',
   'PYMODULE'),
  ('cryptography.hazmat.primitives.asymmetric',
   '/usr/lib/python3/dist-packages/cryptography/hazmat/primitives/asymmetric/__init__.py',
   'PYMODULE'),
  ('cryptography.hazmat.primitives.asymmetric.dh',
   '/usr/lib/python3/dist-packages/cryptography/hazmat/primitives/asymmetric/dh.py',
   'PYMODULE'),
  ('cryptography.hazmat.primitives.asymmetric.ed25519',
   '/usr/lib/python3/dist-packages/cryptography/hazmat/primitives/asymmetric/ed25519.py',
   'PYMODULE'),
  ('cryptography.hazmat.primitives.serialization',
   '/usr/lib/python3/dist-packages/cryptography/hazmat/primitives/serialization/__init__.py',
   'PYMODULE'),
  ('cryptography.hazmat.primitives.serialization.ssh',
   '/usr/lib/python3/dist-packages/cryptography/hazmat/primitives/serialization/ssh.py',
   'PYMODULE'),
  ('cryptography.hazmat.primitives.serialization.base',
   '/usr/lib/python3/dist-packages/cryptography/hazmat/primitives/serialization/base.py',
   'PYMODULE'),
  ('cryptography.hazmat.primitives.hashes',
   '/usr/lib/python3/dist-packages/cryptography/hazmat/primitives/hashes.py',
   'PYMODULE'),
  ('cryptography.hazmat.primitives',
   '/usr/lib/python3/dist-packages/cryptography/hazmat/primitives/__init__.py',
   'PYMODULE'),
  ('cryptography.hazmat.primitives.constant_time',
   '/usr/lib/python3/dist-packages/cryptography/hazmat/primitives/constant_time.py',
   'PYMODULE'),
  ('cryptography.hazmat.backends.openssl.x448',
   '/usr/lib/python3/dist-packages/cryptography/hazmat/backends/openssl/x448.py',
   'PYMODULE'),
  ('cryptography.hazmat.primitives.asymmetric.x448',
   '/usr/lib/python3/dist-packages/cryptography/hazmat/primitives/asymmetric/x448.py',
   'PYMODULE'),
  ('cryptography.hazmat.backends.openssl.x25519',
   '/usr/lib/python3/dist-packages/cryptography/hazmat/backends/openssl/x25519.py',
   'PYMODULE'),
  ('cryptography.hazmat.primitives.asymmetric.x25519',
   '/usr/lib/python3/dist-packages/cryptography/hazmat/primitives/asymmetric/x25519.py',
   'PYMODULE'),
  ('cryptography.hazmat.backends.openssl.utils',
   '/usr/lib/python3/dist-packages/cryptography/hazmat/backends/openssl/utils.py',
   'PYMODULE'),
  ('cryptography.hazmat.primitives.asymmetric.utils',
   '/usr/lib/python3/dist-packages/cryptography/hazmat/primitives/asymmetric/utils.py',
   'PYMODULE'),
  ('cryptography.hazmat._der',
   '/usr/lib/python3/dist-packages/cryptography/hazmat/_der.py',
   'PYMODULE'),
  ('cryptography.hazmat.backends.openssl.rsa',
   '/usr/lib/python3/dist-packages/cryptography/hazmat/backends/openssl/rsa.py',
   'PYMODULE'),
  ('cryptography.hazmat.primitives.asymmetric.padding',
   '/usr/lib/python3/dist-packages/cryptography/hazmat/primitives/asymmetric/padding.py',
   'PYMODULE'),
  ('cryptography.hazmat.backends.openssl.poly1305',
   '/usr/lib/python3/dist-packages/cryptography/hazmat/backends/openssl/poly1305.py',
   'PYMODULE'),
  ('cryptography.hazmat.backends.openssl.ocsp',
   '/usr/lib/python3/dist-packages/cryptography/hazmat/backends/openssl/ocsp.py',
   'PYMODULE'),
  ('cryptography.x509.ocsp',
   '/usr/lib/python3/dist-packages/cryptography/x509/ocsp.py',
   'PYMODULE'),
  ('cryptography.x509.base',
   '/usr/lib/python3/dist-packages/cryptography/x509/base.py',
   'PYMODULE'),
  ('cryptography.x509.name',
   '/usr/lib/python3/dist-packages/cryptography/x509/name.py',
   'PYMODULE'),
  ('cryptography.x509.extensions',
   '/usr/lib/python3/dist-packages/cryptography/x509/extensions.py',
   'PYMODULE'),
  ('cryptography.x509.general_name',
   '/usr/lib/python3/dist-packages/cryptography/x509/general_name.py',
   'PYMODULE'),
  ('cryptography.x509.certificate_transparency',
   '/usr/lib/python3/dist-packages/cryptography/x509/certificate_transparency.py',
   'PYMODULE'),
  ('cryptography.hazmat.primitives.asymmetric.ed448',
   '/usr/lib/python3/dist-packages/cryptography/hazmat/primitives/asymmetric/ed448.py',
   'PYMODULE'),
  ('cryptography.hazmat.backends.openssl.hmac',
   '/usr/lib/python3/dist-packages/cryptography/hazmat/backends/openssl/hmac.py',
   'PYMODULE'),
  ('cryptography.hazmat.backends.openssl.hashes',
   '/usr/lib/python3/dist-packages/cryptography/hazmat/backends/openssl/hashes.py',
   'PYMODULE'),
  ('cryptography.hazmat.backends.openssl.encode_asn1',
   '/usr/lib/python3/dist-packages/cryptography/hazmat/backends/openssl/encode_asn1.py',
   'PYMODULE'),
  ('cryptography.hazmat.backends.openssl.ed448',
   '/usr/lib/python3/dist-packages/cryptography/hazmat/backends/openssl/ed448.py',
   'PYMODULE'),
  ('cryptography.hazmat.backends.openssl.ed25519',
   '/usr/lib/python3/dist-packages/cryptography/hazmat/backends/openssl/ed25519.py',
   'PYMODULE'),
  ('cryptography.hazmat.backends.openssl.ec',
   '/usr/lib/python3/dist-packages/cryptography/hazmat/backends/openssl/ec.py',
   'PYMODULE'),
  ('cryptography.hazmat.backends.openssl.dsa',
   '/usr/lib/python3/dist-packages/cryptography/hazmat/backends/openssl/dsa.py',
   'PYMODULE'),
  ('cryptography.hazmat.backends.openssl.dh',
   '/usr/lib/python3/dist-packages/cryptography/hazmat/backends/openssl/dh.py',
   'PYMODULE'),
  ('cryptography.hazmat.backends.openssl.decode_asn1',
   '/usr/lib/python3/dist-packages/cryptography/hazmat/backends/openssl/decode_asn1.py',
   'PYMODULE'),
  ('cryptography.hazmat.backends.openssl.cmac',
   '/usr/lib/python3/dist-packages/cryptography/hazmat/backends/openssl/cmac.py',
   'PYMODULE'),
  ('cryptography.hazmat.primitives.ciphers.modes',
   '/usr/lib/python3/dist-packages/cryptography/hazmat/primitives/ciphers/modes.py',
   'PYMODULE'),
  ('cryptography.hazmat.primitives.ciphers',
   '/usr/lib/python3/dist-packages/cryptography/hazmat/primitives/ciphers/__init__.py',
   'PYMODULE'),
  ('cryptography.hazmat.primitives.ciphers.base',
   '/usr/lib/python3/dist-packages/cryptography/hazmat/primitives/ciphers/base.py',
   'PYMODULE'),
  ('cryptography.hazmat.backends.openssl.ciphers',
   '/usr/lib/python3/dist-packages/cryptography/hazmat/backends/openssl/ciphers.py',
   'PYMODULE'),
  ('cryptography.hazmat.backends.openssl.backend',
   '/usr/lib/python3/dist-packages/cryptography/hazmat/backends/openssl/backend.py',
   'PYMODULE'),
  ('cryptography.hazmat.primitives.kdf.scrypt',
   '/usr/lib/python3/dist-packages/cryptography/hazmat/primitives/kdf/scrypt.py',
   'PYMODULE'),
  ('cryptography.hazmat.primitives.kdf',
   '/usr/lib/python3/dist-packages/cryptography/hazmat/primitives/kdf/__init__.py',
   'PYMODULE'),
  ('cryptography.hazmat.primitives.ciphers.algorithms',
   '/usr/lib/python3/dist-packages/cryptography/hazmat/primitives/ciphers/algorithms.py',
   'PYMODULE'),
  ('cryptography.hazmat.backends.openssl.aead',
   '/usr/lib/python3/dist-packages/cryptography/hazmat/backends/openssl/aead.py',
   'PYMODULE'),
  ('cryptography.hazmat.primitives.ciphers.aead',
   '/usr/lib/python3/dist-packages/cryptography/hazmat/primitives/ciphers/aead.py',
   'PYMODULE'),
  ('cryptography.hazmat.backends.openssl',
   '/usr/lib/python3/dist-packages/cryptography/hazmat/backends/openssl/__init__.py',
   'PYMODULE'),
  ('cryptography.hazmat.backends.interfaces',
   '/usr/lib/python3/dist-packages/cryptography/hazmat/backends/interfaces.py',
   'PYMODULE'),
  ('cryptography.hazmat.backends',
   '/usr/lib/python3/dist-packages/cryptography/hazmat/backends/__init__.py',
   'PYMODULE'),
  ('cryptography.x509',
   '/usr/lib/python3/dist-packages/cryptography/x509/__init__.py',
   'PYMODULE'),
  ('cryptography.utils',
   '/usr/lib/python3/dist-packages/cryptography/utils.py',
   'PYMODULE'),
  ('cryptography.__about__',
   '/usr/lib/python3/dist-packages/cryptography/__about__.py',
   'PYMODULE'),
  ('urllib3.contrib.pyopenssl',
   '/usr/lib/python3/dist-packages/urllib3/contrib/pyopenssl.py',
   'PYMODULE'),
  ('OpenSSL.crypto',
   '/home/marcoslessa/.local/lib/python3.8/site-packages/OpenSSL/crypto.py',
   'PYMODULE'),
  ('OpenSSL',
   '/home/marcoslessa/.local/lib/python3.8/site-packages/OpenSSL/__init__.py',
   'PYMODULE'),
  ('OpenSSL.version',
   '/home/marcoslessa/.local/lib/python3.8/site-packages/OpenSSL/version.py',
   'PYMODULE'),
  ('OpenSSL._util',
   '/home/marcoslessa/.local/lib/python3.8/site-packages/OpenSSL/_util.py',
   'PYMODULE'),
  ('urllib3.packages.backports.makefile',
   '/usr/lib/python3/dist-packages/urllib3/packages/backports/makefile.py',
   'PYMODULE'),
  ('urllib3.packages.backports',
   '/usr/lib/python3/dist-packages/urllib3/packages/backports/__init__.py',
   'PYMODULE'),
  ('OpenSSL.SSL',
   '/home/marcoslessa/.local/lib/python3.8/site-packages/OpenSSL/SSL.py',
   'PYMODULE'),
  ('urllib3.contrib',
   '/usr/lib/python3/dist-packages/urllib3/contrib/__init__.py',
   'PYMODULE'),
  ('requests.exceptions',
   '/usr/lib/python3/dist-packages/requests/exceptions.py',
   'PYMODULE'),
  ('chardet', '/usr/lib/python3/dist-packages/chardet/__init__.py', 'PYMODULE'),
  ('chardet.version',
   '/usr/lib/python3/dist-packages/chardet/version.py',
   'PYMODULE'),
  ('chardet.universaldetector',
   '/usr/lib/python3/dist-packages/chardet/universaldetector.py',
   'PYMODULE'),
  ('chardet.sbcsgroupprober',
   '/usr/lib/python3/dist-packages/chardet/sbcsgroupprober.py',
   'PYMODULE'),
  ('chardet.langturkishmodel',
   '/usr/lib/python3/dist-packages/chardet/langturkishmodel.py',
   'PYMODULE'),
  ('chardet.hebrewprober',
   '/usr/lib/python3/dist-packages/chardet/hebrewprober.py',
   'PYMODULE'),
  ('chardet.charsetprober',
   '/usr/lib/python3/dist-packages/chardet/charsetprober.py',
   'PYMODULE'),
  ('chardet.langhebrewmodel',
   '/usr/lib/python3/dist-packages/chardet/langhebrewmodel.py',
   'PYMODULE'),
  ('chardet.langthaimodel',
   '/usr/lib/python3/dist-packages/chardet/langthaimodel.py',
   'PYMODULE'),
  ('chardet.langbulgarianmodel',
   '/usr/lib/python3/dist-packages/chardet/langbulgarianmodel.py',
   'PYMODULE'),
  ('chardet.langgreekmodel',
   '/usr/lib/python3/dist-packages/chardet/langgreekmodel.py',
   'PYMODULE'),
  ('chardet.langcyrillicmodel',
   '/usr/lib/python3/dist-packages/chardet/langcyrillicmodel.py',
   'PYMODULE'),
  ('chardet.sbcharsetprober',
   '/usr/lib/python3/dist-packages/chardet/sbcharsetprober.py',
   'PYMODULE'),
  ('chardet.mbcsgroupprober',
   '/usr/lib/python3/dist-packages/chardet/mbcsgroupprober.py',
   'PYMODULE'),
  ('chardet.euctwprober',
   '/usr/lib/python3/dist-packages/chardet/euctwprober.py',
   'PYMODULE'),
  ('chardet.mbcssm',
   '/usr/lib/python3/dist-packages/chardet/mbcssm.py',
   'PYMODULE'),
  ('chardet.chardistribution',
   '/usr/lib/python3/dist-packages/chardet/chardistribution.py',
   'PYMODULE'),
  ('chardet.jisfreq',
   '/usr/lib/python3/dist-packages/chardet/jisfreq.py',
   'PYMODULE'),
  ('chardet.big5freq',
   '/usr/lib/python3/dist-packages/chardet/big5freq.py',
   'PYMODULE'),
  ('chardet.gb2312freq',
   '/usr/lib/python3/dist-packages/chardet/gb2312freq.py',
   'PYMODULE'),
  ('chardet.euckrfreq',
   '/usr/lib/python3/dist-packages/chardet/euckrfreq.py',
   'PYMODULE'),
  ('chardet.euctwfreq',
   '/usr/lib/python3/dist-packages/chardet/euctwfreq.py',
   'PYMODULE'),
  ('chardet.codingstatemachine',
   '/usr/lib/python3/dist-packages/chardet/codingstatemachine.py',
   'PYMODULE'),
  ('chardet.mbcharsetprober',
   '/usr/lib/python3/dist-packages/chardet/mbcharsetprober.py',
   'PYMODULE'),
  ('chardet.big5prober',
   '/usr/lib/python3/dist-packages/chardet/big5prober.py',
   'PYMODULE'),
  ('chardet.cp949prober',
   '/usr/lib/python3/dist-packages/chardet/cp949prober.py',
   'PYMODULE'),
  ('chardet.euckrprober',
   '/usr/lib/python3/dist-packages/chardet/euckrprober.py',
   'PYMODULE'),
  ('chardet.gb2312prober',
   '/usr/lib/python3/dist-packages/chardet/gb2312prober.py',
   'PYMODULE'),
  ('chardet.eucjpprober',
   '/usr/lib/python3/dist-packages/chardet/eucjpprober.py',
   'PYMODULE'),
  ('chardet.jpcntx',
   '/usr/lib/python3/dist-packages/chardet/jpcntx.py',
   'PYMODULE'),
  ('chardet.sjisprober',
   '/usr/lib/python3/dist-packages/chardet/sjisprober.py',
   'PYMODULE'),
  ('chardet.utf8prober',
   '/usr/lib/python3/dist-packages/chardet/utf8prober.py',
   'PYMODULE'),
  ('chardet.latin1prober',
   '/usr/lib/python3/dist-packages/chardet/latin1prober.py',
   'PYMODULE'),
  ('chardet.escprober',
   '/usr/lib/python3/dist-packages/chardet/escprober.py',
   'PYMODULE'),
  ('chardet.escsm',
   '/usr/lib/python3/dist-packages/chardet/escsm.py',
   'PYMODULE'),
  ('chardet.enums',
   '/usr/lib/python3/dist-packages/chardet/enums.py',
   'PYMODULE'),
  ('chardet.charsetgroupprober',
   '/usr/lib/python3/dist-packages/chardet/charsetgroupprober.py',
   'PYMODULE'),
  ('chardet.compat',
   '/usr/lib/python3/dist-packages/chardet/compat.py',
   'PYMODULE'),
  ('urllib3', '/usr/lib/python3/dist-packages/urllib3/__init__.py', 'PYMODULE'),
  ('bs4', '/usr/lib/python3/dist-packages/bs4/__init__.py', 'PYMODULE'),
  ('bs4.element', '/usr/lib/python3/dist-packages/bs4/element.py', 'PYMODULE'),
  ('bs4.formatter',
   '/usr/lib/python3/dist-packages/bs4/formatter.py',
   'PYMODULE'),
  ('soupsieve',
   '/usr/lib/python3/dist-packages/soupsieve/__init__.py',
   'PYMODULE'),
  ('soupsieve.css_parser',
   '/usr/lib/python3/dist-packages/soupsieve/css_parser.py',
   'PYMODULE'),
  ('soupsieve.css_match',
   '/usr/lib/python3/dist-packages/soupsieve/css_match.py',
   'PYMODULE'),
  ('soupsieve.css_types',
   '/usr/lib/python3/dist-packages/soupsieve/css_types.py',
   'PYMODULE'),
  ('soupsieve.util',
   '/usr/lib/python3/dist-packages/soupsieve/util.py',
   'PYMODULE'),
  ('soupsieve.__meta__',
   '/usr/lib/python3/dist-packages/soupsieve/__meta__.py',
   'PYMODULE'),
  ('bs4.dammit', '/usr/lib/python3/dist-packages/bs4/dammit.py', 'PYMODULE'),
  ('html.entities', '/usr/lib/python3.8/html/entities.py', 'PYMODULE'),
  ('html', '/usr/lib/python3.8/html/__init__.py', 'PYMODULE'),
  ('bs4.builder',
   '/usr/lib/python3/dist-packages/bs4/builder/__init__.py',
   'PYMODULE'),
  ('bs4.builder._lxml',
   '/usr/lib/python3/dist-packages/bs4/builder/_lxml.py',
   'PYMODULE'),
  ('lxml',
   '/home/marcoslessa/.local/lib/python3.8/site-packages/lxml/__init__.py',
   'PYMODULE'),
  ('lxml.usedoctest',
   '/home/marcoslessa/.local/lib/python3.8/site-packages/lxml/usedoctest.py',
   'PYMODULE'),
  ('lxml.pyclasslookup',
   '/home/marcoslessa/.local/lib/python3.8/site-packages/lxml/pyclasslookup.py',
   'PYMODULE'),
  ('lxml.isoschematron',
   '/home/marcoslessa/.local/lib/python3.8/site-packages/lxml/isoschematron/__init__.py',
   'PYMODULE'),
  ('lxml.includes.libxslt',
   '/home/marcoslessa/.local/lib/python3.8/site-packages/lxml/includes/libxslt/__init__.py',
   'PYMODULE'),
  ('lxml.includes.libxml',
   '/home/marcoslessa/.local/lib/python3.8/site-packages/lxml/includes/libxml/__init__.py',
   'PYMODULE'),
  ('lxml.includes.libexslt',
   '/home/marcoslessa/.local/lib/python3.8/site-packages/lxml/includes/libexslt/__init__.py',
   'PYMODULE'),
  ('lxml.includes.extlibs',
   '/home/marcoslessa/.local/lib/python3.8/site-packages/lxml/includes/extlibs/__init__.py',
   'PYMODULE'),
  ('lxml.includes',
   '/home/marcoslessa/.local/lib/python3.8/site-packages/lxml/includes/__init__.py',
   'PYMODULE'),
  ('lxml.html.usedoctest',
   '/home/marcoslessa/.local/lib/python3.8/site-packages/lxml/html/usedoctest.py',
   'PYMODULE'),
  ('lxml.html.soupparser',
   '/home/marcoslessa/.local/lib/python3.8/site-packages/lxml/html/soupparser.py',
   'PYMODULE'),
  ('lxml.html.html5parser',
   '/home/marcoslessa/.local/lib/python3.8/site-packages/lxml/html/html5parser.py',
   'PYMODULE'),
  ('html5lib.treebuilders.etree_lxml',
   '/home/marcoslessa/.local/lib/python3.8/site-packages/html5lib/treebuilders/etree_lxml.py',
   'PYMODULE'),
  ('html5lib._ihatexml',
   '/home/marcoslessa/.local/lib/python3.8/site-packages/html5lib/_ihatexml.py',
   'PYMODULE'),
  ('html5lib.treebuilders.etree',
   '/home/marcoslessa/.local/lib/python3.8/site-packages/html5lib/treebuilders/etree.py',
   'PYMODULE'),
  ('html5lib._utils',
   '/home/marcoslessa/.local/lib/python3.8/site-packages/html5lib/_utils.py',
   'PYMODULE'),
  ('xml.etree.cElementTree',
   '/usr/lib/python3.8/xml/etree/cElementTree.py',
   'PYMODULE'),
  ('xml.etree', '/usr/lib/python3.8/xml/etree/__init__.py', 'PYMODULE'),
  ('xml.etree.ElementPath',
   '/usr/lib/python3.8/xml/etree/ElementPath.py',
   'PYMODULE'),
  ('xml.etree.ElementTree',
   '/usr/lib/python3.8/xml/etree/ElementTree.py',
   'PYMODULE'),
  ('xml.etree.ElementInclude',
   '/usr/lib/python3.8/xml/etree/ElementInclude.py',
   'PYMODULE'),
  ('html5lib.constants',
   '/home/marcoslessa/.local/lib/python3.8/site-packages/html5lib/constants.py',
   'PYMODULE'),
  ('html5lib.treebuilders.base',
   '/home/marcoslessa/.local/lib/python3.8/site-packages/html5lib/treebuilders/base.py',
   'PYMODULE'),
  ('html5lib.treebuilders',
   '/home/marcoslessa/.local/lib/python3.8/site-packages/html5lib/treebuilders/__init__.py',
   'PYMODULE'),
  ('xml.dom.minidom', '/usr/lib/python3.8/xml/dom/minidom.py', 'PYMODULE'),
  ('xml.dom.pulldom', '/usr/lib/python3.8/xml/dom/pulldom.py', 'PYMODULE'),
  ('xml.dom.expatbuilder',
   '/usr/lib/python3.8/xml/dom/expatbuilder.py',
   'PYMODULE'),
  ('xml.dom.NodeFilter',
   '/usr/lib/python3.8/xml/dom/NodeFilter.py',
   'PYMODULE'),
  ('xml.dom.xmlbuilder',
   '/usr/lib/python3.8/xml/dom/xmlbuilder.py',
   'PYMODULE'),
  ('xml.dom.minicompat',
   '/usr/lib/python3.8/xml/dom/minicompat.py',
   'PYMODULE'),
  ('xml.dom.domreg', '/usr/lib/python3.8/xml/dom/domreg.py', 'PYMODULE'),
  ('xml.dom', '/usr/lib/python3.8/xml/dom/__init__.py', 'PYMODULE'),
  ('html5lib.treebuilders.dom',
   '/home/marcoslessa/.local/lib/python3.8/site-packages/html5lib/treebuilders/dom.py',
   'PYMODULE'),
  ('html5lib',
   '/home/marcoslessa/.local/lib/python3.8/site-packages/html5lib/__init__.py',
   'PYMODULE'),
  ('html5lib.serializer',
   '/home/marcoslessa/.local/lib/python3.8/site-packages/html5lib/serializer.py',
   'PYMODULE'),
  ('html5lib.filters.optionaltags',
   '/home/marcoslessa/.local/lib/python3.8/site-packages/html5lib/filters/optionaltags.py',
   'PYMODULE'),
  ('html5lib.filters.base',
   '/home/marcoslessa/.local/lib/python3.8/site-packages/html5lib/filters/base.py',
   'PYMODULE'),
  ('html5lib.filters',
   '/home/marcoslessa/.local/lib/python3.8/site-packages/html5lib/filters/__init__.py',
   'PYMODULE'),
  ('html5lib.filters.sanitizer',
   '/home/marcoslessa/.local/lib/python3.8/site-packages/html5lib/filters/sanitizer.py',
   'PYMODULE'),
  ('html5lib.filters.whitespace',
   '/home/marcoslessa/.local/lib/python3.8/site-packages/html5lib/filters/whitespace.py',
   'PYMODULE'),
  ('html5lib.filters.alphabeticalattributes',
   '/home/marcoslessa/.local/lib/python3.8/site-packages/html5lib/filters/alphabeticalattributes.py',
   'PYMODULE'),
  ('html5lib.filters.inject_meta_charset',
   '/home/marcoslessa/.local/lib/python3.8/site-packages/html5lib/filters/inject_meta_charset.py',
   'PYMODULE'),
  ('html5lib.treewalkers',
   '/home/marcoslessa/.local/lib/python3.8/site-packages/html5lib/treewalkers/__init__.py',
   'PYMODULE'),
  ('html5lib.treewalkers.etree',
   '/home/marcoslessa/.local/lib/python3.8/site-packages/html5lib/treewalkers/etree.py',
   'PYMODULE'),
  ('html5lib.treewalkers.etree_lxml',
   '/home/marcoslessa/.local/lib/python3.8/site-packages/html5lib/treewalkers/etree_lxml.py',
   'PYMODULE'),
  ('html5lib.treewalkers.genshi',
   '/home/marcoslessa/.local/lib/python3.8/site-packages/html5lib/treewalkers/genshi.py',
   'PYMODULE'),
  ('html5lib.treewalkers.dom',
   '/home/marcoslessa/.local/lib/python3.8/site-packages/html5lib/treewalkers/dom.py',
   'PYMODULE'),
  ('html5lib.treewalkers.base',
   '/home/marcoslessa/.local/lib/python3.8/site-packages/html5lib/treewalkers/base.py',
   'PYMODULE'),
  ('html5lib.html5parser',
   '/home/marcoslessa/.local/lib/python3.8/site-packages/html5lib/html5parser.py',
   'PYMODULE'),
  ('html5lib._tokenizer',
   '/home/marcoslessa/.local/lib/python3.8/site-packages/html5lib/_tokenizer.py',
   'PYMODULE'),
  ('html5lib._trie',
   '/home/marcoslessa/.local/lib/python3.8/site-packages/html5lib/_trie/__init__.py',
   'PYMODULE'),
  ('html5lib._trie.py',
   '/home/marcoslessa/.local/lib/python3.8/site-packages/html5lib/_trie/py.py',
   'PYMODULE'),
  ('html5lib._trie._base',
   '/home/marcoslessa/.local/lib/python3.8/site-packages/html5lib/_trie/_base.py',
   'PYMODULE'),
  ('html5lib._inputstream',
   '/home/marcoslessa/.local/lib/python3.8/site-packages/html5lib/_inputstream.py',
   'PYMODULE'),
  ('webencodings',
   '/usr/lib/python3/dist-packages/webencodings/__init__.py',
   'PYMODULE'),
  ('webencodings.x_user_defined',
   '/usr/lib/python3/dist-packages/webencodings/x_user_defined.py',
   'PYMODULE'),
  ('webencodings.labels',
   '/usr/lib/python3/dist-packages/webencodings/labels.py',
   'PYMODULE'),
  ('lxml.html.formfill',
   '/home/marcoslessa/.local/lib/python3.8/site-packages/lxml/html/formfill.py',
   'PYMODULE'),
  ('lxml.html.defs',
   '/home/marcoslessa/.local/lib/python3.8/site-packages/lxml/html/defs.py',
   'PYMODULE'),
  ('lxml.html.builder',
   '/home/marcoslessa/.local/lib/python3.8/site-packages/lxml/html/builder.py',
   'PYMODULE'),
  ('lxml.html._setmixin',
   '/home/marcoslessa/.local/lib/python3.8/site-packages/lxml/html/_setmixin.py',
   'PYMODULE'),
  ('lxml.html._html5builder',
   '/home/marcoslessa/.local/lib/python3.8/site-packages/lxml/html/_html5builder.py',
   'PYMODULE'),
  ('lxml.html._diffcommand',
   '/home/marcoslessa/.local/lib/python3.8/site-packages/lxml/html/_diffcommand.py',
   'PYMODULE'),
  ('lxml.html.ElementSoup',
   '/home/marcoslessa/.local/lib/python3.8/site-packages/lxml/html/ElementSoup.py',
   'PYMODULE'),
  ('lxml.html',
   '/home/marcoslessa/.local/lib/python3.8/site-packages/lxml/html/__init__.py',
   'PYMODULE'),
  ('webbrowser', '/usr/lib/python3.8/webbrowser.py', 'PYMODULE'),
  ('glob', '/usr/lib/python3.8/glob.py', 'PYMODULE'),
  ('lxml.doctestcompare',
   '/home/marcoslessa/.local/lib/python3.8/site-packages/lxml/doctestcompare.py',
   'PYMODULE'),
  ('cgi', '/usr/lib/python3.8/cgi.py', 'PYMODULE'),
  ('doctest', '/usr/lib/python3.8/doctest.py', 'PYMODULE'),
  ('unittest', '/usr/lib/python3.8/unittest/__init__.py', 'PYMODULE'),
  ('unittest.signals', '/usr/lib/python3.8/unittest/signals.py', 'PYMODULE'),
  ('unittest.main', '/usr/lib/python3.8/unittest/main.py', 'PYMODULE'),
  ('unittest.runner', '/usr/lib/python3.8/unittest/runner.py', 'PYMODULE'),
  ('unittest.loader', '/usr/lib/python3.8/unittest/loader.py', 'PYMODULE'),
  ('unittest.suite', '/usr/lib/python3.8/unittest/suite.py', 'PYMODULE'),
  ('unittest.case', '/usr/lib/python3.8/unittest/case.py', 'PYMODULE'),
  ('unittest.async_case',
   '/usr/lib/python3.8/unittest/async_case.py',
   'PYMODULE'),
  ('asyncio', '/usr/lib/python3.8/asyncio/__init__.py', 'PYMODULE'),
  ('asyncio.unix_events',
   '/usr/lib/python3.8/asyncio/unix_events.py',
   'PYMODULE'),
  ('asyncio.log', '/usr/lib/python3.8/asyncio/log.py', 'PYMODULE'),
  ('asyncio.windows_events',
   '/usr/lib/python3.8/asyncio/windows_events.py',
   'PYMODULE'),
  ('asyncio.windows_utils',
   '/usr/lib/python3.8/asyncio/windows_utils.py',
   'PYMODULE'),
  ('asyncio.selector_events',
   '/usr/lib/python3.8/asyncio/selector_events.py',
   'PYMODULE'),
  ('asyncio.proactor_events',
   '/usr/lib/python3.8/asyncio/proactor_events.py',
   'PYMODULE'),
  ('asyncio.base_subprocess',
   '/usr/lib/python3.8/asyncio/base_subprocess.py',
   'PYMODULE'),
  ('asyncio.subprocess',
   '/usr/lib/python3.8/asyncio/subprocess.py',
   'PYMODULE'),
  ('asyncio.streams', '/usr/lib/python3.8/asyncio/streams.py', 'PYMODULE'),
  ('asyncio.queues', '/usr/lib/python3.8/asyncio/queues.py', 'PYMODULE'),
  ('asyncio.runners', '/usr/lib/python3.8/asyncio/runners.py', 'PYMODULE'),
  ('asyncio.events', '/usr/lib/python3.8/asyncio/events.py', 'PYMODULE'),
  ('asyncio.trsock', '/usr/lib/python3.8/asyncio/trsock.py', 'PYMODULE'),
  ('asyncio.staggered', '/usr/lib/python3.8/asyncio/staggered.py', 'PYMODULE'),
  ('asyncio.tasks', '/usr/lib/python3.8/asyncio/tasks.py', 'PYMODULE'),
  ('concurrent.futures',
   '/usr/lib/python3.8/concurrent/futures/__init__.py',
   'PYMODULE'),
  ('concurrent.futures.thread',
   '/usr/lib/python3.8/concurrent/futures/thread.py',
   'PYMODULE'),
  ('concurrent.futures.process',
   '/usr/lib/python3.8/concurrent/futures/process.py',
   'PYMODULE'),
  ('concurrent.futures._base',
   '/usr/lib/python3.8/concurrent/futures/_base.py',
   'PYMODULE'),
  ('concurrent', '/usr/lib/python3.8/concurrent/__init__.py', 'PYMODULE'),
  ('asyncio.base_tasks',
   '/usr/lib/python3.8/asyncio/base_tasks.py',
   'PYMODULE'),
  ('asyncio.locks', '/usr/lib/python3.8/asyncio/locks.py', 'PYMODULE'),
  ('asyncio.sslproto', '/usr/lib/python3.8/asyncio/sslproto.py', 'PYMODULE'),
  ('asyncio.transports',
   '/usr/lib/python3.8/asyncio/transports.py',
   'PYMODULE'),
  ('asyncio.base_events',
   '/usr/lib/python3.8/asyncio/base_events.py',
   'PYMODULE'),
  ('asyncio.protocols', '/usr/lib/python3.8/asyncio/protocols.py', 'PYMODULE'),
  ('asyncio.futures', '/usr/lib/python3.8/asyncio/futures.py', 'PYMODULE'),
  ('asyncio.coroutines',
   '/usr/lib/python3.8/asyncio/coroutines.py',
   'PYMODULE'),
  ('asyncio.base_futures',
   '/usr/lib/python3.8/asyncio/base_futures.py',
   'PYMODULE'),
  ('asyncio.exceptions',
   '/usr/lib/python3.8/asyncio/exceptions.py',
   'PYMODULE'),
  ('asyncio.format_helpers',
   '/usr/lib/python3.8/asyncio/format_helpers.py',
   'PYMODULE'),
  ('asyncio.constants', '/usr/lib/python3.8/asyncio/constants.py', 'PYMODULE'),
  ('unittest.result', '/usr/lib/python3.8/unittest/result.py', 'PYMODULE'),
  ('unittest.util', '/usr/lib/python3.8/unittest/util.py', 'PYMODULE'),
  ('pdb', '/usr/lib/python3.8/pdb.py', 'PYMODULE'),
  ('pydoc', '/usr/lib/python3.8/pydoc.py', 'PYMODULE'),
  ('http.server', '/usr/lib/python3.8/http/server.py', 'PYMODULE'),
  ('socketserver', '/usr/lib/python3.8/socketserver.py', 'PYMODULE'),
  ('pydoc_data.topics', '/usr/lib/python3.8/pydoc_data/topics.py', 'PYMODULE'),
  ('pydoc_data', '/usr/lib/python3.8/pydoc_data/__init__.py', 'PYMODULE'),
  ('tty', '/usr/lib/python3.8/tty.py', 'PYMODULE'),
  ('sysconfig', '/usr/lib/python3.8/sysconfig.py', 'PYMODULE'),
  ('_sysconfigdata__x86_64-linux-gnu',
   '/usr/lib/python3.8/_sysconfigdata__x86_64-linux-gnu.py',
   'PYMODULE'),
  ('platform', '/usr/lib/python3.8/platform.py', 'PYMODULE'),
  ('code', '/usr/lib/python3.8/code.py', 'PYMODULE'),
  ('codeop', '/usr/lib/python3.8/codeop.py', 'PYMODULE'),
  ('bdb', '/usr/lib/python3.8/bdb.py', 'PYMODULE'),
  ('cmd', '/usr/lib/python3.8/cmd.py', 'PYMODULE'),
  ('difflib', '/usr/lib/python3.8/difflib.py', 'PYMODULE'),
  ('lxml.cssselect',
   '/home/marcoslessa/.local/lib/python3.8/site-packages/lxml/cssselect.py',
   'PYMODULE'),
  ('cssselect',
   '/home/marcoslessa/.local/lib/python3.8/site-packages/cssselect/__init__.py',
   'PYMODULE'),
  ('cssselect.xpath',
   '/home/marcoslessa/.local/lib/python3.8/site-packages/cssselect/xpath.py',
   'PYMODULE'),
  ('cssselect.parser',
   '/home/marcoslessa/.local/lib/python3.8/site-packages/cssselect/parser.py',
   'PYMODULE'),
  ('lxml.ElementInclude',
   '/home/marcoslessa/.local/lib/python3.8/site-packages/lxml/ElementInclude.py',
   'PYMODULE'),
  ('bs4.builder._html5lib',
   '/usr/lib/python3/dist-packages/bs4/builder/_html5lib.py',
   'PYMODULE'),
  ('bs4.builder._htmlparser',
   '/usr/lib/python3/dist-packages/bs4/builder/_htmlparser.py',
   'PYMODULE'),
  ('html.parser', '/usr/lib/python3.8/html/parser.py', 'PYMODULE'),
  ('_markupbase', '/usr/lib/python3.8/_markupbase.py', 'PYMODULE'),
  ('ExtractionConfig',
   '/home/marcoslessa/Desktop/crawlex/ExtractionConfig.py',
   'PYMODULE'),
  ('DatePatternGenerator',
   '/home/marcoslessa/Desktop/crawlex/DatePatternGenerator.py',
   'PYMODULE'),
  ('ContentComparator',
   '/home/marcoslessa/Desktop/crawlex/ContentComparator.py',
   'PYMODULE'),
  ('ArticlePatternGenerator',
   '/home/marcoslessa/Desktop/crawlex/ArticlePatternGenerator.py',
   'PYMODULE'),
  ('ExampleArticlesDao',
   '/home/marcoslessa/Desktop/crawlex/ExampleArticlesDao.py',
   'PYMODULE'),
  ('LinkFinder', '/home/marcoslessa/Desktop/crawlex/LinkFinder.py', 'PYMODULE'),
  ('DedicatedCrawler',
   '/home/marcoslessa/Desktop/crawlex/DedicatedCrawler.py',
   'PYMODULE'),
  ('WebsiteDao', '/home/marcoslessa/Desktop/crawlex/WebsiteDao.py', 'PYMODULE'),
  ('Website', '/home/marcoslessa/Desktop/crawlex/Website.py', 'PYMODULE'),
  ('EmailSenderConfig',
   '/home/marcoslessa/Desktop/crawlex/EmailSenderConfig.py',
   'PYMODULE'),
  ('resources_rc',
   '/home/marcoslessa/Desktop/crawlex/resources_rc.py',
   'PYMODULE')],
 [('libz.so.1', '/lib/x86_64-linux-gnu/libz.so.1', 'BINARY'),
  ('libexpat.so.1', '/lib/x86_64-linux-gnu/libexpat.so.1', 'BINARY'),
  ('PyQt5/Qt5/plugins/wayland-shell-integration/libxdg-shell-v6.so',
   '/home/marcoslessa/.local/lib/python3.8/site-packages/PyQt5/Qt5/plugins/wayland-shell-integration/libxdg-shell-v6.so',
   'BINARY'),
  ('PyQt5/Qt5/plugins/xcbglintegrations/libqxcb-glx-integration.so',
   '/home/marcoslessa/.local/lib/python3.8/site-packages/PyQt5/Qt5/plugins/xcbglintegrations/libqxcb-glx-integration.so',
   'BINARY'),
  ('PyQt5/Qt5/plugins/imageformats/libqsvg.so',
   '/home/marcoslessa/.local/lib/python3.8/site-packages/PyQt5/Qt5/plugins/imageformats/libqsvg.so',
   'BINARY'),
  ('PyQt5/Qt5/plugins/platforms/libqlinuxfb.so',
   '/home/marcoslessa/.local/lib/python3.8/site-packages/PyQt5/Qt5/plugins/platforms/libqlinuxfb.so',
   'BINARY'),
  ('PyQt5/Qt5/plugins/platforms/libqwayland-xcomposite-egl.so',
   '/home/marcoslessa/.local/lib/python3.8/site-packages/PyQt5/Qt5/plugins/platforms/libqwayland-xcomposite-egl.so',
   'BINARY'),
  ('PyQt5/Qt5/plugins/platforms/libqminimalegl.so',
   '/home/marcoslessa/.local/lib/python3.8/site-packages/PyQt5/Qt5/plugins/platforms/libqminimalegl.so',
   'BINARY'),
  ('PyQt5/Qt5/plugins/platforms/libqeglfs.so',
   '/home/marcoslessa/.local/lib/python3.8/site-packages/PyQt5/Qt5/plugins/platforms/libqeglfs.so',
   'BINARY'),
  ('PyQt5/Qt5/plugins/wayland-shell-integration/libfullscreen-shell-v1.so',
   '/home/marcoslessa/.local/lib/python3.8/site-packages/PyQt5/Qt5/plugins/wayland-shell-integration/libfullscreen-shell-v1.so',
   'BINARY'),
  ('PyQt5/Qt5/plugins/wayland-graphics-integration-client/libvulkan-server.so',
   '/home/marcoslessa/.local/lib/python3.8/site-packages/PyQt5/Qt5/plugins/wayland-graphics-integration-client/libvulkan-server.so',
   'BINARY'),
  ('PyQt5/Qt5/plugins/imageformats/libqicns.so',
   '/home/marcoslessa/.local/lib/python3.8/site-packages/PyQt5/Qt5/plugins/imageformats/libqicns.so',
   'BINARY'),
  ('PyQt5/Qt5/plugins/egldeviceintegrations/libqeglfs-emu-integration.so',
   '/home/marcoslessa/.local/lib/python3.8/site-packages/PyQt5/Qt5/plugins/egldeviceintegrations/libqeglfs-emu-integration.so',
   'BINARY'),
  ('PyQt5/Qt5/plugins/platforms/libqwayland-egl.so',
   '/home/marcoslessa/.local/lib/python3.8/site-packages/PyQt5/Qt5/plugins/platforms/libqwayland-egl.so',
   'BINARY'),
  ('PyQt5/Qt5/plugins/wayland-shell-integration/libwl-shell.so',
   '/home/marcoslessa/.local/lib/python3.8/site-packages/PyQt5/Qt5/plugins/wayland-shell-integration/libwl-shell.so',
   'BINARY'),
  ('PyQt5/Qt5/plugins/platforms/libqwayland-generic.so',
   '/home/marcoslessa/.local/lib/python3.8/site-packages/PyQt5/Qt5/plugins/platforms/libqwayland-generic.so',
   'BINARY'),
  ('PyQt5/Qt5/plugins/wayland-graphics-integration-client/libqt-plugin-wayland-egl.so',
   '/home/marcoslessa/.local/lib/python3.8/site-packages/PyQt5/Qt5/plugins/wayland-graphics-integration-client/libqt-plugin-wayland-egl.so',
   'BINARY'),
  ('PyQt5/Qt5/plugins/wayland-graphics-integration-client/libxcomposite-egl.so',
   '/home/marcoslessa/.local/lib/python3.8/site-packages/PyQt5/Qt5/plugins/wayland-graphics-integration-client/libxcomposite-egl.so',
   'BINARY'),
  ('PyQt5/Qt5/plugins/platforms/libqminimal.so',
   '/home/marcoslessa/.local/lib/python3.8/site-packages/PyQt5/Qt5/plugins/platforms/libqminimal.so',
   'BINARY'),
  ('PyQt5/Qt5/plugins/platforms/libqoffscreen.so',
   '/home/marcoslessa/.local/lib/python3.8/site-packages/PyQt5/Qt5/plugins/platforms/libqoffscreen.so',
   'BINARY'),
  ('PyQt5/Qt5/plugins/wayland-graphics-integration-client/libdrm-egl-server.so',
   '/home/marcoslessa/.local/lib/python3.8/site-packages/PyQt5/Qt5/plugins/wayland-graphics-integration-client/libdrm-egl-server.so',
   'BINARY'),
  ('PyQt5/Qt5/plugins/wayland-graphics-integration-client/libxcomposite-glx.so',
   '/home/marcoslessa/.local/lib/python3.8/site-packages/PyQt5/Qt5/plugins/wayland-graphics-integration-client/libxcomposite-glx.so',
   'BINARY'),
  ('PyQt5/Qt5/plugins/wayland-graphics-integration-client/libdmabuf-server.so',
   '/home/marcoslessa/.local/lib/python3.8/site-packages/PyQt5/Qt5/plugins/wayland-graphics-integration-client/libdmabuf-server.so',
   'BINARY'),
  ('PyQt5/Qt5/plugins/platforminputcontexts/libibusplatforminputcontextplugin.so',
   '/home/marcoslessa/.local/lib/python3.8/site-packages/PyQt5/Qt5/plugins/platforminputcontexts/libibusplatforminputcontextplugin.so',
   'BINARY'),
  ('PyQt5/Qt5/plugins/platformthemes/libqgtk3.so',
   '/home/marcoslessa/.local/lib/python3.8/site-packages/PyQt5/Qt5/plugins/platformthemes/libqgtk3.so',
   'BINARY'),
  ('PyQt5/Qt5/plugins/imageformats/libqtiff.so',
   '/home/marcoslessa/.local/lib/python3.8/site-packages/PyQt5/Qt5/plugins/imageformats/libqtiff.so',
   'BINARY'),
  ('PyQt5/Qt5/plugins/platforms/libqwebgl.so',
   '/home/marcoslessa/.local/lib/python3.8/site-packages/PyQt5/Qt5/plugins/platforms/libqwebgl.so',
   'BINARY'),
  ('PyQt5/Qt5/plugins/iconengines/libqsvgicon.so',
   '/home/marcoslessa/.local/lib/python3.8/site-packages/PyQt5/Qt5/plugins/iconengines/libqsvgicon.so',
   'BINARY'),
  ('PyQt5/Qt5/plugins/wayland-shell-integration/libivi-shell.so',
   '/home/marcoslessa/.local/lib/python3.8/site-packages/PyQt5/Qt5/plugins/wayland-shell-integration/libivi-shell.so',
   'BINARY'),
  ('PyQt5/Qt5/plugins/egldeviceintegrations/libqeglfs-kms-egldevice-integration.so',
   '/home/marcoslessa/.local/lib/python3.8/site-packages/PyQt5/Qt5/plugins/egldeviceintegrations/libqeglfs-kms-egldevice-integration.so',
   'BINARY'),
  ('PyQt5/Qt5/plugins/platformthemes/libqxdgdesktopportal.so',
   '/home/marcoslessa/.local/lib/python3.8/site-packages/PyQt5/Qt5/plugins/platformthemes/libqxdgdesktopportal.so',
   'BINARY'),
  ('PyQt5/Qt5/plugins/platforms/libqvnc.so',
   '/home/marcoslessa/.local/lib/python3.8/site-packages/PyQt5/Qt5/plugins/platforms/libqvnc.so',
   'BINARY'),
  ('PyQt5/Qt5/plugins/imageformats/libqwebp.so',
   '/home/marcoslessa/.local/lib/python3.8/site-packages/PyQt5/Qt5/plugins/imageformats/libqwebp.so',
   'BINARY'),
  ('PyQt5/Qt5/plugins/egldeviceintegrations/libqeglfs-x11-integration.so',
   '/home/marcoslessa/.local/lib/python3.8/site-packages/PyQt5/Qt5/plugins/egldeviceintegrations/libqeglfs-x11-integration.so',
   'BINARY'),
  ('PyQt5/Qt5/plugins/platforminputcontexts/libcomposeplatforminputcontextplugin.so',
   '/home/marcoslessa/.local/lib/python3.8/site-packages/PyQt5/Qt5/plugins/platforminputcontexts/libcomposeplatforminputcontextplugin.so',
   'BINARY'),
  ('PyQt5/Qt5/plugins/wayland-decoration-client/libbradient.so',
   '/home/marcoslessa/.local/lib/python3.8/site-packages/PyQt5/Qt5/plugins/wayland-decoration-client/libbradient.so',
   'BINARY'),
  ('PyQt5/Qt5/plugins/platforms/libqxcb.so',
   '/home/marcoslessa/.local/lib/python3.8/site-packages/PyQt5/Qt5/plugins/platforms/libqxcb.so',
   'BINARY'),
  ('PyQt5/Qt5/plugins/platforms/libqwayland-xcomposite-glx.so',
   '/home/marcoslessa/.local/lib/python3.8/site-packages/PyQt5/Qt5/plugins/platforms/libqwayland-xcomposite-glx.so',
   'BINARY'),
  ('PyQt5/Qt5/plugins/wayland-graphics-integration-client/libshm-emulation-server.so',
   '/home/marcoslessa/.local/lib/python3.8/site-packages/PyQt5/Qt5/plugins/wayland-graphics-integration-client/libshm-emulation-server.so',
   'BINARY'),
  ('PyQt5/Qt5/plugins/imageformats/libqico.so',
   '/home/marcoslessa/.local/lib/python3.8/site-packages/PyQt5/Qt5/plugins/imageformats/libqico.so',
   'BINARY'),
  ('PyQt5/Qt5/plugins/imageformats/libqjpeg.so',
   '/home/marcoslessa/.local/lib/python3.8/site-packages/PyQt5/Qt5/plugins/imageformats/libqjpeg.so',
   'BINARY'),
  ('PyQt5/Qt5/plugins/imageformats/libqgif.so',
   '/home/marcoslessa/.local/lib/python3.8/site-packages/PyQt5/Qt5/plugins/imageformats/libqgif.so',
   'BINARY'),
  ('PyQt5/Qt5/plugins/xcbglintegrations/libqxcb-egl-integration.so',
   '/home/marcoslessa/.local/lib/python3.8/site-packages/PyQt5/Qt5/plugins/xcbglintegrations/libqxcb-egl-integration.so',
   'BINARY'),
  ('PyQt5/Qt5/plugins/wayland-shell-integration/libxdg-shell.so',
   '/home/marcoslessa/.local/lib/python3.8/site-packages/PyQt5/Qt5/plugins/wayland-shell-integration/libxdg-shell.so',
   'BINARY'),
  ('PyQt5/Qt5/plugins/imageformats/libqwbmp.so',
   '/home/marcoslessa/.local/lib/python3.8/site-packages/PyQt5/Qt5/plugins/imageformats/libqwbmp.so',
   'BINARY'),
  ('PyQt5/Qt5/plugins/wayland-shell-integration/libxdg-shell-v5.so',
   '/home/marcoslessa/.local/lib/python3.8/site-packages/PyQt5/Qt5/plugins/wayland-shell-integration/libxdg-shell-v5.so',
   'BINARY'),
  ('PyQt5/Qt5/plugins/imageformats/libqtga.so',
   '/home/marcoslessa/.local/lib/python3.8/site-packages/PyQt5/Qt5/plugins/imageformats/libqtga.so',
   'BINARY'),
  ('lib-dynload/_posixshmem',
   '/usr/lib/python3.8/lib-dynload/_posixshmem.cpython-38-x86_64-linux-gnu.so',
   'EXTENSION'),
  ('lib-dynload/_multiprocessing',
   '/usr/lib/python3.8/lib-dynload/_multiprocessing.cpython-38-x86_64-linux-gnu.so',
   'EXTENSION'),
  ('lib-dynload/_hashlib',
   '/usr/lib/python3.8/lib-dynload/_hashlib.cpython-38-x86_64-linux-gnu.so',
   'EXTENSION'),
  ('lib-dynload/resource',
   '/usr/lib/python3.8/lib-dynload/resource.cpython-38-x86_64-linux-gnu.so',
   'EXTENSION'),
  ('lib-dynload/_lzma',
   '/usr/lib/python3.8/lib-dynload/_lzma.cpython-38-x86_64-linux-gnu.so',
   'EXTENSION'),
  ('lib-dynload/_bz2',
   '/usr/lib/python3.8/lib-dynload/_bz2.cpython-38-x86_64-linux-gnu.so',
   'EXTENSION'),
  ('lib-dynload/termios',
   '/usr/lib/python3.8/lib-dynload/termios.cpython-38-x86_64-linux-gnu.so',
   'EXTENSION'),
  ('lib-dynload/_ssl',
   '/usr/lib/python3.8/lib-dynload/_ssl.cpython-38-x86_64-linux-gnu.so',
   'EXTENSION'),
  ('lib-dynload/_contextvars',
   '/usr/lib/python3.8/lib-dynload/_contextvars.cpython-38-x86_64-linux-gnu.so',
   'EXTENSION'),
  ('lib-dynload/_decimal',
   '/usr/lib/python3.8/lib-dynload/_decimal.cpython-38-x86_64-linux-gnu.so',
   'EXTENSION'),
  ('lib-dynload/mmap',
   '/usr/lib/python3.8/lib-dynload/mmap.cpython-38-x86_64-linux-gnu.so',
   'EXTENSION'),
  ('lib-dynload/_ctypes',
   '/usr/lib/python3.8/lib-dynload/_ctypes.cpython-38-x86_64-linux-gnu.so',
   'EXTENSION'),
  ('lib-dynload/_queue',
   '/usr/lib/python3.8/lib-dynload/_queue.cpython-38-x86_64-linux-gnu.so',
   'EXTENSION'),
  ('lib-dynload/_opcode',
   '/usr/lib/python3.8/lib-dynload/_opcode.cpython-38-x86_64-linux-gnu.so',
   'EXTENSION'),
  ('lib-dynload/_multibytecodec',
   '/usr/lib/python3.8/lib-dynload/_multibytecodec.cpython-38-x86_64-linux-gnu.so',
   'EXTENSION'),
  ('lib-dynload/_codecs_jp',
   '/usr/lib/python3.8/lib-dynload/_codecs_jp.cpython-38-x86_64-linux-gnu.so',
   'EXTENSION'),
  ('lib-dynload/_codecs_kr',
   '/usr/lib/python3.8/lib-dynload/_codecs_kr.cpython-38-x86_64-linux-gnu.so',
   'EXTENSION'),
  ('lib-dynload/_codecs_iso2022',
   '/usr/lib/python3.8/lib-dynload/_codecs_iso2022.cpython-38-x86_64-linux-gnu.so',
   'EXTENSION'),
  ('lib-dynload/_codecs_cn',
   '/usr/lib/python3.8/lib-dynload/_codecs_cn.cpython-38-x86_64-linux-gnu.so',
   'EXTENSION'),
  ('lib-dynload/_codecs_tw',
   '/usr/lib/python3.8/lib-dynload/_codecs_tw.cpython-38-x86_64-linux-gnu.so',
   'EXTENSION'),
  ('lib-dynload/_codecs_hk',
   '/usr/lib/python3.8/lib-dynload/_codecs_hk.cpython-38-x86_64-linux-gnu.so',
   'EXTENSION'),
  ('lib-dynload/_sqlite3',
   '/usr/lib/python3.8/lib-dynload/_sqlite3.cpython-38-x86_64-linux-gnu.so',
   'EXTENSION'),
  ('PyQt5.QtWidgets',
   '/home/marcoslessa/.local/lib/python3.8/site-packages/PyQt5/QtWidgets.abi3.so',
   'EXTENSION'),
  ('PyQt5.QtGui',
   '/home/marcoslessa/.local/lib/python3.8/site-packages/PyQt5/QtGui.abi3.so',
   'EXTENSION'),
  ('PyQt5.QtCore',
   '/home/marcoslessa/.local/lib/python3.8/site-packages/PyQt5/QtCore.abi3.so',
   'EXTENSION'),
  ('PyQt5.sip',
   '/home/marcoslessa/.local/lib/python3.8/site-packages/PyQt5/sip.cpython-38-x86_64-linux-gnu.so',
   'EXTENSION'),
  ('sip',
   '/usr/lib/python3/dist-packages/sip.cpython-38-x86_64-linux-gnu.so',
   'EXTENSION'),
  ('lib-dynload/_json',
   '/usr/lib/python3.8/lib-dynload/_json.cpython-38-x86_64-linux-gnu.so',
   'EXTENSION'),
  ('simplejson._speedups',
   '/usr/lib/python3/dist-packages/simplejson/_speedups.cpython-38-x86_64-linux-gnu.so',
   'EXTENSION'),
  ('_cffi_backend',
   '/usr/lib/python3/dist-packages/_cffi_backend.cpython-38-x86_64-linux-gnu.so',
   'EXTENSION'),
  ('cryptography.hazmat.bindings._openssl',
   '/usr/lib/python3/dist-packages/cryptography/hazmat/bindings/_openssl.abi3.so',
   'EXTENSION'),
  ('cryptography.hazmat.bindings._constant_time',
   '/usr/lib/python3/dist-packages/cryptography/hazmat/bindings/_constant_time.abi3.so',
   'EXTENSION'),
  ('lxml.etree',
   '/home/marcoslessa/.local/lib/python3.8/site-packages/lxml/etree.cpython-38-x86_64-linux-gnu.so',
   'EXTENSION'),
  ('lxml._elementpath',
   '/home/marcoslessa/.local/lib/python3.8/site-packages/lxml/_elementpath.cpython-38-x86_64-linux-gnu.so',
   'EXTENSION'),
  ('lxml.sax',
   '/home/marcoslessa/.local/lib/python3.8/site-packages/lxml/sax.cpython-38-x86_64-linux-gnu.so',
   'EXTENSION'),
  ('lxml.objectify',
   '/home/marcoslessa/.local/lib/python3.8/site-packages/lxml/objectify.cpython-38-x86_64-linux-gnu.so',
   'EXTENSION'),
  ('lxml.html.diff',
   '/home/marcoslessa/.local/lib/python3.8/site-packages/lxml/html/diff.cpython-38-x86_64-linux-gnu.so',
   'EXTENSION'),
  ('lxml.html.clean',
   '/home/marcoslessa/.local/lib/python3.8/site-packages/lxml/html/clean.cpython-38-x86_64-linux-gnu.so',
   'EXTENSION'),
  ('lib-dynload/_asyncio',
   '/usr/lib/python3.8/lib-dynload/_asyncio.cpython-38-x86_64-linux-gnu.so',
   'EXTENSION'),
  ('lib-dynload/readline',
   '/usr/lib/python3.8/lib-dynload/readline.cpython-38-x86_64-linux-gnu.so',
   'EXTENSION'),
  ('lxml.builder',
   '/home/marcoslessa/.local/lib/python3.8/site-packages/lxml/builder.cpython-38-x86_64-linux-gnu.so',
   'EXTENSION'),
  ('libgcc_s.so.1', '/lib/x86_64-linux-gnu/libgcc_s.so.1', 'BINARY'),
  ('libfreetype.so.6', '/lib/x86_64-linux-gnu/libfreetype.so.6', 'BINARY'),
  ('libbsd.so.0', '/lib/x86_64-linux-gnu/libbsd.so.0', 'BINARY'),
  ('libfontconfig.so.1', '/lib/x86_64-linux-gnu/libfontconfig.so.1', 'BINARY'),
  ('libwayland-client.so.0',
   '/lib/x86_64-linux-gnu/libwayland-client.so.0',
   'BINARY'),
  ('libicui18n.so.56',
   '/home/marcoslessa/.local/lib/python3.8/site-packages/PyQt5/Qt5/plugins/wayland-shell-integration/../../lib/libicui18n.so.56',
   'BINARY'),
  ('libgpg-error.so.0', '/lib/x86_64-linux-gnu/libgpg-error.so.0', 'BINARY'),
  ('libsystemd.so.0', '/lib/x86_64-linux-gnu/libsystemd.so.0', 'BINARY'),
  ('libQt5WaylandClient.so.5',
   '/home/marcoslessa/.local/lib/python3.8/site-packages/PyQt5/Qt5/plugins/wayland-shell-integration/../../lib/libQt5WaylandClient.so.5',
   'BINARY'),
  ('libicuuc.so.56',
   '/home/marcoslessa/.local/lib/python3.8/site-packages/PyQt5/Qt5/plugins/wayland-shell-integration/../../lib/libicuuc.so.56',
   'BINARY'),
  ('liblz4.so.1', '/lib/x86_64-linux-gnu/liblz4.so.1', 'BINARY'),
  ('libdbus-1.so.3', '/lib/x86_64-linux-gnu/libdbus-1.so.3', 'BINARY'),
  ('libxkbcommon.so.0', '/lib/x86_64-linux-gnu/libxkbcommon.so.0', 'BINARY'),
  ('libffi.so.7', '/lib/x86_64-linux-gnu/libffi.so.7', 'BINARY'),
  ('libQt5Core.so.5',
   '/home/marcoslessa/.local/lib/python3.8/site-packages/PyQt5/Qt5/plugins/wayland-shell-integration/../../lib/libQt5Core.so.5',
   'BINARY'),
  ('libXau.so.6', '/lib/x86_64-linux-gnu/libXau.so.6', 'BINARY'),
  ('libgthread-2.0.so.0',
   '/lib/x86_64-linux-gnu/libgthread-2.0.so.0',
   'BINARY'),
  ('libgcrypt.so.20', '/lib/x86_64-linux-gnu/libgcrypt.so.20', 'BINARY'),
  ('libXdmcp.so.6', '/lib/x86_64-linux-gnu/libXdmcp.so.6', 'BINARY'),
  ('libicudata.so.56',
   '/home/marcoslessa/.local/lib/python3.8/site-packages/PyQt5/Qt5/plugins/wayland-shell-integration/../../lib/libicudata.so.56',
   'BINARY'),
  ('libQt5Gui.so.5',
   '/home/marcoslessa/.local/lib/python3.8/site-packages/PyQt5/Qt5/plugins/wayland-shell-integration/../../lib/libQt5Gui.so.5',
   'BINARY'),
  ('libbrotlicommon.so.1',
   '/lib/x86_64-linux-gnu/libbrotlicommon.so.1',
   'BINARY'),
  ('libX11.so.6', '/lib/x86_64-linux-gnu/libX11.so.6', 'BINARY'),
  ('libpng16.so.16', '/lib/x86_64-linux-gnu/libpng16.so.16', 'BINARY'),
  ('libglib-2.0.so.0', '/lib/x86_64-linux-gnu/libglib-2.0.so.0', 'BINARY'),
  ('libpcre.so.3', '/lib/x86_64-linux-gnu/libpcre.so.3', 'BINARY'),
  ('liblzma.so.5', '/lib/x86_64-linux-gnu/liblzma.so.5', 'BINARY'),
  ('libQt5DBus.so.5',
   '/home/marcoslessa/.local/lib/python3.8/site-packages/PyQt5/Qt5/plugins/wayland-shell-integration/../../lib/libQt5DBus.so.5',
   'BINARY'),
  ('libbrotlidec.so.1', '/lib/x86_64-linux-gnu/libbrotlidec.so.1', 'BINARY'),
  ('libstdc++.so.6', '/lib/x86_64-linux-gnu/libstdc++.so.6', 'BINARY'),
  ('libuuid.so.1', '/lib/x86_64-linux-gnu/libuuid.so.1', 'BINARY'),
  ('libwayland-cursor.so.0',
   '/lib/x86_64-linux-gnu/libwayland-cursor.so.0',
   'BINARY'),
  ('libxcb-randr.so.0', '/lib/x86_64-linux-gnu/libxcb-randr.so.0', 'BINARY'),
  ('libxcb-xfixes.so.0', '/lib/x86_64-linux-gnu/libxcb-xfixes.so.0', 'BINARY'),
  ('libxcb-sync.so.1', '/lib/x86_64-linux-gnu/libxcb-sync.so.1', 'BINARY'),
  ('libxcb-shm.so.0', '/lib/x86_64-linux-gnu/libxcb-shm.so.0', 'BINARY'),
  ('libxcb-glx.so.0', '/lib/x86_64-linux-gnu/libxcb-glx.so.0', 'BINARY'),
  ('libQt5XcbQpa.so.5',
   '/home/marcoslessa/.local/lib/python3.8/site-packages/PyQt5/Qt5/plugins/xcbglintegrations/../../lib/libQt5XcbQpa.so.5',
   'BINARY'),
  ('libXext.so.6', '/lib/x86_64-linux-gnu/libXext.so.6', 'BINARY'),
  ('libxcb-xinerama.so.0',
   '/lib/x86_64-linux-gnu/libxcb-xinerama.so.0',
   'BINARY'),
  ('libxkbcommon-x11.so.0',
   '/lib/x86_64-linux-gnu/libxkbcommon-x11.so.0',
   'BINARY'),
  ('libxcb-render-util.so.0',
   '/lib/x86_64-linux-gnu/libxcb-render-util.so.0',
   'BINARY'),
  ('libxcb-icccm.so.4', '/lib/x86_64-linux-gnu/libxcb-icccm.so.4', 'BINARY'),
  ('libxcb-xkb.so.1', '/lib/x86_64-linux-gnu/libxcb-xkb.so.1', 'BINARY'),
  ('libxcb-render.so.0', '/lib/x86_64-linux-gnu/libxcb-render.so.0', 'BINARY'),
  ('libxcb-keysyms.so.1',
   '/lib/x86_64-linux-gnu/libxcb-keysyms.so.1',
   'BINARY'),
  ('libxcb-image.so.0', '/lib/x86_64-linux-gnu/libxcb-image.so.0', 'BINARY'),
  ('libX11-xcb.so.1', '/lib/x86_64-linux-gnu/libX11-xcb.so.1', 'BINARY'),
  ('libxcb-util.so.1', '/lib/x86_64-linux-gnu/libxcb-util.so.1', 'BINARY'),
  ('libxcb-shape.so.0', '/lib/x86_64-linux-gnu/libxcb-shape.so.0', 'BINARY'),
  ('libQt5Widgets.so.5',
   '/home/marcoslessa/.local/lib/python3.8/site-packages/PyQt5/Qt5/plugins/imageformats/../../lib/libQt5Widgets.so.5',
   'BINARY'),
  ('libQt5Svg.so.5',
   '/home/marcoslessa/.local/lib/python3.8/site-packages/PyQt5/Qt5/plugins/imageformats/../../lib/libQt5Svg.so.5',
   'BINARY'),
  ('libXcomposite.so.1', '/lib/x86_64-linux-gnu/libXcomposite.so.1', 'BINARY'),
  ('libQt5EglFSDeviceIntegration.so.5',
   '/lib/x86_64-linux-gnu/libQt5EglFSDeviceIntegration.so.5',
   'BINARY'),
  ('libwacom.so.2', '/lib/x86_64-linux-gnu/libwacom.so.2', 'BINARY'),
  ('libgudev-1.0.so.0', '/lib/x86_64-linux-gnu/libgudev-1.0.so.0', 'BINARY'),
  ('libinput.so.10', '/lib/x86_64-linux-gnu/libinput.so.10', 'BINARY'),
  ('libmtdev.so.1', '/lib/x86_64-linux-gnu/libmtdev.so.1', 'BINARY'),
  ('libudev.so.1', '/lib/x86_64-linux-gnu/libudev.so.1', 'BINARY'),
  ('libgobject-2.0.so.0',
   '/lib/x86_64-linux-gnu/libgobject-2.0.so.0',
   'BINARY'),
  ('libevdev.so.2', '/lib/x86_64-linux-gnu/libevdev.so.2', 'BINARY'),
  ('libwayland-egl.so.1',
   '/lib/x86_64-linux-gnu/libwayland-egl.so.1',
   'BINARY'),
  ('libfribidi.so.0', '/lib/x86_64-linux-gnu/libfribidi.so.0', 'BINARY'),
  ('libblkid.so.1', '/lib/x86_64-linux-gnu/libblkid.so.1', 'BINARY'),
  ('libdatrie.so.1', '/lib/x86_64-linux-gnu/libdatrie.so.1', 'BINARY'),
  ('libthai.so.0', '/lib/x86_64-linux-gnu/libthai.so.0', 'BINARY'),
  ('libgdk-3.so.0', '/lib/x86_64-linux-gnu/libgdk-3.so.0', 'BINARY'),
  ('libgdk_pixbuf-2.0.so.0',
   '/lib/x86_64-linux-gnu/libgdk_pixbuf-2.0.so.0',
   'BINARY'),
  ('libmount.so.1', '/lib/x86_64-linux-gnu/libmount.so.1', 'BINARY'),
  ('libpcre2-8.so.0', '/lib/x86_64-linux-gnu/libpcre2-8.so.0', 'BINARY'),
  ('libXfixes.so.3', '/lib/x86_64-linux-gnu/libXfixes.so.3', 'BINARY'),
  ('libepoxy.so.0', '/lib/x86_64-linux-gnu/libepoxy.so.0', 'BINARY'),
  ('libatk-1.0.so.0', '/lib/x86_64-linux-gnu/libatk-1.0.so.0', 'BINARY'),
  ('libpixman-1.so.0', '/lib/x86_64-linux-gnu/libpixman-1.so.0', 'BINARY'),
  ('libXdamage.so.1', '/lib/x86_64-linux-gnu/libXdamage.so.1', 'BINARY'),
  ('libharfbuzz.so.0', '/lib/x86_64-linux-gnu/libharfbuzz.so.0', 'BINARY'),
  ('libatk-bridge-2.0.so.0',
   '/lib/x86_64-linux-gnu/libatk-bridge-2.0.so.0',
   'BINARY'),
  ('libgraphite2.so.3', '/lib/x86_64-linux-gnu/libgraphite2.so.3', 'BINARY'),
  ('libselinux.so.1', '/lib/x86_64-linux-gnu/libselinux.so.1', 'BINARY'),
  ('libpango-1.0.so.0', '/lib/x86_64-linux-gnu/libpango-1.0.so.0', 'BINARY'),
  ('libgtk-3.so.0', '/lib/x86_64-linux-gnu/libgtk-3.so.0', 'BINARY'),
  ('libXrender.so.1', '/lib/x86_64-linux-gnu/libXrender.so.1', 'BINARY'),
  ('libgmodule-2.0.so.0',
   '/lib/x86_64-linux-gnu/libgmodule-2.0.so.0',
   'BINARY'),
  ('libcairo-gobject.so.2',
   '/lib/x86_64-linux-gnu/libcairo-gobject.so.2',
   'BINARY'),
  ('libgio-2.0.so.0', '/lib/x86_64-linux-gnu/libgio-2.0.so.0', 'BINARY'),
  ('libpangoft2-1.0.so.0',
   '/lib/x86_64-linux-gnu/libpangoft2-1.0.so.0',
   'BINARY'),
  ('libatspi.so.0', '/lib/x86_64-linux-gnu/libatspi.so.0', 'BINARY'),
  ('libpangocairo-1.0.so.0',
   '/lib/x86_64-linux-gnu/libpangocairo-1.0.so.0',
   'BINARY'),
  ('libXcursor.so.1', '/lib/x86_64-linux-gnu/libXcursor.so.1', 'BINARY'),
  ('libXrandr.so.2', '/lib/x86_64-linux-gnu/libXrandr.so.2', 'BINARY'),
  ('libXi.so.6', '/lib/x86_64-linux-gnu/libXi.so.6', 'BINARY'),
  ('libcairo.so.2', '/lib/x86_64-linux-gnu/libcairo.so.2', 'BINARY'),
  ('libXinerama.so.1', '/lib/x86_64-linux-gnu/libXinerama.so.1', 'BINARY'),
  ('libQt5WebSockets.so.5',
   '/home/marcoslessa/.local/lib/python3.8/site-packages/PyQt5/Qt5/plugins/platforms/../../lib/libQt5WebSockets.so.5',
   'BINARY'),
  ('libQt5Network.so.5',
   '/home/marcoslessa/.local/lib/python3.8/site-packages/PyQt5/Qt5/plugins/platforms/../../lib/libQt5Network.so.5',
   'BINARY'),
  ('libQt5Quick.so.5',
   '/home/marcoslessa/.local/lib/python3.8/site-packages/PyQt5/Qt5/plugins/platforms/../../lib/libQt5Quick.so.5',
   'BINARY'),
  ('libk5crypto.so.3', '/lib/x86_64-linux-gnu/libk5crypto.so.3', 'BINARY'),
  ('libQt5Qml.so.5',
   '/home/marcoslessa/.local/lib/python3.8/site-packages/PyQt5/Qt5/plugins/platforms/../../lib/libQt5Qml.so.5',
   'BINARY'),
  ('libkrb5support.so.0',
   '/lib/x86_64-linux-gnu/libkrb5support.so.0',
   'BINARY'),
  ('libcom_err.so.2', '/lib/x86_64-linux-gnu/libcom_err.so.2', 'BINARY'),
  ('libQt5QmlModels.so.5',
   '/home/marcoslessa/.local/lib/python3.8/site-packages/PyQt5/Qt5/plugins/platforms/../../lib/libQt5QmlModels.so.5',
   'BINARY'),
  ('libkeyutils.so.1', '/lib/x86_64-linux-gnu/libkeyutils.so.1', 'BINARY'),
  ('libgssapi_krb5.so.2',
   '/lib/x86_64-linux-gnu/libgssapi_krb5.so.2',
   'BINARY'),
  ('libkrb5.so.3', '/lib/x86_64-linux-gnu/libkrb5.so.3', 'BINARY'),
  ('libQt5EglFsKmsSupport.so.5',
   '/lib/x86_64-linux-gnu/libQt5EglFsKmsSupport.so.5',
   'BINARY'),
  ('libcrypto.so.1.1', '/lib/x86_64-linux-gnu/libcrypto.so.1.1', 'BINARY'),
  ('libbz2.so.1.0', '/lib/x86_64-linux-gnu/libbz2.so.1.0', 'BINARY'),
  ('libssl.so.1.1', '/lib/x86_64-linux-gnu/libssl.so.1.1', 'BINARY'),
  ('libmpdec.so.2', '/lib/x86_64-linux-gnu/libmpdec.so.2', 'BINARY'),
  ('libsqlite3.so.0', '/lib/x86_64-linux-gnu/libsqlite3.so.0', 'BINARY'),
  ('libreadline.so.8', '/lib/x86_64-linux-gnu/libreadline.so.8', 'BINARY'),
  ('libtinfo.so.6', '/lib/x86_64-linux-gnu/libtinfo.so.6', 'BINARY'),
  ('libicudata.so.66', '/lib/x86_64-linux-gnu/libicudata.so.66', 'BINARY'),
  ('libicui18n.so.66', '/lib/x86_64-linux-gnu/libicui18n.so.66', 'BINARY'),
  ('libpcre2-16.so.0', '/lib/x86_64-linux-gnu/libpcre2-16.so.0', 'BINARY'),
  ('libicuuc.so.66', '/lib/x86_64-linux-gnu/libicuuc.so.66', 'BINARY'),
  ('libdouble-conversion.so.3',
   '/lib/x86_64-linux-gnu/libdouble-conversion.so.3',
   'BINARY'),
  ('libpython3.8.so.1.0',
   '/lib/x86_64-linux-gnu/libpython3.8.so.1.0',
   'BINARY')],
 [],
 [],
 [('base_library.zip',
   '/home/marcoslessa/Desktop/crawlex/build/crawlex/base_library.zip',
   'DATA'),
  ('PyQt5/Qt5/translations/qtbase_fi.qm',
   '/home/marcoslessa/.local/lib/python3.8/site-packages/PyQt5/Qt5/translations/qtbase_fi.qm',
   'DATA'),
  ('PyQt5/Qt5/translations/qtbase_cs.qm',
   '/home/marcoslessa/.local/lib/python3.8/site-packages/PyQt5/Qt5/translations/qtbase_cs.qm',
   'DATA'),
  ('cryptography-2.8.egg-info/top_level.txt',
   '/usr/lib/python3/dist-packages/cryptography-2.8.egg-info/top_level.txt',
   'DATA'),
  ('cryptography-2.8.egg-info/PKG-INFO',
   '/usr/lib/python3/dist-packages/cryptography-2.8.egg-info/PKG-INFO',
   'DATA'),
  ('PyQt5/Qt5/translations/qtbase_sk.qm',
   '/home/marcoslessa/.local/lib/python3.8/site-packages/PyQt5/Qt5/translations/qtbase_sk.qm',
   'DATA'),
  ('PyQt5/Qt5/translations/qtbase_es.qm',
   '/home/marcoslessa/.local/lib/python3.8/site-packages/PyQt5/Qt5/translations/qtbase_es.qm',
   'DATA'),
  ('PyQt5/Qt5/translations/qtbase_ru.qm',
   '/home/marcoslessa/.local/lib/python3.8/site-packages/PyQt5/Qt5/translations/qtbase_ru.qm',
   'DATA'),
  ('lxml/isoschematron/resources/xsl/RNG2Schtrn.xsl',
   '/home/marcoslessa/.local/lib/python3.8/site-packages/lxml/isoschematron/resources/xsl/RNG2Schtrn.xsl',
   'DATA'),
  ('lxml/isoschematron/resources/xsl/iso-schematron-xslt1/iso_schematron_skeleton_for_xslt1.xsl',
   '/home/marcoslessa/.local/lib/python3.8/site-packages/lxml/isoschematron/resources/xsl/iso-schematron-xslt1/iso_schematron_skeleton_for_xslt1.xsl',
   'DATA'),
  ('lxml/isoschematron/resources/xsl/XSD2Schtrn.xsl',
   '/home/marcoslessa/.local/lib/python3.8/site-packages/lxml/isoschematron/resources/xsl/XSD2Schtrn.xsl',
   'DATA'),
  ('PyQt5/Qt5/translations/qtbase_ca.qm',
   '/home/marcoslessa/.local/lib/python3.8/site-packages/PyQt5/Qt5/translations/qtbase_ca.qm',
   'DATA'),
  ('PyQt5/Qt5/translations/qtbase_hu.qm',
   '/home/marcoslessa/.local/lib/python3.8/site-packages/PyQt5/Qt5/translations/qtbase_hu.qm',
   'DATA'),
  ('cryptography-2.8.egg-info/dependency_links.txt',
   '/usr/lib/python3/dist-packages/cryptography-2.8.egg-info/dependency_links.txt',
   'DATA'),
  ('PyQt5/Qt5/translations/qtbase_lv.qm',
   '/home/marcoslessa/.local/lib/python3.8/site-packages/PyQt5/Qt5/translations/qtbase_lv.qm',
   'DATA'),
  ('lxml/isoschematron/resources/xsl/iso-schematron-xslt1/iso_dsdl_include.xsl',
   '/home/marcoslessa/.local/lib/python3.8/site-packages/lxml/isoschematron/resources/xsl/iso-schematron-xslt1/iso_dsdl_include.xsl',
   'DATA'),
  ('PyQt5/Qt5/translations/qtbase_tr.qm',
   '/home/marcoslessa/.local/lib/python3.8/site-packages/PyQt5/Qt5/translations/qtbase_tr.qm',
   'DATA'),
  ('PyQt5/Qt5/translations/qtbase_da.qm',
   '/home/marcoslessa/.local/lib/python3.8/site-packages/PyQt5/Qt5/translations/qtbase_da.qm',
   'DATA'),
  ('lxml/isoschematron/resources/xsl/iso-schematron-xslt1/iso_svrl_for_xslt1.xsl',
   '/home/marcoslessa/.local/lib/python3.8/site-packages/lxml/isoschematron/resources/xsl/iso-schematron-xslt1/iso_svrl_for_xslt1.xsl',
   'DATA'),
  ('lxml/isoschematron/resources/xsl/iso-schematron-xslt1/readme.txt',
   '/home/marcoslessa/.local/lib/python3.8/site-packages/lxml/isoschematron/resources/xsl/iso-schematron-xslt1/readme.txt',
   'DATA'),
  ('PyQt5/Qt5/translations/qtbase_gd.qm',
   '/home/marcoslessa/.local/lib/python3.8/site-packages/PyQt5/Qt5/translations/qtbase_gd.qm',
   'DATA'),
  ('PyQt5/Qt5/translations/qtbase_ar.qm',
   '/home/marcoslessa/.local/lib/python3.8/site-packages/PyQt5/Qt5/translations/qtbase_ar.qm',
   'DATA'),
  ('PyQt5/Qt5/translations/qtbase_fr.qm',
   '/home/marcoslessa/.local/lib/python3.8/site-packages/PyQt5/Qt5/translations/qtbase_fr.qm',
   'DATA'),
  ('PyQt5/Qt5/translations/qtbase_ko.qm',
   '/home/marcoslessa/.local/lib/python3.8/site-packages/PyQt5/Qt5/translations/qtbase_ko.qm',
   'DATA'),
  ('lxml/isoschematron/resources/xsl/iso-schematron-xslt1/iso_schematron_message.xsl',
   '/home/marcoslessa/.local/lib/python3.8/site-packages/lxml/isoschematron/resources/xsl/iso-schematron-xslt1/iso_schematron_message.xsl',
   'DATA'),
  ('cryptography-2.8.egg-info/not-zip-safe',
   '/usr/lib/python3/dist-packages/cryptography-2.8.egg-info/not-zip-safe',
   'DATA'),
  ('lxml/isoschematron/resources/rng/iso-schematron.rng',
   '/home/marcoslessa/.local/lib/python3.8/site-packages/lxml/isoschematron/resources/rng/iso-schematron.rng',
   'DATA'),
  ('PyQt5/Qt5/translations/qtbase_uk.qm',
   '/home/marcoslessa/.local/lib/python3.8/site-packages/PyQt5/Qt5/translations/qtbase_uk.qm',
   'DATA'),
  ('PyQt5/Qt5/translations/qtbase_de.qm',
   '/home/marcoslessa/.local/lib/python3.8/site-packages/PyQt5/Qt5/translations/qtbase_de.qm',
   'DATA'),
  ('PyQt5/Qt5/translations/qtbase_en.qm',
   '/home/marcoslessa/.local/lib/python3.8/site-packages/PyQt5/Qt5/translations/qtbase_en.qm',
   'DATA'),
  ('PyQt5/Qt5/translations/qtbase_bg.qm',
   '/home/marcoslessa/.local/lib/python3.8/site-packages/PyQt5/Qt5/translations/qtbase_bg.qm',
   'DATA'),
  ('PyQt5/Qt5/translations/qtbase_it.qm',
   '/home/marcoslessa/.local/lib/python3.8/site-packages/PyQt5/Qt5/translations/qtbase_it.qm',
   'DATA'),
  ('PyQt5/Qt5/translations/qtbase_pl.qm',
   '/home/marcoslessa/.local/lib/python3.8/site-packages/PyQt5/Qt5/translations/qtbase_pl.qm',
   'DATA'),
  ('PyQt5/Qt5/translations/qtbase_zh_TW.qm',
   '/home/marcoslessa/.local/lib/python3.8/site-packages/PyQt5/Qt5/translations/qtbase_zh_TW.qm',
   'DATA'),
  ('certifi/cacert.pem',
   '/usr/lib/python3/dist-packages/certifi/cacert.pem',
   'DATA'),
  ('cryptography-2.8.egg-info/requires.txt',
   '/usr/lib/python3/dist-packages/cryptography-2.8.egg-info/requires.txt',
   'DATA'),
  ('PyQt5/Qt5/translations/qtbase_ja.qm',
   '/home/marcoslessa/.local/lib/python3.8/site-packages/PyQt5/Qt5/translations/qtbase_ja.qm',
   'DATA'),
  ('PyQt5/Qt5/translations/qtbase_he.qm',
   '/home/marcoslessa/.local/lib/python3.8/site-packages/PyQt5/Qt5/translations/qtbase_he.qm',
   'DATA'),
  ('lxml/isoschematron/resources/xsl/iso-schematron-xslt1/iso_abstract_expand.xsl',
   '/home/marcoslessa/.local/lib/python3.8/site-packages/lxml/isoschematron/resources/xsl/iso-schematron-xslt1/iso_abstract_expand.xsl',
   'DATA')],
 [])
