('/home/marcoslessa/Desktop/crawlex/dist/crawlex',
 False,
 False,
 False,
 None,
 None,
 False,
 False,
 None,
 True,
 True,
 False,
 None,
 None,
 None,
 '/home/marcoslessa/Desktop/crawlex/build/crawlex/crawlex.pkg',
 [('PYZ-00.pyz',
   '/home/marcoslessa/Desktop/crawlex/build/crawlex/PYZ-00.pyz',
   'PYZ'),
  ('struct',
   '/home/marcoslessa/Desktop/crawlex/build/crawlex/localpycos/struct.pyo',
   'PYMODULE'),
  ('pyimod01_os_path',
   '/home/marcoslessa/.local/lib/python3.8/site-packages/PyInstaller/loader/pyimod01_os_path.pyc',
   'PYMODULE'),
  ('pyimod02_archive',
   '/home/marcoslessa/.local/lib/python3.8/site-packages/PyInstaller/loader/pyimod02_archive.pyc',
   'PYMODULE'),
  ('pyimod03_importers',
   '/home/marcoslessa/.local/lib/python3.8/site-packages/PyInstaller/loader/pyimod03_importers.pyc',
   'PYMODULE'),
  ('pyimod04_ctypes',
   '/home/marcoslessa/.local/lib/python3.8/site-packages/PyInstaller/loader/pyimod04_ctypes.pyc',
   'PYMODULE'),
  ('pyiboot01_bootstrap',
   '/home/marcoslessa/.local/lib/python3.8/site-packages/PyInstaller/loader/pyiboot01_bootstrap.py',
   'PYSOURCE'),
  ('pyi_rth_subprocess',
   '/home/marcoslessa/.local/lib/python3.8/site-packages/PyInstaller/hooks/rthooks/pyi_rth_subprocess.py',
   'PYSOURCE'),
  ('pyi_rth_pyqt5',
   '/home/marcoslessa/.local/lib/python3.8/site-packages/PyInstaller/hooks/rthooks/pyi_rth_pyqt5.py',
   'PYSOURCE'),
  ('pyi_rth_pkgutil',
   '/home/marcoslessa/.local/lib/python3.8/site-packages/PyInstaller/hooks/rthooks/pyi_rth_pkgutil.py',
   'PYSOURCE'),
  ('pyi_rth_inspect',
   '/home/marcoslessa/.local/lib/python3.8/site-packages/PyInstaller/hooks/rthooks/pyi_rth_inspect.py',
   'PYSOURCE'),
  ('pyi_rth_multiprocessing',
   '/home/marcoslessa/.local/lib/python3.8/site-packages/PyInstaller/hooks/rthooks/pyi_rth_multiprocessing.py',
   'PYSOURCE'),
  ('crawlex', '/home/marcoslessa/Desktop/crawlex/crawlex.py', 'PYSOURCE'),
  ('libz.so.1', '/lib/x86_64-linux-gnu/libz.so.1', 'BINARY'),
  ('libexpat.so.1', '/lib/x86_64-linux-gnu/libexpat.so.1', 'BINARY'),
  ('PyQt5/Qt5/plugins/wayland-shell-integration/libxdg-shell-v6.so',
   '/home/marcoslessa/.local/lib/python3.8/site-packages/PyQt5/Qt5/plugins/wayland-shell-integration/libxdg-shell-v6.so',
   'BINARY'),
  ('PyQt5/Qt5/plugins/xcbglintegrations/libqxcb-glx-integration.so',
   '/home/marcoslessa/.local/lib/python3.8/site-packages/PyQt5/Qt5/plugins/xcbglintegrations/libqxcb-glx-integration.so',
   'BINARY'),
  ('PyQt5/Qt5/plugins/imageformats/libqsvg.so',
   '/home/marcoslessa/.local/lib/python3.8/site-packages/PyQt5/Qt5/plugins/imageformats/libqsvg.so',
   'BINARY'),
  ('PyQt5/Qt5/plugins/platforms/libqlinuxfb.so',
   '/home/marcoslessa/.local/lib/python3.8/site-packages/PyQt5/Qt5/plugins/platforms/libqlinuxfb.so',
   'BINARY'),
  ('PyQt5/Qt5/plugins/platforms/libqwayland-xcomposite-egl.so',
   '/home/marcoslessa/.local/lib/python3.8/site-packages/PyQt5/Qt5/plugins/platforms/libqwayland-xcomposite-egl.so',
   'BINARY'),
  ('PyQt5/Qt5/plugins/platforms/libqminimalegl.so',
   '/home/marcoslessa/.local/lib/python3.8/site-packages/PyQt5/Qt5/plugins/platforms/libqminimalegl.so',
   'BINARY'),
  ('PyQt5/Qt5/plugins/platforms/libqeglfs.so',
   '/home/marcoslessa/.local/lib/python3.8/site-packages/PyQt5/Qt5/plugins/platforms/libqeglfs.so',
   'BINARY'),
  ('PyQt5/Qt5/plugins/wayland-shell-integration/libfullscreen-shell-v1.so',
   '/home/marcoslessa/.local/lib/python3.8/site-packages/PyQt5/Qt5/plugins/wayland-shell-integration/libfullscreen-shell-v1.so',
   'BINARY'),
  ('PyQt5/Qt5/plugins/wayland-graphics-integration-client/libvulkan-server.so',
   '/home/marcoslessa/.local/lib/python3.8/site-packages/PyQt5/Qt5/plugins/wayland-graphics-integration-client/libvulkan-server.so',
   'BINARY'),
  ('PyQt5/Qt5/plugins/imageformats/libqicns.so',
   '/home/marcoslessa/.local/lib/python3.8/site-packages/PyQt5/Qt5/plugins/imageformats/libqicns.so',
   'BINARY'),
  ('PyQt5/Qt5/plugins/egldeviceintegrations/libqeglfs-emu-integration.so',
   '/home/marcoslessa/.local/lib/python3.8/site-packages/PyQt5/Qt5/plugins/egldeviceintegrations/libqeglfs-emu-integration.so',
   'BINARY'),
  ('PyQt5/Qt5/plugins/platforms/libqwayland-egl.so',
   '/home/marcoslessa/.local/lib/python3.8/site-packages/PyQt5/Qt5/plugins/platforms/libqwayland-egl.so',
   'BINARY'),
  ('PyQt5/Qt5/plugins/wayland-shell-integration/libwl-shell.so',
   '/home/marcoslessa/.local/lib/python3.8/site-packages/PyQt5/Qt5/plugins/wayland-shell-integration/libwl-shell.so',
   'BINARY'),
  ('PyQt5/Qt5/plugins/platforms/libqwayland-generic.so',
   '/home/marcoslessa/.local/lib/python3.8/site-packages/PyQt5/Qt5/plugins/platforms/libqwayland-generic.so',
   'BINARY'),
  ('PyQt5/Qt5/plugins/wayland-graphics-integration-client/libqt-plugin-wayland-egl.so',
   '/home/marcoslessa/.local/lib/python3.8/site-packages/PyQt5/Qt5/plugins/wayland-graphics-integration-client/libqt-plugin-wayland-egl.so',
   'BINARY'),
  ('PyQt5/Qt5/plugins/wayland-graphics-integration-client/libxcomposite-egl.so',
   '/home/marcoslessa/.local/lib/python3.8/site-packages/PyQt5/Qt5/plugins/wayland-graphics-integration-client/libxcomposite-egl.so',
   'BINARY'),
  ('PyQt5/Qt5/plugins/platforms/libqminimal.so',
   '/home/marcoslessa/.local/lib/python3.8/site-packages/PyQt5/Qt5/plugins/platforms/libqminimal.so',
   'BINARY'),
  ('PyQt5/Qt5/plugins/platforms/libqoffscreen.so',
   '/home/marcoslessa/.local/lib/python3.8/site-packages/PyQt5/Qt5/plugins/platforms/libqoffscreen.so',
   'BINARY'),
  ('PyQt5/Qt5/plugins/wayland-graphics-integration-client/libdrm-egl-server.so',
   '/home/marcoslessa/.local/lib/python3.8/site-packages/PyQt5/Qt5/plugins/wayland-graphics-integration-client/libdrm-egl-server.so',
   'BINARY'),
  ('PyQt5/Qt5/plugins/wayland-graphics-integration-client/libxcomposite-glx.so',
   '/home/marcoslessa/.local/lib/python3.8/site-packages/PyQt5/Qt5/plugins/wayland-graphics-integration-client/libxcomposite-glx.so',
   'BINARY'),
  ('PyQt5/Qt5/plugins/wayland-graphics-integration-client/libdmabuf-server.so',
   '/home/marcoslessa/.local/lib/python3.8/site-packages/PyQt5/Qt5/plugins/wayland-graphics-integration-client/libdmabuf-server.so',
   'BINARY'),
  ('PyQt5/Qt5/plugins/platforminputcontexts/libibusplatforminputcontextplugin.so',
   '/home/marcoslessa/.local/lib/python3.8/site-packages/PyQt5/Qt5/plugins/platforminputcontexts/libibusplatforminputcontextplugin.so',
   'BINARY'),
  ('PyQt5/Qt5/plugins/platformthemes/libqgtk3.so',
   '/home/marcoslessa/.local/lib/python3.8/site-packages/PyQt5/Qt5/plugins/platformthemes/libqgtk3.so',
   'BINARY'),
  ('PyQt5/Qt5/plugins/imageformats/libqtiff.so',
   '/home/marcoslessa/.local/lib/python3.8/site-packages/PyQt5/Qt5/plugins/imageformats/libqtiff.so',
   'BINARY'),
  ('PyQt5/Qt5/plugins/platforms/libqwebgl.so',
   '/home/marcoslessa/.local/lib/python3.8/site-packages/PyQt5/Qt5/plugins/platforms/libqwebgl.so',
   'BINARY'),
  ('PyQt5/Qt5/plugins/iconengines/libqsvgicon.so',
   '/home/marcoslessa/.local/lib/python3.8/site-packages/PyQt5/Qt5/plugins/iconengines/libqsvgicon.so',
   'BINARY'),
  ('PyQt5/Qt5/plugins/wayland-shell-integration/libivi-shell.so',
   '/home/marcoslessa/.local/lib/python3.8/site-packages/PyQt5/Qt5/plugins/wayland-shell-integration/libivi-shell.so',
   'BINARY'),
  ('PyQt5/Qt5/plugins/egldeviceintegrations/libqeglfs-kms-egldevice-integration.so',
   '/home/marcoslessa/.local/lib/python3.8/site-packages/PyQt5/Qt5/plugins/egldeviceintegrations/libqeglfs-kms-egldevice-integration.so',
   'BINARY'),
  ('PyQt5/Qt5/plugins/platformthemes/libqxdgdesktopportal.so',
   '/home/marcoslessa/.local/lib/python3.8/site-packages/PyQt5/Qt5/plugins/platformthemes/libqxdgdesktopportal.so',
   'BINARY'),
  ('PyQt5/Qt5/plugins/platforms/libqvnc.so',
   '/home/marcoslessa/.local/lib/python3.8/site-packages/PyQt5/Qt5/plugins/platforms/libqvnc.so',
   'BINARY'),
  ('PyQt5/Qt5/plugins/imageformats/libqwebp.so',
   '/home/marcoslessa/.local/lib/python3.8/site-packages/PyQt5/Qt5/plugins/imageformats/libqwebp.so',
   'BINARY'),
  ('PyQt5/Qt5/plugins/egldeviceintegrations/libqeglfs-x11-integration.so',
   '/home/marcoslessa/.local/lib/python3.8/site-packages/PyQt5/Qt5/plugins/egldeviceintegrations/libqeglfs-x11-integration.so',
   'BINARY'),
  ('PyQt5/Qt5/plugins/platforminputcontexts/libcomposeplatforminputcontextplugin.so',
   '/home/marcoslessa/.local/lib/python3.8/site-packages/PyQt5/Qt5/plugins/platforminputcontexts/libcomposeplatforminputcontextplugin.so',
   'BINARY'),
  ('PyQt5/Qt5/plugins/wayland-decoration-client/libbradient.so',
   '/home/marcoslessa/.local/lib/python3.8/site-packages/PyQt5/Qt5/plugins/wayland-decoration-client/libbradient.so',
   'BINARY'),
  ('PyQt5/Qt5/plugins/platforms/libqxcb.so',
   '/home/marcoslessa/.local/lib/python3.8/site-packages/PyQt5/Qt5/plugins/platforms/libqxcb.so',
   'BINARY'),
  ('PyQt5/Qt5/plugins/platforms/libqwayland-xcomposite-glx.so',
   '/home/marcoslessa/.local/lib/python3.8/site-packages/PyQt5/Qt5/plugins/platforms/libqwayland-xcomposite-glx.so',
   'BINARY'),
  ('PyQt5/Qt5/plugins/wayland-graphics-integration-client/libshm-emulation-server.so',
   '/home/marcoslessa/.local/lib/python3.8/site-packages/PyQt5/Qt5/plugins/wayland-graphics-integration-client/libshm-emulation-server.so',
   'BINARY'),
  ('PyQt5/Qt5/plugins/imageformats/libqico.so',
   '/home/marcoslessa/.local/lib/python3.8/site-packages/PyQt5/Qt5/plugins/imageformats/libqico.so',
   'BINARY'),
  ('PyQt5/Qt5/plugins/imageformats/libqjpeg.so',
   '/home/marcoslessa/.local/lib/python3.8/site-packages/PyQt5/Qt5/plugins/imageformats/libqjpeg.so',
   'BINARY'),
  ('PyQt5/Qt5/plugins/imageformats/libqgif.so',
   '/home/marcoslessa/.local/lib/python3.8/site-packages/PyQt5/Qt5/plugins/imageformats/libqgif.so',
   'BINARY'),
  ('PyQt5/Qt5/plugins/xcbglintegrations/libqxcb-egl-integration.so',
   '/home/marcoslessa/.local/lib/python3.8/site-packages/PyQt5/Qt5/plugins/xcbglintegrations/libqxcb-egl-integration.so',
   'BINARY'),
  ('PyQt5/Qt5/plugins/wayland-shell-integration/libxdg-shell.so',
   '/home/marcoslessa/.local/lib/python3.8/site-packages/PyQt5/Qt5/plugins/wayland-shell-integration/libxdg-shell.so',
   'BINARY'),
  ('PyQt5/Qt5/plugins/imageformats/libqwbmp.so',
   '/home/marcoslessa/.local/lib/python3.8/site-packages/PyQt5/Qt5/plugins/imageformats/libqwbmp.so',
   'BINARY'),
  ('PyQt5/Qt5/plugins/wayland-shell-integration/libxdg-shell-v5.so',
   '/home/marcoslessa/.local/lib/python3.8/site-packages/PyQt5/Qt5/plugins/wayland-shell-integration/libxdg-shell-v5.so',
   'BINARY'),
  ('PyQt5/Qt5/plugins/imageformats/libqtga.so',
   '/home/marcoslessa/.local/lib/python3.8/site-packages/PyQt5/Qt5/plugins/imageformats/libqtga.so',
   'BINARY'),
  ('lib-dynload/_posixshmem',
   '/usr/lib/python3.8/lib-dynload/_posixshmem.cpython-38-x86_64-linux-gnu.so',
   'EXTENSION'),
  ('lib-dynload/_multiprocessing',
   '/usr/lib/python3.8/lib-dynload/_multiprocessing.cpython-38-x86_64-linux-gnu.so',
   'EXTENSION'),
  ('lib-dynload/_hashlib',
   '/usr/lib/python3.8/lib-dynload/_hashlib.cpython-38-x86_64-linux-gnu.so',
   'EXTENSION'),
  ('lib-dynload/resource',
   '/usr/lib/python3.8/lib-dynload/resource.cpython-38-x86_64-linux-gnu.so',
   'EXTENSION'),
  ('lib-dynload/_lzma',
   '/usr/lib/python3.8/lib-dynload/_lzma.cpython-38-x86_64-linux-gnu.so',
   'EXTENSION'),
  ('lib-dynload/_bz2',
   '/usr/lib/python3.8/lib-dynload/_bz2.cpython-38-x86_64-linux-gnu.so',
   'EXTENSION'),
  ('lib-dynload/termios',
   '/usr/lib/python3.8/lib-dynload/termios.cpython-38-x86_64-linux-gnu.so',
   'EXTENSION'),
  ('lib-dynload/_ssl',
   '/usr/lib/python3.8/lib-dynload/_ssl.cpython-38-x86_64-linux-gnu.so',
   'EXTENSION'),
  ('lib-dynload/_contextvars',
   '/usr/lib/python3.8/lib-dynload/_contextvars.cpython-38-x86_64-linux-gnu.so',
   'EXTENSION'),
  ('lib-dynload/_decimal',
   '/usr/lib/python3.8/lib-dynload/_decimal.cpython-38-x86_64-linux-gnu.so',
   'EXTENSION'),
  ('lib-dynload/mmap',
   '/usr/lib/python3.8/lib-dynload/mmap.cpython-38-x86_64-linux-gnu.so',
   'EXTENSION'),
  ('lib-dynload/_ctypes',
   '/usr/lib/python3.8/lib-dynload/_ctypes.cpython-38-x86_64-linux-gnu.so',
   'EXTENSION'),
  ('lib-dynload/_queue',
   '/usr/lib/python3.8/lib-dynload/_queue.cpython-38-x86_64-linux-gnu.so',
   'EXTENSION'),
  ('lib-dynload/_opcode',
   '/usr/lib/python3.8/lib-dynload/_opcode.cpython-38-x86_64-linux-gnu.so',
   'EXTENSION'),
  ('lib-dynload/_multibytecodec',
   '/usr/lib/python3.8/lib-dynload/_multibytecodec.cpython-38-x86_64-linux-gnu.so',
   'EXTENSION'),
  ('lib-dynload/_codecs_jp',
   '/usr/lib/python3.8/lib-dynload/_codecs_jp.cpython-38-x86_64-linux-gnu.so',
   'EXTENSION'),
  ('lib-dynload/_codecs_kr',
   '/usr/lib/python3.8/lib-dynload/_codecs_kr.cpython-38-x86_64-linux-gnu.so',
   'EXTENSION'),
  ('lib-dynload/_codecs_iso2022',
   '/usr/lib/python3.8/lib-dynload/_codecs_iso2022.cpython-38-x86_64-linux-gnu.so',
   'EXTENSION'),
  ('lib-dynload/_codecs_cn',
   '/usr/lib/python3.8/lib-dynload/_codecs_cn.cpython-38-x86_64-linux-gnu.so',
   'EXTENSION'),
  ('lib-dynload/_codecs_tw',
   '/usr/lib/python3.8/lib-dynload/_codecs_tw.cpython-38-x86_64-linux-gnu.so',
   'EXTENSION'),
  ('lib-dynload/_codecs_hk',
   '/usr/lib/python3.8/lib-dynload/_codecs_hk.cpython-38-x86_64-linux-gnu.so',
   'EXTENSION'),
  ('lib-dynload/_sqlite3',
   '/usr/lib/python3.8/lib-dynload/_sqlite3.cpython-38-x86_64-linux-gnu.so',
   'EXTENSION'),
  ('PyQt5.QtWidgets',
   '/home/marcoslessa/.local/lib/python3.8/site-packages/PyQt5/QtWidgets.abi3.so',
   'EXTENSION'),
  ('PyQt5.QtGui',
   '/home/marcoslessa/.local/lib/python3.8/site-packages/PyQt5/QtGui.abi3.so',
   'EXTENSION'),
  ('PyQt5.QtCore',
   '/home/marcoslessa/.local/lib/python3.8/site-packages/PyQt5/QtCore.abi3.so',
   'EXTENSION'),
  ('PyQt5.sip',
   '/home/marcoslessa/.local/lib/python3.8/site-packages/PyQt5/sip.cpython-38-x86_64-linux-gnu.so',
   'EXTENSION'),
  ('sip',
   '/usr/lib/python3/dist-packages/sip.cpython-38-x86_64-linux-gnu.so',
   'EXTENSION'),
  ('lib-dynload/_json',
   '/usr/lib/python3.8/lib-dynload/_json.cpython-38-x86_64-linux-gnu.so',
   'EXTENSION'),
  ('simplejson._speedups',
   '/usr/lib/python3/dist-packages/simplejson/_speedups.cpython-38-x86_64-linux-gnu.so',
   'EXTENSION'),
  ('_cffi_backend',
   '/usr/lib/python3/dist-packages/_cffi_backend.cpython-38-x86_64-linux-gnu.so',
   'EXTENSION'),
  ('cryptography.hazmat.bindings._openssl',
   '/usr/lib/python3/dist-packages/cryptography/hazmat/bindings/_openssl.abi3.so',
   'EXTENSION'),
  ('cryptography.hazmat.bindings._constant_time',
   '/usr/lib/python3/dist-packages/cryptography/hazmat/bindings/_constant_time.abi3.so',
   'EXTENSION'),
  ('lxml.etree',
   '/home/marcoslessa/.local/lib/python3.8/site-packages/lxml/etree.cpython-38-x86_64-linux-gnu.so',
   'EXTENSION'),
  ('lxml._elementpath',
   '/home/marcoslessa/.local/lib/python3.8/site-packages/lxml/_elementpath.cpython-38-x86_64-linux-gnu.so',
   'EXTENSION'),
  ('lxml.sax',
   '/home/marcoslessa/.local/lib/python3.8/site-packages/lxml/sax.cpython-38-x86_64-linux-gnu.so',
   'EXTENSION'),
  ('lxml.objectify',
   '/home/marcoslessa/.local/lib/python3.8/site-packages/lxml/objectify.cpython-38-x86_64-linux-gnu.so',
   'EXTENSION'),
  ('lxml.html.diff',
   '/home/marcoslessa/.local/lib/python3.8/site-packages/lxml/html/diff.cpython-38-x86_64-linux-gnu.so',
   'EXTENSION'),
  ('lxml.html.clean',
   '/home/marcoslessa/.local/lib/python3.8/site-packages/lxml/html/clean.cpython-38-x86_64-linux-gnu.so',
   'EXTENSION'),
  ('lib-dynload/_asyncio',
   '/usr/lib/python3.8/lib-dynload/_asyncio.cpython-38-x86_64-linux-gnu.so',
   'EXTENSION'),
  ('lib-dynload/readline',
   '/usr/lib/python3.8/lib-dynload/readline.cpython-38-x86_64-linux-gnu.so',
   'EXTENSION'),
  ('lxml.builder',
   '/home/marcoslessa/.local/lib/python3.8/site-packages/lxml/builder.cpython-38-x86_64-linux-gnu.so',
   'EXTENSION'),
  ('libgcc_s.so.1', '/lib/x86_64-linux-gnu/libgcc_s.so.1', 'BINARY'),
  ('libfreetype.so.6', '/lib/x86_64-linux-gnu/libfreetype.so.6', 'BINARY'),
  ('libbsd.so.0', '/lib/x86_64-linux-gnu/libbsd.so.0', 'BINARY'),
  ('libfontconfig.so.1', '/lib/x86_64-linux-gnu/libfontconfig.so.1', 'BINARY'),
  ('libwayland-client.so.0',
   '/lib/x86_64-linux-gnu/libwayland-client.so.0',
   'BINARY'),
  ('libicui18n.so.56',
   '/home/marcoslessa/.local/lib/python3.8/site-packages/PyQt5/Qt5/plugins/wayland-shell-integration/../../lib/libicui18n.so.56',
   'BINARY'),
  ('libgpg-error.so.0', '/lib/x86_64-linux-gnu/libgpg-error.so.0', 'BINARY'),
  ('libsystemd.so.0', '/lib/x86_64-linux-gnu/libsystemd.so.0', 'BINARY'),
  ('libQt5WaylandClient.so.5',
   '/home/marcoslessa/.local/lib/python3.8/site-packages/PyQt5/Qt5/plugins/wayland-shell-integration/../../lib/libQt5WaylandClient.so.5',
   'BINARY'),
  ('libicuuc.so.56',
   '/home/marcoslessa/.local/lib/python3.8/site-packages/PyQt5/Qt5/plugins/wayland-shell-integration/../../lib/libicuuc.so.56',
   'BINARY'),
  ('liblz4.so.1', '/lib/x86_64-linux-gnu/liblz4.so.1', 'BINARY'),
  ('libdbus-1.so.3', '/lib/x86_64-linux-gnu/libdbus-1.so.3', 'BINARY'),
  ('libxkbcommon.so.0', '/lib/x86_64-linux-gnu/libxkbcommon.so.0', 'BINARY'),
  ('libffi.so.7', '/lib/x86_64-linux-gnu/libffi.so.7', 'BINARY'),
  ('libQt5Core.so.5',
   '/home/marcoslessa/.local/lib/python3.8/site-packages/PyQt5/Qt5/plugins/wayland-shell-integration/../../lib/libQt5Core.so.5',
   'BINARY'),
  ('libXau.so.6', '/lib/x86_64-linux-gnu/libXau.so.6', 'BINARY'),
  ('libgthread-2.0.so.0',
   '/lib/x86_64-linux-gnu/libgthread-2.0.so.0',
   'BINARY'),
  ('libgcrypt.so.20', '/lib/x86_64-linux-gnu/libgcrypt.so.20', 'BINARY'),
  ('libXdmcp.so.6', '/lib/x86_64-linux-gnu/libXdmcp.so.6', 'BINARY'),
  ('libicudata.so.56',
   '/home/marcoslessa/.local/lib/python3.8/site-packages/PyQt5/Qt5/plugins/wayland-shell-integration/../../lib/libicudata.so.56',
   'BINARY'),
  ('libQt5Gui.so.5',
   '/home/marcoslessa/.local/lib/python3.8/site-packages/PyQt5/Qt5/plugins/wayland-shell-integration/../../lib/libQt5Gui.so.5',
   'BINARY'),
  ('libbrotlicommon.so.1',
   '/lib/x86_64-linux-gnu/libbrotlicommon.so.1',
   'BINARY'),
  ('libX11.so.6', '/lib/x86_64-linux-gnu/libX11.so.6', 'BINARY'),
  ('libpng16.so.16', '/lib/x86_64-linux-gnu/libpng16.so.16', 'BINARY'),
  ('libglib-2.0.so.0', '/lib/x86_64-linux-gnu/libglib-2.0.so.0', 'BINARY'),
  ('libpcre.so.3', '/lib/x86_64-linux-gnu/libpcre.so.3', 'BINARY'),
  ('liblzma.so.5', '/lib/x86_64-linux-gnu/liblzma.so.5', 'BINARY'),
  ('libQt5DBus.so.5',
   '/home/marcoslessa/.local/lib/python3.8/site-packages/PyQt5/Qt5/plugins/wayland-shell-integration/../../lib/libQt5DBus.so.5',
   'BINARY'),
  ('libbrotlidec.so.1', '/lib/x86_64-linux-gnu/libbrotlidec.so.1', 'BINARY'),
  ('libstdc++.so.6', '/lib/x86_64-linux-gnu/libstdc++.so.6', 'BINARY'),
  ('libuuid.so.1', '/lib/x86_64-linux-gnu/libuuid.so.1', 'BINARY'),
  ('libwayland-cursor.so.0',
   '/lib/x86_64-linux-gnu/libwayland-cursor.so.0',
   'BINARY'),
  ('libxcb-randr.so.0', '/lib/x86_64-linux-gnu/libxcb-randr.so.0', 'BINARY'),
  ('libxcb-xfixes.so.0', '/lib/x86_64-linux-gnu/libxcb-xfixes.so.0', 'BINARY'),
  ('libxcb-sync.so.1', '/lib/x86_64-linux-gnu/libxcb-sync.so.1', 'BINARY'),
  ('libxcb-shm.so.0', '/lib/x86_64-linux-gnu/libxcb-shm.so.0', 'BINARY'),
  ('libxcb-glx.so.0', '/lib/x86_64-linux-gnu/libxcb-glx.so.0', 'BINARY'),
  ('libQt5XcbQpa.so.5',
   '/home/marcoslessa/.local/lib/python3.8/site-packages/PyQt5/Qt5/plugins/xcbglintegrations/../../lib/libQt5XcbQpa.so.5',
   'BINARY'),
  ('libXext.so.6', '/lib/x86_64-linux-gnu/libXext.so.6', 'BINARY'),
  ('libxcb-xinerama.so.0',
   '/lib/x86_64-linux-gnu/libxcb-xinerama.so.0',
   'BINARY'),
  ('libxkbcommon-x11.so.0',
   '/lib/x86_64-linux-gnu/libxkbcommon-x11.so.0',
   'BINARY'),
  ('libxcb-render-util.so.0',
   '/lib/x86_64-linux-gnu/libxcb-render-util.so.0',
   'BINARY'),
  ('libxcb-icccm.so.4', '/lib/x86_64-linux-gnu/libxcb-icccm.so.4', 'BINARY'),
  ('libxcb-xkb.so.1', '/lib/x86_64-linux-gnu/libxcb-xkb.so.1', 'BINARY'),
  ('libxcb-render.so.0', '/lib/x86_64-linux-gnu/libxcb-render.so.0', 'BINARY'),
  ('libxcb-keysyms.so.1',
   '/lib/x86_64-linux-gnu/libxcb-keysyms.so.1',
   'BINARY'),
  ('libxcb-image.so.0', '/lib/x86_64-linux-gnu/libxcb-image.so.0', 'BINARY'),
  ('libX11-xcb.so.1', '/lib/x86_64-linux-gnu/libX11-xcb.so.1', 'BINARY'),
  ('libxcb-util.so.1', '/lib/x86_64-linux-gnu/libxcb-util.so.1', 'BINARY'),
  ('libxcb-shape.so.0', '/lib/x86_64-linux-gnu/libxcb-shape.so.0', 'BINARY'),
  ('libQt5Widgets.so.5',
   '/home/marcoslessa/.local/lib/python3.8/site-packages/PyQt5/Qt5/plugins/imageformats/../../lib/libQt5Widgets.so.5',
   'BINARY'),
  ('libQt5Svg.so.5',
   '/home/marcoslessa/.local/lib/python3.8/site-packages/PyQt5/Qt5/plugins/imageformats/../../lib/libQt5Svg.so.5',
   'BINARY'),
  ('libXcomposite.so.1', '/lib/x86_64-linux-gnu/libXcomposite.so.1', 'BINARY'),
  ('libQt5EglFSDeviceIntegration.so.5',
   '/lib/x86_64-linux-gnu/libQt5EglFSDeviceIntegration.so.5',
   'BINARY'),
  ('libwacom.so.2', '/lib/x86_64-linux-gnu/libwacom.so.2', 'BINARY'),
  ('libgudev-1.0.so.0', '/lib/x86_64-linux-gnu/libgudev-1.0.so.0', 'BINARY'),
  ('libinput.so.10', '/lib/x86_64-linux-gnu/libinput.so.10', 'BINARY'),
  ('libmtdev.so.1', '/lib/x86_64-linux-gnu/libmtdev.so.1', 'BINARY'),
  ('libudev.so.1', '/lib/x86_64-linux-gnu/libudev.so.1', 'BINARY'),
  ('libgobject-2.0.so.0',
   '/lib/x86_64-linux-gnu/libgobject-2.0.so.0',
   'BINARY'),
  ('libevdev.so.2', '/lib/x86_64-linux-gnu/libevdev.so.2', 'BINARY'),
  ('libwayland-egl.so.1',
   '/lib/x86_64-linux-gnu/libwayland-egl.so.1',
   'BINARY'),
  ('libfribidi.so.0', '/lib/x86_64-linux-gnu/libfribidi.so.0', 'BINARY'),
  ('libblkid.so.1', '/lib/x86_64-linux-gnu/libblkid.so.1', 'BINARY'),
  ('libdatrie.so.1', '/lib/x86_64-linux-gnu/libdatrie.so.1', 'BINARY'),
  ('libthai.so.0', '/lib/x86_64-linux-gnu/libthai.so.0', 'BINARY'),
  ('libgdk-3.so.0', '/lib/x86_64-linux-gnu/libgdk-3.so.0', 'BINARY'),
  ('libgdk_pixbuf-2.0.so.0',
   '/lib/x86_64-linux-gnu/libgdk_pixbuf-2.0.so.0',
   'BINARY'),
  ('libmount.so.1', '/lib/x86_64-linux-gnu/libmount.so.1', 'BINARY'),
  ('libpcre2-8.so.0', '/lib/x86_64-linux-gnu/libpcre2-8.so.0', 'BINARY'),
  ('libXfixes.so.3', '/lib/x86_64-linux-gnu/libXfixes.so.3', 'BINARY'),
  ('libepoxy.so.0', '/lib/x86_64-linux-gnu/libepoxy.so.0', 'BINARY'),
  ('libatk-1.0.so.0', '/lib/x86_64-linux-gnu/libatk-1.0.so.0', 'BINARY'),
  ('libpixman-1.so.0', '/lib/x86_64-linux-gnu/libpixman-1.so.0', 'BINARY'),
  ('libXdamage.so.1', '/lib/x86_64-linux-gnu/libXdamage.so.1', 'BINARY'),
  ('libharfbuzz.so.0', '/lib/x86_64-linux-gnu/libharfbuzz.so.0', 'BINARY'),
  ('libatk-bridge-2.0.so.0',
   '/lib/x86_64-linux-gnu/libatk-bridge-2.0.so.0',
   'BINARY'),
  ('libgraphite2.so.3', '/lib/x86_64-linux-gnu/libgraphite2.so.3', 'BINARY'),
  ('libselinux.so.1', '/lib/x86_64-linux-gnu/libselinux.so.1', 'BINARY'),
  ('libpango-1.0.so.0', '/lib/x86_64-linux-gnu/libpango-1.0.so.0', 'BINARY'),
  ('libgtk-3.so.0', '/lib/x86_64-linux-gnu/libgtk-3.so.0', 'BINARY'),
  ('libXrender.so.1', '/lib/x86_64-linux-gnu/libXrender.so.1', 'BINARY'),
  ('libgmodule-2.0.so.0',
   '/lib/x86_64-linux-gnu/libgmodule-2.0.so.0',
   'BINARY'),
  ('libcairo-gobject.so.2',
   '/lib/x86_64-linux-gnu/libcairo-gobject.so.2',
   'BINARY'),
  ('libgio-2.0.so.0', '/lib/x86_64-linux-gnu/libgio-2.0.so.0', 'BINARY'),
  ('libpangoft2-1.0.so.0',
   '/lib/x86_64-linux-gnu/libpangoft2-1.0.so.0',
   'BINARY'),
  ('libatspi.so.0', '/lib/x86_64-linux-gnu/libatspi.so.0', 'BINARY'),
  ('libpangocairo-1.0.so.0',
   '/lib/x86_64-linux-gnu/libpangocairo-1.0.so.0',
   'BINARY'),
  ('libXcursor.so.1', '/lib/x86_64-linux-gnu/libXcursor.so.1', 'BINARY'),
  ('libXrandr.so.2', '/lib/x86_64-linux-gnu/libXrandr.so.2', 'BINARY'),
  ('libXi.so.6', '/lib/x86_64-linux-gnu/libXi.so.6', 'BINARY'),
  ('libcairo.so.2', '/lib/x86_64-linux-gnu/libcairo.so.2', 'BINARY'),
  ('libXinerama.so.1', '/lib/x86_64-linux-gnu/libXinerama.so.1', 'BINARY'),
  ('libQt5WebSockets.so.5',
   '/home/marcoslessa/.local/lib/python3.8/site-packages/PyQt5/Qt5/plugins/platforms/../../lib/libQt5WebSockets.so.5',
   'BINARY'),
  ('libQt5Network.so.5',
   '/home/marcoslessa/.local/lib/python3.8/site-packages/PyQt5/Qt5/plugins/platforms/../../lib/libQt5Network.so.5',
   'BINARY'),
  ('libQt5Quick.so.5',
   '/home/marcoslessa/.local/lib/python3.8/site-packages/PyQt5/Qt5/plugins/platforms/../../lib/libQt5Quick.so.5',
   'BINARY'),
  ('libk5crypto.so.3', '/lib/x86_64-linux-gnu/libk5crypto.so.3', 'BINARY'),
  ('libQt5Qml.so.5',
   '/home/marcoslessa/.local/lib/python3.8/site-packages/PyQt5/Qt5/plugins/platforms/../../lib/libQt5Qml.so.5',
   'BINARY'),
  ('libkrb5support.so.0',
   '/lib/x86_64-linux-gnu/libkrb5support.so.0',
   'BINARY'),
  ('libcom_err.so.2', '/lib/x86_64-linux-gnu/libcom_err.so.2', 'BINARY'),
  ('libQt5QmlModels.so.5',
   '/home/marcoslessa/.local/lib/python3.8/site-packages/PyQt5/Qt5/plugins/platforms/../../lib/libQt5QmlModels.so.5',
   'BINARY'),
  ('libkeyutils.so.1', '/lib/x86_64-linux-gnu/libkeyutils.so.1', 'BINARY'),
  ('libgssapi_krb5.so.2',
   '/lib/x86_64-linux-gnu/libgssapi_krb5.so.2',
   'BINARY'),
  ('libkrb5.so.3', '/lib/x86_64-linux-gnu/libkrb5.so.3', 'BINARY'),
  ('libQt5EglFsKmsSupport.so.5',
   '/lib/x86_64-linux-gnu/libQt5EglFsKmsSupport.so.5',
   'BINARY'),
  ('libcrypto.so.1.1', '/lib/x86_64-linux-gnu/libcrypto.so.1.1', 'BINARY'),
  ('libbz2.so.1.0', '/lib/x86_64-linux-gnu/libbz2.so.1.0', 'BINARY'),
  ('libssl.so.1.1', '/lib/x86_64-linux-gnu/libssl.so.1.1', 'BINARY'),
  ('libmpdec.so.2', '/lib/x86_64-linux-gnu/libmpdec.so.2', 'BINARY'),
  ('libsqlite3.so.0', '/lib/x86_64-linux-gnu/libsqlite3.so.0', 'BINARY'),
  ('libreadline.so.8', '/lib/x86_64-linux-gnu/libreadline.so.8', 'BINARY'),
  ('libtinfo.so.6', '/lib/x86_64-linux-gnu/libtinfo.so.6', 'BINARY'),
  ('libicudata.so.66', '/lib/x86_64-linux-gnu/libicudata.so.66', 'BINARY'),
  ('libicui18n.so.66', '/lib/x86_64-linux-gnu/libicui18n.so.66', 'BINARY'),
  ('libpcre2-16.so.0', '/lib/x86_64-linux-gnu/libpcre2-16.so.0', 'BINARY'),
  ('libicuuc.so.66', '/lib/x86_64-linux-gnu/libicuuc.so.66', 'BINARY'),
  ('libdouble-conversion.so.3',
   '/lib/x86_64-linux-gnu/libdouble-conversion.so.3',
   'BINARY'),
  ('libpython3.8.so.1.0',
   '/lib/x86_64-linux-gnu/libpython3.8.so.1.0',
   'BINARY'),
  ('base_library.zip',
   '/home/marcoslessa/Desktop/crawlex/build/crawlex/base_library.zip',
   'DATA'),
  ('PyQt5/Qt5/translations/qtbase_fi.qm',
   '/home/marcoslessa/.local/lib/python3.8/site-packages/PyQt5/Qt5/translations/qtbase_fi.qm',
   'DATA'),
  ('PyQt5/Qt5/translations/qtbase_cs.qm',
   '/home/marcoslessa/.local/lib/python3.8/site-packages/PyQt5/Qt5/translations/qtbase_cs.qm',
   'DATA'),
  ('cryptography-2.8.egg-info/top_level.txt',
   '/usr/lib/python3/dist-packages/cryptography-2.8.egg-info/top_level.txt',
   'DATA'),
  ('cryptography-2.8.egg-info/PKG-INFO',
   '/usr/lib/python3/dist-packages/cryptography-2.8.egg-info/PKG-INFO',
   'DATA'),
  ('PyQt5/Qt5/translations/qtbase_sk.qm',
   '/home/marcoslessa/.local/lib/python3.8/site-packages/PyQt5/Qt5/translations/qtbase_sk.qm',
   'DATA'),
  ('PyQt5/Qt5/translations/qtbase_es.qm',
   '/home/marcoslessa/.local/lib/python3.8/site-packages/PyQt5/Qt5/translations/qtbase_es.qm',
   'DATA'),
  ('PyQt5/Qt5/translations/qtbase_ru.qm',
   '/home/marcoslessa/.local/lib/python3.8/site-packages/PyQt5/Qt5/translations/qtbase_ru.qm',
   'DATA'),
  ('lxml/isoschematron/resources/xsl/RNG2Schtrn.xsl',
   '/home/marcoslessa/.local/lib/python3.8/site-packages/lxml/isoschematron/resources/xsl/RNG2Schtrn.xsl',
   'DATA'),
  ('lxml/isoschematron/resources/xsl/iso-schematron-xslt1/iso_schematron_skeleton_for_xslt1.xsl',
   '/home/marcoslessa/.local/lib/python3.8/site-packages/lxml/isoschematron/resources/xsl/iso-schematron-xslt1/iso_schematron_skeleton_for_xslt1.xsl',
   'DATA'),
  ('lxml/isoschematron/resources/xsl/XSD2Schtrn.xsl',
   '/home/marcoslessa/.local/lib/python3.8/site-packages/lxml/isoschematron/resources/xsl/XSD2Schtrn.xsl',
   'DATA'),
  ('PyQt5/Qt5/translations/qtbase_ca.qm',
   '/home/marcoslessa/.local/lib/python3.8/site-packages/PyQt5/Qt5/translations/qtbase_ca.qm',
   'DATA'),
  ('PyQt5/Qt5/translations/qtbase_hu.qm',
   '/home/marcoslessa/.local/lib/python3.8/site-packages/PyQt5/Qt5/translations/qtbase_hu.qm',
   'DATA'),
  ('cryptography-2.8.egg-info/dependency_links.txt',
   '/usr/lib/python3/dist-packages/cryptography-2.8.egg-info/dependency_links.txt',
   'DATA'),
  ('PyQt5/Qt5/translations/qtbase_lv.qm',
   '/home/marcoslessa/.local/lib/python3.8/site-packages/PyQt5/Qt5/translations/qtbase_lv.qm',
   'DATA'),
  ('lxml/isoschematron/resources/xsl/iso-schematron-xslt1/iso_dsdl_include.xsl',
   '/home/marcoslessa/.local/lib/python3.8/site-packages/lxml/isoschematron/resources/xsl/iso-schematron-xslt1/iso_dsdl_include.xsl',
   'DATA'),
  ('PyQt5/Qt5/translations/qtbase_tr.qm',
   '/home/marcoslessa/.local/lib/python3.8/site-packages/PyQt5/Qt5/translations/qtbase_tr.qm',
   'DATA'),
  ('PyQt5/Qt5/translations/qtbase_da.qm',
   '/home/marcoslessa/.local/lib/python3.8/site-packages/PyQt5/Qt5/translations/qtbase_da.qm',
   'DATA'),
  ('lxml/isoschematron/resources/xsl/iso-schematron-xslt1/iso_svrl_for_xslt1.xsl',
   '/home/marcoslessa/.local/lib/python3.8/site-packages/lxml/isoschematron/resources/xsl/iso-schematron-xslt1/iso_svrl_for_xslt1.xsl',
   'DATA'),
  ('lxml/isoschematron/resources/xsl/iso-schematron-xslt1/readme.txt',
   '/home/marcoslessa/.local/lib/python3.8/site-packages/lxml/isoschematron/resources/xsl/iso-schematron-xslt1/readme.txt',
   'DATA'),
  ('PyQt5/Qt5/translations/qtbase_gd.qm',
   '/home/marcoslessa/.local/lib/python3.8/site-packages/PyQt5/Qt5/translations/qtbase_gd.qm',
   'DATA'),
  ('PyQt5/Qt5/translations/qtbase_ar.qm',
   '/home/marcoslessa/.local/lib/python3.8/site-packages/PyQt5/Qt5/translations/qtbase_ar.qm',
   'DATA'),
  ('PyQt5/Qt5/translations/qtbase_fr.qm',
   '/home/marcoslessa/.local/lib/python3.8/site-packages/PyQt5/Qt5/translations/qtbase_fr.qm',
   'DATA'),
  ('PyQt5/Qt5/translations/qtbase_ko.qm',
   '/home/marcoslessa/.local/lib/python3.8/site-packages/PyQt5/Qt5/translations/qtbase_ko.qm',
   'DATA'),
  ('lxml/isoschematron/resources/xsl/iso-schematron-xslt1/iso_schematron_message.xsl',
   '/home/marcoslessa/.local/lib/python3.8/site-packages/lxml/isoschematron/resources/xsl/iso-schematron-xslt1/iso_schematron_message.xsl',
   'DATA'),
  ('cryptography-2.8.egg-info/not-zip-safe',
   '/usr/lib/python3/dist-packages/cryptography-2.8.egg-info/not-zip-safe',
   'DATA'),
  ('lxml/isoschematron/resources/rng/iso-schematron.rng',
   '/home/marcoslessa/.local/lib/python3.8/site-packages/lxml/isoschematron/resources/rng/iso-schematron.rng',
   'DATA'),
  ('PyQt5/Qt5/translations/qtbase_uk.qm',
   '/home/marcoslessa/.local/lib/python3.8/site-packages/PyQt5/Qt5/translations/qtbase_uk.qm',
   'DATA'),
  ('PyQt5/Qt5/translations/qtbase_de.qm',
   '/home/marcoslessa/.local/lib/python3.8/site-packages/PyQt5/Qt5/translations/qtbase_de.qm',
   'DATA'),
  ('PyQt5/Qt5/translations/qtbase_en.qm',
   '/home/marcoslessa/.local/lib/python3.8/site-packages/PyQt5/Qt5/translations/qtbase_en.qm',
   'DATA'),
  ('PyQt5/Qt5/translations/qtbase_bg.qm',
   '/home/marcoslessa/.local/lib/python3.8/site-packages/PyQt5/Qt5/translations/qtbase_bg.qm',
   'DATA'),
  ('PyQt5/Qt5/translations/qtbase_it.qm',
   '/home/marcoslessa/.local/lib/python3.8/site-packages/PyQt5/Qt5/translations/qtbase_it.qm',
   'DATA'),
  ('PyQt5/Qt5/translations/qtbase_pl.qm',
   '/home/marcoslessa/.local/lib/python3.8/site-packages/PyQt5/Qt5/translations/qtbase_pl.qm',
   'DATA'),
  ('PyQt5/Qt5/translations/qtbase_zh_TW.qm',
   '/home/marcoslessa/.local/lib/python3.8/site-packages/PyQt5/Qt5/translations/qtbase_zh_TW.qm',
   'DATA'),
  ('certifi/cacert.pem',
   '/usr/lib/python3/dist-packages/certifi/cacert.pem',
   'DATA'),
  ('cryptography-2.8.egg-info/requires.txt',
   '/usr/lib/python3/dist-packages/cryptography-2.8.egg-info/requires.txt',
   'DATA'),
  ('PyQt5/Qt5/translations/qtbase_ja.qm',
   '/home/marcoslessa/.local/lib/python3.8/site-packages/PyQt5/Qt5/translations/qtbase_ja.qm',
   'DATA'),
  ('PyQt5/Qt5/translations/qtbase_he.qm',
   '/home/marcoslessa/.local/lib/python3.8/site-packages/PyQt5/Qt5/translations/qtbase_he.qm',
   'DATA'),
  ('lxml/isoschematron/resources/xsl/iso-schematron-xslt1/iso_abstract_expand.xsl',
   '/home/marcoslessa/.local/lib/python3.8/site-packages/lxml/isoschematron/resources/xsl/iso-schematron-xslt1/iso_abstract_expand.xsl',
   'DATA')],
 [],
 False,
 False,
 1658344787,
 [('run',
   '/home/marcoslessa/.local/lib/python3.8/site-packages/PyInstaller/bootloader/Linux-64bit-intel/run',
   'EXECUTABLE')])
