{
    "openapi": "3.0.0",
    "info": {
        "version": "1.0.0",
        "title": "rpg-pmt-api",
        "description": "REST Api for rpg-pmt-app",
        "license": {
            "name": "MIT",
            "url": "https://opensource.org/licenses/MIT"
        }
    },
    "definitions": {
        
    }
}