<svg xmlns="http://www.w3.org/2000/svg" width="240.027" height="92.657" viewBox="0 0 240.027 92.657">
  <g id="Grupo_2686" data-name="Grupo 2686" transform="translate(-2074.637 -294)">
    <g id="Grupo_651" data-name="Grupo 651" transform="translate(2074.874 294)">
      <path id="Caminho_3853" data-name="Caminho 3853" d="M505.876,252a12.608,12.608,0,0,1-.16,2.454,6.01,6.01,0,0,1-5.99,5.071c-4.12,0-7.1-2.967-7.1-8.1,0-4.481,2.244-8.309,7.168-8.309a6.073,6.073,0,0,1,6,5.051,10.752,10.752,0,0,1,.08,1.6Zm0-34.323v18.784h-.16c-1.871-2.518-5.637-3.449-9.748-3.449-9.108,0-17.345,7.066-17.278,18.925,0,11.852,8.1,18.359,16.4,18.359,4.4,0,9.186-1.521,11.868-6h.139l.508,5.128h12.2c-.135-1.889-.287-6.579-.287-11.208v-40.54Z" transform="translate(-319.67 -207.2)" fill="#58595b" fill-rule="evenodd"/>
      <path id="Caminho_3854" data-name="Caminho 3854" d="M566.718,262.526a8.556,8.556,0,0,1-.145,1.958,5.236,5.236,0,0,1-4.836,3.682c-2.525,0-3.914-1.15-3.914-3.175,0-2.887,2.884-4.418,8.895-4.418Zm13.162-6.639c0-9.539-5.207-15.671-17.42-15.671-7.945,0-13.234,2.085-15.543,3.307l2.39,8.538a24.624,24.624,0,0,1,10.766-2.833c5.352,0,6.22,1.6,6.22,2.9v.21c-13.454,0-21.975,4.407-21.975,13.953,0,5.775,4.626,11.206,12.428,11.206,4.047,0,7.809-1.007,10.415-3.914h.271l.732,3.045h12.282a51.7,51.7,0,0,1-.566-8.823Z" transform="translate(-340.655 -214.408)" fill="#58595b" fill-rule="evenodd"/>
      <path id="Caminho_3855" data-name="Caminho 3855" d="M245.2,252.4c0-5.059-.139-9.185-.28-12.363H256.26l.51,4.547h.292c1.085-1.5,4.194-5.409,11.13-5.409,4.624,0,8.518,2.163,10.176,6h.145A15.9,15.9,0,0,1,283.8,240.7a14.3,14.3,0,0,1,6.715-1.52c7.873,0,12.938,5.5,12.938,15.895v20.522H290.3V257.1c0-4.62-1.595-7.079-4.7-7.079a4.481,4.481,0,0,0-4.343,3.247,9.571,9.571,0,0,0-.362,2.749v19.58H267.751V257.1c0-4.62-1.59-7.079-4.7-7.079a4.6,4.6,0,0,0-4.331,3.184,7.031,7.031,0,0,0-.367,2.66v19.732H245.2Z" transform="translate(-244.921 -214.076)" fill="#f47920" fill-rule="evenodd"/>
      <path id="Caminho_3856" data-name="Caminho 3856" d="M355.52,266.992c-4.407,0-6.435-4.109-6.435-9.181,0-4.609,1.743-9.167,6.506-9.167,4.344,0,6.215,4.193,6.215,9.167,0,5.926-2.32,9.181-6.215,9.181Zm-.141,9.474c11.415,0,20.743-6.937,20.743-19.091,0-10.679-8.17-18.2-19.953-18.2-13.663,0-21.247,8.1-21.247,18.929,0,11.7,9.323,18.358,20.386,18.358Z" transform="translate(-273.699 -214.076)" fill="#f47920" fill-rule="evenodd"/>
      <path id="Caminho_3857" data-name="Caminho 3857" d="M407.506,240.444l4.468,15.393a66.73,66.73,0,0,1,1.739,7.735h.293c.436-2.606.865-4.988,1.582-7.735l4.047-15.393h14.608L420.211,276H406.2l-13.591-35.555Z" transform="translate(-292.146 -214.481)" fill="#f47920" fill-rule="evenodd"/>
      <path id="Caminho_3858" data-name="Caminho 3858" d="M473.954,277.143a39.373,39.373,0,0,1-8.143-24c0-9.971,2.092-19.052,8.2-26l-9.745-5.223c-6.787,8.574-9.379,19.42-9.379,31.218a50.093,50.093,0,0,0,9.379,29.268Z" transform="translate(-312.06 -208.561)" fill="#f47920" fill-rule="evenodd"/>
      <path id="Caminho_3859" data-name="Caminho 3859" d="M486.76,209.3a7.03,7.03,0,1,1-7.027-7.019,7.039,7.039,0,0,1,7.027,7.019" transform="translate(-317.755 -202.277)" fill="#f47920" fill-rule="evenodd"/>
    </g>
    <text id="design_system" data-name="design system" transform="translate(2074.637 381.657)" font-size="20" font-family="Roboto-Bold, Roboto" font-weight="700"><tspan x="0" y="0">design system</tspan></text>
  </g>
</svg>
